@0000 84822009
@0001 00000000
@0002 84822011
@0003 00000001
@0004 84822019
@0005 00000002
@0006 84822021
@0007 00000003
@0008 84822029
@0009 00000004
@000A 84822031
@000B 00000005
@000C 00000000
@000D 00000000
@000E 00000000
@000F 00000000