@0000 00000050
@0001 00000060
@0002 00000070
@0003 00000080
@0004 00000090
@0005 00000000
@0006 00000010
@0007 00000020
@0008 00000030
@0009 00000040
@000A 00000050
@000B 00000060
@000C 00000070
@000D 00000080
@000E 00000090
@000F 00000000