{
   "latitude":[-26.70331940],
   "longitude":[116.67081524],
   "altitude":[400],
   "offsets":
      [[0,0],
       [10000,0],
       [10000,10000],
       [0,10000],
       [5000,1000],
       [6000,3000],
       [2500,8000],
       [7000,4000]]
}