{
   "latitude":[-26.866319833333336],
   "longitude":[116.7237743333333],
   "altitude":[352.5],
   "offsets":
      [[582, -1131],
       [620, -1247],
       [2338, 1591],
       [ 2442, 1520],
       [-2944, -335],
       [-3038, -397]]
}