  -3.4000000e+01
  -3.4000000e+01
  -3.4000000e+01
  -3.4000000e+01
  -3.4000000e+01
  -3.4000000e+01
  -3.4000000e+01
  -3.4000000e+01
  -3.4000000e+01
  -3.4000000e+01
  -3.4000000e+01
  -3.4000000e+01
  -3.4000000e+01
  -3.4000000e+01
  -3.4000000e+01
  -3.4000000e+01
  -3.3000000e+01
  -3.3000000e+01
  -3.3000000e+01
  -3.3000000e+01
  -3.3000000e+01
  -3.3000000e+01
  -3.3000000e+01
  -3.3000000e+01
  -3.3000000e+01
  -3.2000000e+01
  -3.2000000e+01
  -3.2000000e+01
  -3.2000000e+01
  -3.2000000e+01
  -3.2000000e+01
  -3.2000000e+01
  -3.1000000e+01
  -3.1000000e+01
  -3.1000000e+01
  -3.1000000e+01
  -3.1000000e+01
  -3.0000000e+01
  -3.0000000e+01
  -3.0000000e+01
  -3.0000000e+01
  -3.0000000e+01
  -3.0000000e+01
  -2.9000000e+01
  -2.9000000e+01
  -2.9000000e+01
  -2.9000000e+01
  -2.9000000e+01
  -2.8000000e+01
  -2.8000000e+01
  -2.8000000e+01
  -2.8000000e+01
  -2.7000000e+01
  -2.7000000e+01
  -2.7000000e+01
  -2.7000000e+01
  -2.6000000e+01
  -2.6000000e+01
  -2.6000000e+01
  -2.6000000e+01
  -2.6000000e+01
  -2.5000000e+01
  -2.5000000e+01
  -2.5000000e+01
  -2.5000000e+01
  -2.4000000e+01
  -2.4000000e+01
  -2.4000000e+01
  -2.4000000e+01
  -2.3000000e+01
  -2.3000000e+01
  -2.3000000e+01
  -2.2000000e+01
  -2.2000000e+01
  -2.2000000e+01
  -2.2000000e+01
  -2.1000000e+01
  -2.1000000e+01
  -2.1000000e+01
  -2.1000000e+01
  -2.0000000e+01
  -2.0000000e+01
  -2.0000000e+01
  -2.0000000e+01
  -1.9000000e+01
  -1.9000000e+01
  -1.9000000e+01
  -1.8000000e+01
  -1.8000000e+01
  -1.8000000e+01
  -1.8000000e+01
  -1.7000000e+01
  -1.7000000e+01
  -1.7000000e+01
  -1.6000000e+01
  -1.6000000e+01
  -1.6000000e+01
  -1.6000000e+01
  -1.5000000e+01
  -1.5000000e+01
  -1.5000000e+01
  -1.5000000e+01
  -1.4000000e+01
  -1.4000000e+01
  -1.4000000e+01
  -1.3000000e+01
  -1.3000000e+01
  -1.3000000e+01
  -1.3000000e+01
  -1.2000000e+01
  -1.2000000e+01
  -1.2000000e+01
  -1.2000000e+01
  -1.1000000e+01
  -1.1000000e+01
  -1.1000000e+01
  -1.1000000e+01
  -1.0000000e+01
  -1.0000000e+01
  -1.0000000e+01
  -1.0000000e+01
  -9.0000000e+00
  -9.0000000e+00
  -9.0000000e+00
  -9.0000000e+00
  -8.0000000e+00
  -8.0000000e+00
  -8.0000000e+00
  -8.0000000e+00
  -7.0000000e+00
  -7.0000000e+00
  -7.0000000e+00
  -7.0000000e+00
  -6.0000000e+00
  -6.0000000e+00
  -6.0000000e+00
  -6.0000000e+00
  -6.0000000e+00
  -5.0000000e+00
  -5.0000000e+00
  -5.0000000e+00
  -5.0000000e+00
  -5.0000000e+00
  -4.0000000e+00
  -4.0000000e+00
  -4.0000000e+00
  -4.0000000e+00
  -4.0000000e+00
  -3.0000000e+00
  -3.0000000e+00
  -3.0000000e+00
  -3.0000000e+00
  -3.0000000e+00
  -2.0000000e+00
  -2.0000000e+00
  -2.0000000e+00
  -2.0000000e+00
  -2.0000000e+00
  -2.0000000e+00
  -1.0000000e+00
  -1.0000000e+00
  -1.0000000e+00
  -1.0000000e+00
  -1.0000000e+00
  -1.0000000e+00
  -1.0000000e+00
  -0.0000000e+00
  -0.0000000e+00
  -0.0000000e+00
  -0.0000000e+00
   0.0000000e+00
   0.0000000e+00
   0.0000000e+00
   0.0000000e+00
   1.0000000e+00
   1.0000000e+00
   1.0000000e+00
   1.0000000e+00
   1.0000000e+00
   1.0000000e+00
   1.0000000e+00
   1.0000000e+00
   1.0000000e+00
   2.0000000e+00
   2.0000000e+00
   2.0000000e+00
   2.0000000e+00
   2.0000000e+00
   2.0000000e+00
   2.0000000e+00
   2.0000000e+00
   2.0000000e+00
   2.0000000e+00
   2.0000000e+00
   3.0000000e+00
   3.0000000e+00
   3.0000000e+00
   3.0000000e+00
   3.0000000e+00
   3.0000000e+00
   3.0000000e+00
   3.0000000e+00
   3.0000000e+00
   3.0000000e+00
   3.0000000e+00
   3.0000000e+00
   3.0000000e+00
   4.0000000e+00
   4.0000000e+00
   4.0000000e+00
   4.0000000e+00
   4.0000000e+00
   4.0000000e+00
   4.0000000e+00
   4.0000000e+00
   4.0000000e+00
   4.0000000e+00
   4.0000000e+00
   4.0000000e+00
   4.0000000e+00
   4.0000000e+00
   5.0000000e+00
   5.0000000e+00
   5.0000000e+00
   5.0000000e+00
   5.0000000e+00
   5.0000000e+00
   5.0000000e+00
   5.0000000e+00
   5.0000000e+00
   5.0000000e+00
   5.0000000e+00
   6.0000000e+00
   6.0000000e+00
   6.0000000e+00
   6.0000000e+00
   6.0000000e+00
   6.0000000e+00
   6.0000000e+00
   6.0000000e+00
   6.0000000e+00
   7.0000000e+00
   7.0000000e+00
   7.0000000e+00
   7.0000000e+00
   7.0000000e+00
   7.0000000e+00
   7.0000000e+00
   8.0000000e+00
   8.0000000e+00
   8.0000000e+00
   8.0000000e+00
   8.0000000e+00
   9.0000000e+00
   9.0000000e+00
   9.0000000e+00
   9.0000000e+00
   9.0000000e+00
   1.0000000e+01
   1.0000000e+01
   1.0000000e+01
   1.0000000e+01
   1.1000000e+01
   1.1000000e+01
   1.1000000e+01
   1.1000000e+01
   1.2000000e+01
   1.2000000e+01
   1.2000000e+01
   1.3000000e+01
   1.3000000e+01
   1.3000000e+01
   1.4000000e+01
   1.4000000e+01
   1.4000000e+01
   1.5000000e+01
   1.5000000e+01
   1.5000000e+01
   1.6000000e+01
   1.6000000e+01
   1.7000000e+01
   1.7000000e+01
   1.7000000e+01
   1.8000000e+01
   1.8000000e+01
   1.9000000e+01
   1.9000000e+01
   2.0000000e+01
   2.0000000e+01
   2.1000000e+01
   2.1000000e+01
   2.2000000e+01
   2.2000000e+01
   2.3000000e+01
   2.4000000e+01
   2.4000000e+01
   2.5000000e+01
   2.5000000e+01
   2.6000000e+01
   2.7000000e+01
   2.7000000e+01
   2.8000000e+01
   2.9000000e+01
   2.9000000e+01
   3.0000000e+01
   3.1000000e+01
   3.1000000e+01
   3.2000000e+01
   3.3000000e+01
   3.4000000e+01
   3.4000000e+01
   3.5000000e+01
   3.6000000e+01
   3.7000000e+01
   3.8000000e+01
   3.9000000e+01
   3.9000000e+01
   4.0000000e+01
   4.1000000e+01
   4.2000000e+01
   4.3000000e+01
   4.4000000e+01
   4.5000000e+01
   4.6000000e+01
   4.7000000e+01
   4.8000000e+01
   4.9000000e+01
   5.0000000e+01
   5.1000000e+01
   5.2000000e+01
   5.3000000e+01
   5.4000000e+01
   5.5000000e+01
   5.6000000e+01
   5.8000000e+01
   5.9000000e+01
   6.0000000e+01
   6.1000000e+01
   6.2000000e+01
   6.3000000e+01
   6.5000000e+01
   6.6000000e+01
   6.7000000e+01
   6.8000000e+01
   7.0000000e+01
   7.1000000e+01
   7.2000000e+01
   7.4000000e+01
   7.5000000e+01
   7.6000000e+01
   7.8000000e+01
   7.9000000e+01
   8.0000000e+01
   8.2000000e+01
   8.3000000e+01
   8.4000000e+01
   8.6000000e+01
   8.7000000e+01
   8.9000000e+01
   9.0000000e+01
   9.2000000e+01
   9.3000000e+01
   9.5000000e+01
   9.6000000e+01
   9.8000000e+01
   9.9000000e+01
   1.0100000e+02
   1.0200000e+02
   1.0400000e+02
   1.0500000e+02
   1.0700000e+02
   1.0800000e+02
   1.1000000e+02
   1.1200000e+02
   1.1300000e+02
   1.1500000e+02
   1.1600000e+02
   1.1800000e+02
   1.1900000e+02
   1.2100000e+02
   1.2300000e+02
   1.2400000e+02
   1.2600000e+02
   1.2800000e+02
   1.2900000e+02
   1.3100000e+02
   1.3200000e+02
   1.3400000e+02
   1.3600000e+02
   1.3700000e+02
   1.3900000e+02
   1.4100000e+02
   1.4200000e+02
   1.4400000e+02
   1.4500000e+02
   1.4700000e+02
   1.4900000e+02
   1.5000000e+02
   1.5200000e+02
   1.5400000e+02
   1.5500000e+02
   1.5700000e+02
   1.5800000e+02
   1.6000000e+02
   1.6100000e+02
   1.6300000e+02
   1.6500000e+02
   1.6600000e+02
   1.6800000e+02
   1.6900000e+02
   1.7100000e+02
   1.7200000e+02
   1.7400000e+02
   1.7500000e+02
   1.7700000e+02
   1.7800000e+02
   1.7900000e+02
   1.8100000e+02
   1.8200000e+02
   1.8400000e+02
   1.8500000e+02
   1.8600000e+02
   1.8800000e+02
   1.8900000e+02
   1.9000000e+02
   1.9100000e+02
   1.9300000e+02
   1.9400000e+02
   1.9500000e+02
   1.9600000e+02
   1.9700000e+02
   1.9800000e+02
   1.9900000e+02
   2.0000000e+02
   2.0100000e+02
   2.0200000e+02
   2.0300000e+02
   2.0400000e+02
   2.0500000e+02
   2.0600000e+02
   2.0700000e+02
   2.0800000e+02
   2.0800000e+02
   2.0900000e+02
   2.1000000e+02
   2.1000000e+02
   2.1100000e+02
   2.1200000e+02
   2.1200000e+02
   2.1300000e+02
   2.1300000e+02
   2.1300000e+02
   2.1400000e+02
   2.1400000e+02
   2.1400000e+02
   2.1500000e+02
   2.1500000e+02
   2.1500000e+02
   2.1500000e+02
   2.1500000e+02
   2.1500000e+02
   2.1500000e+02
   2.1500000e+02
   2.1400000e+02
   2.1400000e+02
   2.1400000e+02
   2.1400000e+02
   2.1300000e+02
   2.1300000e+02
   2.1200000e+02
   2.1200000e+02
   2.1100000e+02
   2.1000000e+02
   2.0900000e+02
   2.0900000e+02
   2.0800000e+02
   2.0700000e+02
   2.0600000e+02
   2.0500000e+02
   2.0300000e+02
   2.0200000e+02
   2.0100000e+02
   2.0000000e+02
   1.9800000e+02
   1.9700000e+02
   1.9500000e+02
   1.9300000e+02
   1.9200000e+02
   1.9000000e+02
   1.8800000e+02
   1.8600000e+02
   1.8400000e+02
   1.8200000e+02
   1.8000000e+02
   1.7800000e+02
   1.7500000e+02
   1.7300000e+02
   1.7000000e+02
   1.6800000e+02
   1.6500000e+02
   1.6200000e+02
   1.6000000e+02
   1.5700000e+02
   1.5400000e+02
   1.5100000e+02
   1.4800000e+02
   1.4500000e+02
   1.4100000e+02
   1.3800000e+02
   1.3400000e+02
   1.3100000e+02
   1.2700000e+02
   1.2300000e+02
   1.2000000e+02
   1.1600000e+02
   1.1200000e+02
   1.0800000e+02
   1.0400000e+02
   9.9000000e+01
   9.5000000e+01
   9.1000000e+01
   8.6000000e+01
   8.2000000e+01
   7.7000000e+01
   7.2000000e+01
   6.7000000e+01
   6.2000000e+01
   5.7000000e+01
   5.2000000e+01
   4.7000000e+01
   4.2000000e+01
   3.6000000e+01
   3.1000000e+01
   2.5000000e+01
   2.0000000e+01
   1.4000000e+01
   8.0000000e+00
   2.0000000e+00
  -4.0000000e+00
  -1.0000000e+01
  -1.6000000e+01
  -2.2000000e+01
  -2.9000000e+01
  -3.5000000e+01
  -4.2000000e+01
  -4.8000000e+01
  -5.5000000e+01
  -6.2000000e+01
  -6.9000000e+01
  -7.6000000e+01
  -8.3000000e+01
  -9.0000000e+01
  -9.7000000e+01
  -1.0400000e+02
  -1.1200000e+02
  -1.1900000e+02
  -1.2700000e+02
  -1.3400000e+02
  -1.4200000e+02
  -1.5000000e+02
  -1.5800000e+02
  -1.6600000e+02
  -1.7400000e+02
  -1.8200000e+02
  -1.9000000e+02
  -1.9800000e+02
  -2.0600000e+02
  -2.1500000e+02
  -2.2300000e+02
  -2.3200000e+02
  -2.4000000e+02
  -2.4900000e+02
  -2.5800000e+02
  -2.6600000e+02
  -2.7500000e+02
  -2.8400000e+02
  -2.9300000e+02
  -3.0200000e+02
  -3.1100000e+02
  -3.2000000e+02
  -3.2900000e+02
  -3.3900000e+02
  -3.4800000e+02
  -3.5700000e+02
  -3.6700000e+02
  -3.7600000e+02
  -3.8600000e+02
  -3.9500000e+02
  -4.0500000e+02
  -4.1400000e+02
  -4.2400000e+02
  -4.3300000e+02
  -4.4300000e+02
  -4.5300000e+02
  -4.6300000e+02
  -4.7200000e+02
  -4.8200000e+02
  -4.9200000e+02
  -5.0200000e+02
  -5.1200000e+02
  -5.2200000e+02
  -5.3200000e+02
  -5.4200000e+02
  -5.5200000e+02
  -5.6200000e+02
  -5.7200000e+02
  -5.8200000e+02
  -5.9100000e+02
  -6.0100000e+02
  -6.1100000e+02
  -6.2100000e+02
  -6.3100000e+02
  -6.4100000e+02
  -6.5100000e+02
  -6.6100000e+02
  -6.7100000e+02
  -6.8100000e+02
  -6.9100000e+02
  -7.0100000e+02
  -7.1100000e+02
  -7.2000000e+02
  -7.3000000e+02
  -7.4000000e+02
  -7.5000000e+02
  -7.5900000e+02
  -7.6900000e+02
  -7.7800000e+02
  -7.8800000e+02
  -7.9700000e+02
  -8.0700000e+02
  -8.1600000e+02
  -8.2500000e+02
  -8.3500000e+02
  -8.4400000e+02
  -8.5300000e+02
  -8.6200000e+02
  -8.7100000e+02
  -8.8000000e+02
  -8.8800000e+02
  -8.9700000e+02
  -9.0600000e+02
  -9.1400000e+02
  -9.2300000e+02
  -9.3100000e+02
  -9.3900000e+02
  -9.4700000e+02
  -9.5500000e+02
  -9.6300000e+02
  -9.7100000e+02
  -9.7900000e+02
  -9.8600000e+02
  -9.9400000e+02
  -1.0010000e+03
  -1.0080000e+03
  -1.0150000e+03
  -1.0220000e+03
  -1.0290000e+03
  -1.0360000e+03
  -1.0420000e+03
  -1.0480000e+03
  -1.0550000e+03
  -1.0610000e+03
  -1.0670000e+03
  -1.0720000e+03
  -1.0780000e+03
  -1.0830000e+03
  -1.0880000e+03
  -1.0930000e+03
  -1.0980000e+03
  -1.1030000e+03
  -1.1080000e+03
  -1.1120000e+03
  -1.1160000e+03
  -1.1200000e+03
  -1.1240000e+03
  -1.1270000e+03
  -1.1300000e+03
  -1.1340000e+03
  -1.1360000e+03
  -1.1390000e+03
  -1.1420000e+03
  -1.1440000e+03
  -1.1460000e+03
  -1.1480000e+03
  -1.1490000e+03
  -1.1510000e+03
  -1.1520000e+03
  -1.1530000e+03
  -1.1530000e+03
  -1.1540000e+03
  -1.1540000e+03
  -1.1540000e+03
  -1.1530000e+03
  -1.1530000e+03
  -1.1520000e+03
  -1.1510000e+03
  -1.1490000e+03
  -1.1480000e+03
  -1.1460000e+03
  -1.1430000e+03
  -1.1410000e+03
  -1.1380000e+03
  -1.1350000e+03
  -1.1320000e+03
  -1.1280000e+03
  -1.1240000e+03
  -1.1200000e+03
  -1.1160000e+03
  -1.1110000e+03
  -1.1060000e+03
  -1.1000000e+03
  -1.0950000e+03
  -1.0890000e+03
  -1.0820000e+03
  -1.0760000e+03
  -1.0690000e+03
  -1.0620000e+03
  -1.0540000e+03
  -1.0460000e+03
  -1.0380000e+03
  -1.0300000e+03
  -1.0210000e+03
  -1.0120000e+03
  -1.0020000e+03
  -9.9200000e+02
  -9.8200000e+02
  -9.7200000e+02
  -9.6100000e+02
  -9.5000000e+02
  -9.3900000e+02
  -9.2700000e+02
  -9.1500000e+02
  -9.0200000e+02
  -8.8900000e+02
  -8.7600000e+02
  -8.6300000e+02
  -8.4900000e+02
  -8.3500000e+02
  -8.2100000e+02
  -8.0600000e+02
  -7.9100000e+02
  -7.7500000e+02
  -7.5900000e+02
  -7.4300000e+02
  -7.2600000e+02
  -7.1000000e+02
  -6.9200000e+02
  -6.7500000e+02
  -6.5700000e+02
  -6.3900000e+02
  -6.2000000e+02
  -6.0100000e+02
  -5.8200000e+02
  -5.6200000e+02
  -5.4200000e+02
  -5.2200000e+02
  -5.0100000e+02
  -4.8100000e+02
  -4.5900000e+02
  -4.3800000e+02
  -4.1600000e+02
  -3.9300000e+02
  -3.7100000e+02
  -3.4800000e+02
  -3.2400000e+02
  -3.0100000e+02
  -2.7700000e+02
  -2.5300000e+02
  -2.2800000e+02
  -2.0300000e+02
  -1.7800000e+02
  -1.5200000e+02
  -1.2600000e+02
  -1.0000000e+02
  -7.4000000e+01
  -4.7000000e+01
  -2.0000000e+01
   7.0000000e+00
   3.5000000e+01
   6.3000000e+01
   9.1000000e+01
   1.2000000e+02
   1.4900000e+02
   1.7800000e+02
   2.0700000e+02
   2.3700000e+02
   2.6700000e+02
   2.9700000e+02
   3.2800000e+02
   3.5800000e+02
   3.8900000e+02
   4.2000000e+02
   4.5200000e+02
   4.8400000e+02
   5.1600000e+02
   5.4800000e+02
   5.8000000e+02
   6.1300000e+02
   6.4600000e+02
   6.7900000e+02
   7.1200000e+02
   7.4600000e+02
   7.7900000e+02
   8.1300000e+02
   8.4700000e+02
   8.8200000e+02
   9.1600000e+02
   9.5100000e+02
   9.8500000e+02
   1.0200000e+03
   1.0550000e+03
   1.0910000e+03
   1.1260000e+03
   1.1620000e+03
   1.1970000e+03
   1.2330000e+03
   1.2690000e+03
   1.3050000e+03
   1.3410000e+03
   1.3770000e+03
   1.4130000e+03
   1.4500000e+03
   1.4860000e+03
   1.5230000e+03
   1.5590000e+03
   1.5960000e+03
   1.6320000e+03
   1.6690000e+03
   1.7060000e+03
   1.7420000e+03
   1.7790000e+03
   1.8160000e+03
   1.8530000e+03
   1.8890000e+03
   1.9260000e+03
   1.9630000e+03
   2.0000000e+03
   2.0360000e+03
   2.0730000e+03
   2.1090000e+03
   2.1460000e+03
   2.1820000e+03
   2.2180000e+03
   2.2540000e+03
   2.2900000e+03
   2.3260000e+03
   2.3620000e+03
   2.3980000e+03
   2.4330000e+03
   2.4690000e+03
   2.5040000e+03
   2.5390000e+03
   2.5740000e+03
   2.6090000e+03
   2.6430000e+03
   2.6780000e+03
   2.7120000e+03
   2.7460000e+03
   2.7790000e+03
   2.8130000e+03
   2.8460000e+03
   2.8790000e+03
   2.9110000e+03
   2.9440000e+03
   2.9760000e+03
   3.0080000e+03
   3.0390000e+03
   3.0700000e+03
   3.1010000e+03
   3.1310000e+03
   3.1610000e+03
   3.1910000e+03
   3.2200000e+03
   3.2490000e+03
   3.2780000e+03
   3.3060000e+03
   3.3340000e+03
   3.3610000e+03
   3.3880000e+03
   3.4150000e+03
   3.4410000e+03
   3.4660000e+03
   3.4910000e+03
   3.5160000e+03
   3.5400000e+03
   3.5640000e+03
   3.5870000e+03
   3.6090000e+03
   3.6310000e+03
   3.6530000e+03
   3.6740000e+03
   3.6940000e+03
   3.7140000e+03
   3.7330000e+03
   3.7520000e+03
   3.7700000e+03
   3.7870000e+03
   3.8040000e+03
   3.8200000e+03
   3.8360000e+03
   3.8510000e+03
   3.8650000e+03
   3.8790000e+03
   3.8920000e+03
   3.9040000e+03
   3.9150000e+03
   3.9260000e+03
   3.9360000e+03
   3.9460000e+03
   3.9540000e+03
   3.9620000e+03
   3.9690000e+03
   3.9760000e+03
   3.9810000e+03
   3.9860000e+03
   3.9900000e+03
   3.9940000e+03
   3.9960000e+03
   3.9980000e+03
   3.9990000e+03
   3.9990000e+03
   3.9980000e+03
   3.9960000e+03
   3.9940000e+03
   3.9900000e+03
   3.9860000e+03
   3.9810000e+03
   3.9750000e+03
   3.9680000e+03
   3.9600000e+03
   3.9520000e+03
   3.9420000e+03
   3.9320000e+03
   3.9200000e+03
   3.9080000e+03
   3.8950000e+03
   3.8810000e+03
   3.8660000e+03
   3.8490000e+03
   3.8320000e+03
   3.8140000e+03
   3.7960000e+03
   3.7760000e+03
   3.7550000e+03
   3.7330000e+03
   3.7100000e+03
   3.6860000e+03
   3.6610000e+03
   3.6350000e+03
   3.6090000e+03
   3.5810000e+03
   3.5520000e+03
   3.5220000e+03
   3.4910000e+03
   3.4590000e+03
   3.4260000e+03
   3.3920000e+03
   3.3570000e+03
   3.3220000e+03
   3.2840000e+03
   3.2460000e+03
   3.2070000e+03
   3.1670000e+03
   3.1260000e+03
   3.0840000e+03
   3.0410000e+03
   2.9960000e+03
   2.9510000e+03
   2.9050000e+03
   2.8570000e+03
   2.8090000e+03
   2.7590000e+03
   2.7090000e+03
   2.6570000e+03
   2.6050000e+03
   2.5510000e+03
   2.4960000e+03
   2.4410000e+03
   2.3840000e+03
   2.3260000e+03
   2.2670000e+03
   2.2080000e+03
   2.1470000e+03
   2.0850000e+03
   2.0220000e+03
   1.9580000e+03
   1.8930000e+03
   1.8270000e+03
   1.7610000e+03
   1.6930000e+03
   1.6240000e+03
   1.5540000e+03
   1.4830000e+03
   1.4120000e+03
   1.3390000e+03
   1.2650000e+03
   1.1900000e+03
   1.1150000e+03
   1.0380000e+03
   9.6100000e+02
   8.8300000e+02
   8.0300000e+02
   7.2300000e+02
   6.4200000e+02
   5.6000000e+02
   4.7700000e+02
   3.9300000e+02
   3.0900000e+02
   2.2300000e+02
   1.3700000e+02
   5.0000000e+01
  -3.8000000e+01
  -1.2700000e+02
  -2.1600000e+02
  -3.0700000e+02
  -3.9800000e+02
  -4.9000000e+02
  -5.8300000e+02
  -6.7600000e+02
  -7.7000000e+02
  -8.6500000e+02
  -9.6100000e+02
  -1.0570000e+03
  -1.1540000e+03
  -1.2510000e+03
  -1.3500000e+03
  -1.4480000e+03
  -1.5480000e+03
  -1.6480000e+03
  -1.7490000e+03
  -1.8500000e+03
  -1.9520000e+03
  -2.0540000e+03
  -2.1570000e+03
  -2.2610000e+03
  -2.3650000e+03
  -2.4690000e+03
  -2.5740000e+03
  -2.6790000e+03
  -2.7850000e+03
  -2.8910000e+03
  -2.9980000e+03
  -3.1050000e+03
  -3.2120000e+03
  -3.3200000e+03
  -3.4270000e+03
  -3.5360000e+03
  -3.6440000e+03
  -3.7530000e+03
  -3.8620000e+03
  -3.9710000e+03
  -4.0810000e+03
  -4.1900000e+03
  -4.3000000e+03
  -4.4100000e+03
  -4.5200000e+03
  -4.6300000e+03
  -4.7400000e+03
  -4.8510000e+03
  -4.9610000e+03
  -5.0710000e+03
  -5.1810000e+03
  -5.2920000e+03
  -5.4020000e+03
  -5.5120000e+03
  -5.6220000e+03
  -5.7320000e+03
  -5.8410000e+03
  -5.9510000e+03
  -6.0600000e+03
  -6.1690000e+03
  -6.2780000e+03
  -6.3870000e+03
  -6.4950000e+03
  -6.6030000e+03
  -6.7110000e+03
  -6.8180000e+03
  -6.9250000e+03
  -7.0310000e+03
  -7.1370000e+03
  -7.2430000e+03
  -7.3480000e+03
  -7.4520000e+03
  -7.5560000e+03
  -7.6590000e+03
  -7.7620000e+03
  -7.8640000e+03
  -7.9660000e+03
  -8.0670000e+03
  -8.1670000e+03
  -8.2660000e+03
  -8.3650000e+03
  -8.4620000e+03
  -8.5590000e+03
  -8.6560000e+03
  -8.7510000e+03
  -8.8450000e+03
  -8.9390000e+03
  -9.0310000e+03
  -9.1230000e+03
  -9.2130000e+03
  -9.3030000e+03
  -9.3910000e+03
  -9.4780000e+03
  -9.5650000e+03
  -9.6500000e+03
  -9.7340000e+03
  -9.8160000e+03
  -9.8980000e+03
  -9.9780000e+03
  -1.0057000e+04
  -1.0135000e+04
  -1.0211000e+04
  -1.0286000e+04
  -1.0360000e+04
  -1.0432000e+04
  -1.0502000e+04
  -1.0572000e+04
  -1.0639000e+04
  -1.0706000e+04
  -1.0770000e+04
  -1.0833000e+04
  -1.0895000e+04
  -1.0955000e+04
  -1.1013000e+04
  -1.1069000e+04
  -1.1124000e+04
  -1.1177000e+04
  -1.1228000e+04
  -1.1278000e+04
  -1.1325000e+04
  -1.1371000e+04
  -1.1415000e+04
  -1.1457000e+04
  -1.1497000e+04
  -1.1535000e+04
  -1.1571000e+04
  -1.1605000e+04
  -1.1637000e+04
  -1.1667000e+04
  -1.1695000e+04
  -1.1721000e+04
  -1.1745000e+04
  -1.1766000e+04
  -1.1786000e+04
  -1.1803000e+04
  -1.1818000e+04
  -1.1830000e+04
  -1.1841000e+04
  -1.1849000e+04
  -1.1854000e+04
  -1.1858000e+04
  -1.1859000e+04
  -1.1857000e+04
  -1.1854000e+04
  -1.1847000e+04
  -1.1839000e+04
  -1.1827000e+04
  -1.1814000e+04
  -1.1797000e+04
  -1.1779000e+04
  -1.1757000e+04
  -1.1733000e+04
  -1.1707000e+04
  -1.1677000e+04
  -1.1646000e+04
  -1.1611000e+04
  -1.1574000e+04
  -1.1534000e+04
  -1.1491000e+04
  -1.1446000e+04
  -1.1398000e+04
  -1.1347000e+04
  -1.1293000e+04
  -1.1236000e+04
  -1.1177000e+04
  -1.1115000e+04
  -1.1049000e+04
  -1.0981000e+04
  -1.0911000e+04
  -1.0837000e+04
  -1.0760000e+04
  -1.0680000e+04
  -1.0598000e+04
  -1.0512000e+04
  -1.0423000e+04
  -1.0332000e+04
  -1.0237000e+04
  -1.0139000e+04
  -1.0039000e+04
  -9.9350000e+03
  -9.8280000e+03
  -9.7180000e+03
  -9.6050000e+03
  -9.4890000e+03
  -9.3700000e+03
  -9.2480000e+03
  -9.1230000e+03
  -8.9940000e+03
  -8.8630000e+03
  -8.7280000e+03
  -8.5900000e+03
  -8.4490000e+03
  -8.3050000e+03
  -8.1580000e+03
  -8.0070000e+03
  -7.8530000e+03
  -7.6970000e+03
  -7.5370000e+03
  -7.3730000e+03
  -7.2070000e+03
  -7.0370000e+03
  -6.8650000e+03
  -6.6890000e+03
  -6.5100000e+03
  -6.3270000e+03
  -6.1420000e+03
  -5.9530000e+03
  -5.7610000e+03
  -5.5660000e+03
  -5.3680000e+03
  -5.1670000e+03
  -4.9620000e+03
  -4.7540000e+03
  -4.5430000e+03
  -4.3290000e+03
  -4.1120000e+03
  -3.8910000e+03
  -3.6680000e+03
  -3.4410000e+03
  -3.2110000e+03
  -2.9780000e+03
  -2.7420000e+03
  -2.5020000e+03
  -2.2600000e+03
  -2.0150000e+03
  -1.7660000e+03
  -1.5140000e+03
  -1.2600000e+03
  -1.0020000e+03
  -7.4100000e+02
  -4.7700000e+02
  -2.1000000e+02
   5.9000000e+01
   3.3200000e+02
   6.0800000e+02
   8.8700000e+02
   1.1690000e+03
   1.4530000e+03
   1.7410000e+03
   2.0310000e+03
   2.3250000e+03
   2.6210000e+03
   2.9200000e+03
   3.2220000e+03
   3.5270000e+03
   3.8340000e+03
   4.1440000e+03
   4.4570000e+03
   4.7730000e+03
   5.0920000e+03
   5.4130000e+03
   5.7360000e+03
   6.0630000e+03
   6.3920000e+03
   6.7230000e+03
   7.0580000e+03
   7.3940000e+03
   7.7340000e+03
   8.0750000e+03
   8.4190000e+03
   8.7660000e+03
   9.1150000e+03
   9.4660000e+03
   9.8200000e+03
   1.0176000e+04
   1.0534000e+04
   1.0895000e+04
   1.1258000e+04
   1.1623000e+04
   1.1990000e+04
   1.2359000e+04
   1.2730000e+04
   1.3104000e+04
   1.3479000e+04
   1.3857000e+04
   1.4236000e+04
   1.4618000e+04
   1.5001000e+04
   1.5386000e+04
   1.5773000e+04
   1.6162000e+04
   1.6553000e+04
   1.6945000e+04
   1.7339000e+04
   1.7734000e+04
   1.8132000e+04
   1.8531000e+04
   1.8931000e+04
   1.9333000e+04
   1.9736000e+04
   2.0141000e+04
   2.0547000e+04
   2.0954000e+04
   2.1363000e+04
   2.1773000e+04
   2.2184000e+04
   2.2597000e+04
   2.3010000e+04
   2.3425000e+04
   2.3841000e+04
   2.4257000e+04
   2.4675000e+04
   2.5094000e+04
   2.5513000e+04
   2.5933000e+04
   2.6354000e+04
   2.6776000e+04
   2.7199000e+04
   2.7622000e+04
   2.8046000e+04
   2.8470000e+04
   2.8895000e+04
   2.9320000e+04
   2.9746000e+04
   3.0172000e+04
   3.0599000e+04
   3.1026000e+04
   3.1453000e+04
   3.1880000e+04
   3.2307000e+04
   3.2735000e+04
   3.3162000e+04
   3.3590000e+04
   3.4018000e+04
   3.4445000e+04
   3.4872000e+04
   3.5299000e+04
   3.5726000e+04
   3.6153000e+04
   3.6579000e+04
   3.7005000e+04
   3.7431000e+04
   3.7856000e+04
   3.8280000e+04
   3.8704000e+04
   3.9128000e+04
   3.9550000e+04
   3.9972000e+04
   4.0393000e+04
   4.0814000e+04
   4.1233000e+04
   4.1652000e+04
   4.2070000e+04
   4.2486000e+04
   4.2902000e+04
   4.3316000e+04
   4.3730000e+04
   4.4142000e+04
   4.4553000e+04
   4.4962000e+04
   4.5370000e+04
   4.5777000e+04
   4.6183000e+04
   4.6586000e+04
   4.6989000e+04
   4.7389000e+04
   4.7789000e+04
   4.8186000e+04
   4.8582000e+04
   4.8975000e+04
   4.9368000e+04
   4.9758000e+04
   5.0146000e+04
   5.0532000e+04
   5.0916000e+04
   5.1299000e+04
   5.1679000e+04
   5.2057000e+04
   5.2432000e+04
   5.2806000e+04
   5.3177000e+04
   5.3546000e+04
   5.3912000e+04
   5.4276000e+04
   5.4637000e+04
   5.4996000e+04
   5.5353000e+04
   5.5706000e+04
   5.6057000e+04
   5.6406000e+04
   5.6751000e+04
   5.7094000e+04
   5.7434000e+04
   5.7771000e+04
   5.8106000e+04
   5.8437000e+04
   5.8765000e+04
   5.9090000e+04
   5.9412000e+04
   5.9731000e+04
   6.0047000e+04
   6.0360000e+04
   6.0669000e+04
   6.0975000e+04
   6.1278000e+04
   6.1577000e+04
   6.1873000e+04
   6.2166000e+04
   6.2455000e+04
   6.2741000e+04
   6.3023000e+04
   6.3301000e+04
   6.3576000e+04
   6.3847000e+04
   6.4114000e+04
   6.4378000e+04
   6.4638000e+04
   6.4894000e+04
   6.5147000e+04
   6.5395000e+04
   6.5640000e+04
   6.5880000e+04
   6.6117000e+04
   6.6350000e+04
   6.6579000e+04
   6.6803000e+04
   6.7024000e+04
   6.7240000e+04
   6.7453000e+04
   6.7661000e+04
   6.7865000e+04
   6.8065000e+04
   6.8260000e+04
   6.8452000e+04
   6.8639000e+04
   6.8821000e+04
   6.9000000e+04
   6.9174000e+04
   6.9344000e+04
   6.9509000e+04
   6.9670000e+04
   6.9826000e+04
   6.9978000e+04
   7.0125000e+04
   7.0268000e+04
   7.0407000e+04
   7.0541000e+04
   7.0670000e+04
   7.0795000e+04
   7.0915000e+04
   7.1030000e+04
   7.1141000e+04
   7.1247000e+04
   7.1349000e+04
   7.1446000e+04
   7.1538000e+04
   7.1626000e+04
   7.1708000e+04
   7.1787000e+04
   7.1860000e+04
   7.1929000e+04
   7.1993000e+04
   7.2052000e+04
   7.2106000e+04
   7.2156000e+04
   7.2201000e+04
   7.2241000e+04
   7.2276000e+04
   7.2307000e+04
   7.2333000e+04
   7.2353000e+04
   7.2370000e+04
   7.2381000e+04
   7.2387000e+04
   7.2389000e+04
   7.2386000e+04
   7.2378000e+04
   7.2366000e+04
   7.2348000e+04
   7.2326000e+04
   7.2299000e+04
   7.2267000e+04
   7.2230000e+04
   7.2189000e+04
   7.2143000e+04
   7.2092000e+04
   7.2036000e+04
   7.1975000e+04
   7.1910000e+04
   7.1840000e+04
   7.1765000e+04
   7.1686000e+04
   7.1602000e+04
   7.1513000e+04
   7.1419000e+04
   7.1321000e+04
   7.1218000e+04
   7.1110000e+04
   7.0998000e+04
   7.0881000e+04
   7.0760000e+04
   7.0634000e+04
   7.0503000e+04
   7.0368000e+04
   7.0228000e+04
   7.0084000e+04
   6.9935000e+04
   6.9782000e+04
   6.9624000e+04
   6.9462000e+04
   6.9295000e+04
   6.9124000e+04
   6.8949000e+04
   6.8769000e+04
   6.8585000e+04
   6.8397000e+04
   6.8204000e+04
   6.8007000e+04
   6.7806000e+04
   6.7601000e+04
   6.7391000e+04
   6.7177000e+04
   6.6960000e+04
   6.6738000e+04
   6.6512000e+04
   6.6282000e+04
   6.6047000e+04
   6.5809000e+04
   6.5567000e+04
   6.5321000e+04
   6.5072000e+04
   6.4818000e+04
   6.4560000e+04
   6.4299000e+04
   6.4034000e+04
   6.3765000e+04
   6.3493000e+04
   6.3217000e+04
   6.2937000e+04
   6.2654000e+04
   6.2367000e+04
   6.2076000e+04
   6.1782000e+04
   6.1485000e+04
   6.1184000e+04
   6.0880000e+04
   6.0573000e+04
   6.0262000e+04
   5.9948000e+04
   5.9631000e+04
   5.9311000e+04
   5.8987000e+04
   5.8661000e+04
   5.8331000e+04
   5.7999000e+04
   5.7663000e+04
   5.7325000e+04
   5.6983000e+04
   5.6639000e+04
   5.6292000e+04
   5.5943000e+04
   5.5590000e+04
   5.5235000e+04
   5.4878000e+04
   5.4517000e+04
   5.4155000e+04
   5.3789000e+04
   5.3422000e+04
   5.3052000e+04
   5.2679000e+04
   5.2305000e+04
   5.1928000e+04
   5.1548000e+04
   5.1167000e+04
   5.0784000e+04
   5.0398000e+04
   5.0011000e+04
   4.9621000e+04
   4.9230000e+04
   4.8836000e+04
   4.8441000e+04
   4.8044000e+04
   4.7646000e+04
   4.7245000e+04
   4.6843000e+04
   4.6440000e+04
   4.6035000e+04
   4.5628000e+04
   4.5220000e+04
   4.4811000e+04
   4.4400000e+04
   4.3988000e+04
   4.3575000e+04
   4.3160000e+04
   4.2745000e+04
   4.2328000e+04
   4.1910000e+04
   4.1491000e+04
   4.1071000e+04
   4.0651000e+04
   4.0229000e+04
   3.9807000e+04
   3.9384000e+04
   3.8960000e+04
   3.8536000e+04
   3.8111000e+04
   3.7685000e+04
   3.7259000e+04
   3.6832000e+04
   3.6405000e+04
   3.5978000e+04
   3.5550000e+04
   3.5122000e+04
   3.4694000e+04
   3.4266000e+04
   3.3837000e+04
   3.3409000e+04
   3.2980000e+04
   3.2551000e+04
   3.2123000e+04
   3.1695000e+04
   3.1266000e+04
   3.0838000e+04
   3.0411000e+04
   2.9983000e+04
   2.9556000e+04
   2.9129000e+04
   2.8703000e+04
   2.8277000e+04
   2.7852000e+04
   2.7427000e+04
   2.7003000e+04
   2.6580000e+04
   2.6157000e+04
   2.5735000e+04
   2.5314000e+04
   2.4894000e+04
   2.4475000e+04
   2.4056000e+04
   2.3639000e+04
   2.3222000e+04
   2.2807000e+04
   2.2393000e+04
   2.1979000e+04
   2.1568000e+04
   2.1157000e+04
   2.0747000e+04
   2.0339000e+04
   1.9932000e+04
   1.9527000e+04
   1.9123000e+04
   1.8721000e+04
   1.8320000e+04
   1.7920000e+04
   1.7523000e+04
   1.7126000e+04
   1.6732000e+04
   1.6339000e+04
   1.5948000e+04
   1.5559000e+04
   1.5171000e+04
   1.4786000e+04
   1.4402000e+04
   1.4020000e+04
   1.3640000e+04
   1.3262000e+04
   1.2886000e+04
   1.2512000e+04
   1.2141000e+04
   1.1771000e+04
   1.1404000e+04
   1.1038000e+04
   1.0675000e+04
   1.0314000e+04
   9.9560000e+03
   9.6000000e+03
   9.2460000e+03
   8.8940000e+03
   8.5450000e+03
   8.1980000e+03
   7.8540000e+03
   7.5120000e+03
   7.1730000e+03
   6.8360000e+03
   6.5020000e+03
   6.1700000e+03
   5.8410000e+03
   5.5150000e+03
   5.1910000e+03
   4.8700000e+03
   4.5520000e+03
   4.2360000e+03
   3.9230000e+03
   3.6130000e+03
   3.3050000e+03
   3.0010000e+03
   2.6990000e+03
   2.4000000e+03
   2.1040000e+03
   1.8110000e+03
   1.5210000e+03
   1.2330000e+03
   9.4900000e+02
   6.6800000e+02
   3.8900000e+02
   1.1400000e+02
  -1.5900000e+02
  -4.2800000e+02
  -6.9500000e+02
  -9.5800000e+02
  -1.2190000e+03
  -1.4760000e+03
  -1.7300000e+03
  -1.9820000e+03
  -2.2300000e+03
  -2.4750000e+03
  -2.7160000e+03
  -2.9550000e+03
  -3.1910000e+03
  -3.4230000e+03
  -3.6520000e+03
  -3.8790000e+03
  -4.1020000e+03
  -4.3210000e+03
  -4.5380000e+03
  -4.7510000e+03
  -4.9620000e+03
  -5.1690000e+03
  -5.3730000e+03
  -5.5730000e+03
  -5.7710000e+03
  -5.9650000e+03
  -6.1560000e+03
  -6.3440000e+03
  -6.5290000e+03
  -6.7100000e+03
  -6.8880000e+03
  -7.0630000e+03
  -7.2350000e+03
  -7.4040000e+03
  -7.5690000e+03
  -7.7310000e+03
  -7.8900000e+03
  -8.0460000e+03
  -8.1980000e+03
  -8.3480000e+03
  -8.4940000e+03
  -8.6370000e+03
  -8.7770000e+03
  -8.9140000e+03
  -9.0470000e+03
  -9.1780000e+03
  -9.3050000e+03
  -9.4290000e+03
  -9.5500000e+03
  -9.6680000e+03
  -9.7830000e+03
  -9.8940000e+03
  -1.0003000e+04
  -1.0108000e+04
  -1.0211000e+04
  -1.0310000e+04
  -1.0406000e+04
  -1.0500000e+04
  -1.0590000e+04
  -1.0677000e+04
  -1.0761000e+04
  -1.0843000e+04
  -1.0921000e+04
  -1.0996000e+04
  -1.1068000e+04
  -1.1138000e+04
  -1.1204000e+04
  -1.1268000e+04
  -1.1329000e+04
  -1.1387000e+04
  -1.1442000e+04
  -1.1494000e+04
  -1.1543000e+04
  -1.1590000e+04
  -1.1634000e+04
  -1.1675000e+04
  -1.1713000e+04
  -1.1749000e+04
  -1.1782000e+04
  -1.1812000e+04
  -1.1839000e+04
  -1.1864000e+04
  -1.1886000e+04
  -1.1906000e+04
  -1.1923000e+04
  -1.1938000e+04
  -1.1950000e+04
  -1.1959000e+04
  -1.1966000e+04
  -1.1971000e+04
  -1.1973000e+04
  -1.1972000e+04
  -1.1970000e+04
  -1.1964000e+04
  -1.1957000e+04
  -1.1947000e+04
  -1.1935000e+04
  -1.1920000e+04
  -1.1904000e+04
  -1.1885000e+04
  -1.1864000e+04
  -1.1840000e+04
  -1.1815000e+04
  -1.1787000e+04
  -1.1757000e+04
  -1.1725000e+04
  -1.1691000e+04
  -1.1655000e+04
  -1.1617000e+04
  -1.1578000e+04
  -1.1536000e+04
  -1.1492000e+04
  -1.1446000e+04
  -1.1398000e+04
  -1.1349000e+04
  -1.1298000e+04
  -1.1244000e+04
  -1.1190000e+04
  -1.1133000e+04
  -1.1075000e+04
  -1.1014000e+04
  -1.0953000e+04
  -1.0889000e+04
  -1.0824000e+04
  -1.0758000e+04
  -1.0690000e+04
  -1.0620000e+04
  -1.0549000e+04
  -1.0477000e+04
  -1.0403000e+04
  -1.0327000e+04
  -1.0250000e+04
  -1.0172000e+04
  -1.0093000e+04
  -1.0012000e+04
  -9.9300000e+03
  -9.8460000e+03
  -9.7620000e+03
  -9.6760000e+03
  -9.5890000e+03
  -9.5010000e+03
  -9.4120000e+03
  -9.3220000e+03
  -9.2300000e+03
  -9.1380000e+03
  -9.0450000e+03
  -8.9500000e+03
  -8.8550000e+03
  -8.7590000e+03
  -8.6620000e+03
  -8.5640000e+03
  -8.4650000e+03
  -8.3660000e+03
  -8.2660000e+03
  -8.1650000e+03
  -8.0630000e+03
  -7.9600000e+03
  -7.8570000e+03
  -7.7530000e+03
  -7.6490000e+03
  -7.5440000e+03
  -7.4380000e+03
  -7.3320000e+03
  -7.2260000e+03
  -7.1190000e+03
  -7.0110000e+03
  -6.9030000e+03
  -6.7950000e+03
  -6.6860000e+03
  -6.5770000e+03
  -6.4670000e+03
  -6.3580000e+03
  -6.2480000e+03
  -6.1370000e+03
  -6.0270000e+03
  -5.9160000e+03
  -5.8050000e+03
  -5.6940000e+03
  -5.5830000e+03
  -5.4710000e+03
  -5.3600000e+03
  -5.2480000e+03
  -5.1370000e+03
  -5.0250000e+03
  -4.9140000e+03
  -4.8020000e+03
  -4.6910000e+03
  -4.5790000e+03
  -4.4680000e+03
  -4.3570000e+03
  -4.2460000e+03
  -4.1350000e+03
  -4.0240000e+03
  -3.9130000e+03
  -3.8030000e+03
  -3.6930000e+03
  -3.5830000e+03
  -3.4740000e+03
  -3.3640000e+03
  -3.2550000e+03
  -3.1470000e+03
  -3.0380000e+03
  -2.9310000e+03
  -2.8230000e+03
  -2.7160000e+03
  -2.6090000e+03
  -2.5030000e+03
  -2.3980000e+03
  -2.2920000e+03
  -2.1880000e+03
  -2.0830000e+03
  -1.9800000e+03
  -1.8770000e+03
  -1.7740000e+03
  -1.6720000e+03
  -1.5710000e+03
  -1.4700000e+03
  -1.3700000e+03
  -1.2700000e+03
  -1.1720000e+03
  -1.0740000e+03
  -9.7600000e+02
  -8.7900000e+02
  -7.8300000e+02
  -6.8800000e+02
  -5.9300000e+02
  -5.0000000e+02
  -4.0700000e+02
  -3.1400000e+02
  -2.2300000e+02
  -1.3200000e+02
  -4.2000000e+01
   4.7000000e+01
   1.3500000e+02
   2.2200000e+02
   3.0900000e+02
   3.9500000e+02
   4.7900000e+02
   5.6300000e+02
   6.4600000e+02
   7.2800000e+02
   8.0900000e+02
   8.9000000e+02
   9.6900000e+02
   1.0470000e+03
   1.1250000e+03
   1.2010000e+03
   1.2770000e+03
   1.3510000e+03
   1.4250000e+03
   1.4970000e+03
   1.5690000e+03
   1.6400000e+03
   1.7090000e+03
   1.7780000e+03
   1.8450000e+03
   1.9120000e+03
   1.9780000e+03
   2.0420000e+03
   2.1060000e+03
   2.1680000e+03
   2.2300000e+03
   2.2900000e+03
   2.3490000e+03
   2.4080000e+03
   2.4650000e+03
   2.5210000e+03
   2.5770000e+03
   2.6310000e+03
   2.6840000e+03
   2.7360000e+03
   2.7870000e+03
   2.8370000e+03
   2.8860000e+03
   2.9330000e+03
   2.9800000e+03
   3.0260000e+03
   3.0700000e+03
   3.1140000e+03
   3.1560000e+03
   3.1980000e+03
   3.2380000e+03
   3.2780000e+03
   3.3160000e+03
   3.3530000e+03
   3.3890000e+03
   3.4240000e+03
   3.4590000e+03
   3.4920000e+03
   3.5240000e+03
   3.5550000e+03
   3.5850000e+03
   3.6130000e+03
   3.6410000e+03
   3.6680000e+03
   3.6940000e+03
   3.7190000e+03
   3.7430000e+03
   3.7650000e+03
   3.7870000e+03
   3.8080000e+03
   3.8280000e+03
   3.8470000e+03
   3.8640000e+03
   3.8810000e+03
   3.8970000e+03
   3.9120000e+03
   3.9260000e+03
   3.9390000e+03
   3.9510000e+03
   3.9620000e+03
   3.9720000e+03
   3.9820000e+03
   3.9900000e+03
   3.9970000e+03
   4.0040000e+03
   4.0100000e+03
   4.0140000e+03
   4.0180000e+03
   4.0210000e+03
   4.0230000e+03
   4.0240000e+03
   4.0250000e+03
   4.0240000e+03
   4.0230000e+03
   4.0210000e+03
   4.0180000e+03
   4.0140000e+03
   4.0090000e+03
   4.0040000e+03
   3.9980000e+03
   3.9910000e+03
   3.9830000e+03
   3.9740000e+03
   3.9650000e+03
   3.9550000e+03
   3.9440000e+03
   3.9330000e+03
   3.9210000e+03
   3.9080000e+03
   3.8940000e+03
   3.8800000e+03
   3.8650000e+03
   3.8490000e+03
   3.8330000e+03
   3.8160000e+03
   3.7990000e+03
   3.7810000e+03
   3.7620000e+03
   3.7420000e+03
   3.7220000e+03
   3.7020000e+03
   3.6810000e+03
   3.6590000e+03
   3.6360000e+03
   3.6140000e+03
   3.5900000e+03
   3.5660000e+03
   3.5420000e+03
   3.5170000e+03
   3.4910000e+03
   3.4650000e+03
   3.4390000e+03
   3.4120000e+03
   3.3850000e+03
   3.3570000e+03
   3.3290000e+03
   3.3000000e+03
   3.2710000e+03
   3.2420000e+03
   3.2120000e+03
   3.1820000e+03
   3.1510000e+03
   3.1200000e+03
   3.0890000e+03
   3.0570000e+03
   3.0250000e+03
   2.9930000e+03
   2.9600000e+03
   2.9270000e+03
   2.8940000e+03
   2.8610000e+03
   2.8270000e+03
   2.7930000e+03
   2.7590000e+03
   2.7240000e+03
   2.6890000e+03
   2.6540000e+03
   2.6190000e+03
   2.5840000e+03
   2.5480000e+03
   2.5120000e+03
   2.4770000e+03
   2.4400000e+03
   2.4040000e+03
   2.3680000e+03
   2.3310000e+03
   2.2950000e+03
   2.2580000e+03
   2.2210000e+03
   2.1840000e+03
   2.1470000e+03
   2.1100000e+03
   2.0730000e+03
   2.0350000e+03
   1.9980000e+03
   1.9610000e+03
   1.9230000e+03
   1.8860000e+03
   1.8480000e+03
   1.8110000e+03
   1.7740000e+03
   1.7360000e+03
   1.6990000e+03
   1.6610000e+03
   1.6240000e+03
   1.5870000e+03
   1.5490000e+03
   1.5120000e+03
   1.4750000e+03
   1.4380000e+03
   1.4010000e+03
   1.3640000e+03
   1.3270000e+03
   1.2900000e+03
   1.2540000e+03
   1.2170000e+03
   1.1810000e+03
   1.1450000e+03
   1.1080000e+03
   1.0720000e+03
   1.0370000e+03
   1.0010000e+03
   9.6500000e+02
   9.3000000e+02
   8.9500000e+02
   8.6000000e+02
   8.2500000e+02
   7.9000000e+02
   7.5600000e+02
   7.2200000e+02
   6.8800000e+02
   6.5400000e+02
   6.2000000e+02
   5.8700000e+02
   5.5400000e+02
   5.2100000e+02
   4.8800000e+02
   4.5600000e+02
   4.2400000e+02
   3.9200000e+02
   3.6000000e+02
   3.2900000e+02
   2.9800000e+02
   2.6700000e+02
   2.3600000e+02
   2.0600000e+02
   1.7600000e+02
   1.4600000e+02
   1.1700000e+02
   8.8000000e+01
   5.9000000e+01
   3.1000000e+01
   2.0000000e+00
  -2.6000000e+01
  -5.3000000e+01
  -8.0000000e+01
  -1.0700000e+02
  -1.3400000e+02
  -1.6000000e+02
  -1.8600000e+02
  -2.1200000e+02
  -2.3700000e+02
  -2.6200000e+02
  -2.8700000e+02
  -3.1100000e+02
  -3.3500000e+02
  -3.5900000e+02
  -3.8200000e+02
  -4.0500000e+02
  -4.2800000e+02
  -4.5000000e+02
  -4.7200000e+02
  -4.9400000e+02
  -5.1500000e+02
  -5.3600000e+02
  -5.5600000e+02
  -5.7700000e+02
  -5.9600000e+02
  -6.1600000e+02
  -6.3500000e+02
  -6.5400000e+02
  -6.7200000e+02
  -6.9000000e+02
  -7.0800000e+02
  -7.2500000e+02
  -7.4200000e+02
  -7.5800000e+02
  -7.7500000e+02
  -7.9100000e+02
  -8.0600000e+02
  -8.2100000e+02
  -8.3600000e+02
  -8.5000000e+02
  -8.6500000e+02
  -8.7800000e+02
  -8.9200000e+02
  -9.0500000e+02
  -9.1700000e+02
  -9.3000000e+02
  -9.4200000e+02
  -9.5300000e+02
  -9.6500000e+02
  -9.7500000e+02
  -9.8600000e+02
  -9.9600000e+02
  -1.0060000e+03
  -1.0160000e+03
  -1.0250000e+03
  -1.0340000e+03
  -1.0420000e+03
  -1.0500000e+03
  -1.0580000e+03
  -1.0660000e+03
  -1.0730000e+03
  -1.0800000e+03
  -1.0860000e+03
  -1.0920000e+03
  -1.0980000e+03
  -1.1040000e+03
  -1.1090000e+03
  -1.1140000e+03
  -1.1190000e+03
  -1.1230000e+03
  -1.1270000e+03
  -1.1310000e+03
  -1.1340000e+03
  -1.1370000e+03
  -1.1400000e+03
  -1.1420000e+03
  -1.1450000e+03
  -1.1460000e+03
  -1.1480000e+03
  -1.1490000e+03
  -1.1500000e+03
  -1.1510000e+03
  -1.1520000e+03
  -1.1520000e+03
  -1.1520000e+03
  -1.1520000e+03
  -1.1510000e+03
  -1.1500000e+03
  -1.1490000e+03
  -1.1480000e+03
  -1.1460000e+03
  -1.1440000e+03
  -1.1420000e+03
  -1.1400000e+03
  -1.1370000e+03
  -1.1350000e+03
  -1.1320000e+03
  -1.1280000e+03
  -1.1250000e+03
  -1.1210000e+03
  -1.1170000e+03
  -1.1130000e+03
  -1.1090000e+03
  -1.1040000e+03
  -1.0990000e+03
  -1.0940000e+03
  -1.0890000e+03
  -1.0840000e+03
  -1.0780000e+03
  -1.0730000e+03
  -1.0670000e+03
  -1.0610000e+03
  -1.0540000e+03
  -1.0480000e+03
  -1.0410000e+03
  -1.0350000e+03
  -1.0280000e+03
  -1.0210000e+03
  -1.0130000e+03
  -1.0060000e+03
  -9.9900000e+02
  -9.9100000e+02
  -9.8300000e+02
  -9.7500000e+02
  -9.6700000e+02
  -9.5900000e+02
  -9.5000000e+02
  -9.4200000e+02
  -9.3300000e+02
  -9.2500000e+02
  -9.1600000e+02
  -9.0700000e+02
  -8.9800000e+02
  -8.8900000e+02
  -8.8000000e+02
  -8.7000000e+02
  -8.6100000e+02
  -8.5100000e+02
  -8.4200000e+02
  -8.3200000e+02
  -8.2300000e+02
  -8.1300000e+02
  -8.0300000e+02
  -7.9300000e+02
  -7.8300000e+02
  -7.7300000e+02
  -7.6300000e+02
  -7.5300000e+02
  -7.4200000e+02
  -7.3200000e+02
  -7.2200000e+02
  -7.1100000e+02
  -7.0100000e+02
  -6.9000000e+02
  -6.8000000e+02
  -6.6900000e+02
  -6.5900000e+02
  -6.4800000e+02
  -6.3800000e+02
  -6.2700000e+02
  -6.1700000e+02
  -6.0600000e+02
  -5.9500000e+02
  -5.8500000e+02
  -5.7400000e+02
  -5.6300000e+02
  -5.5300000e+02
  -5.4200000e+02
  -5.3200000e+02
  -5.2100000e+02
  -5.1000000e+02
  -5.0000000e+02
  -4.8900000e+02
  -4.7900000e+02
  -4.6800000e+02
  -4.5800000e+02
  -4.4700000e+02
  -4.3700000e+02
  -4.2600000e+02
  -4.1600000e+02
  -4.0500000e+02
  -3.9500000e+02
  -3.8500000e+02
  -3.7500000e+02
  -3.6400000e+02
  -3.5400000e+02
  -3.4400000e+02
  -3.3400000e+02
  -3.2400000e+02
  -3.1400000e+02
  -3.0400000e+02
  -2.9400000e+02
  -2.8500000e+02
  -2.7500000e+02
  -2.6500000e+02
  -2.5600000e+02
  -2.4600000e+02
  -2.3700000e+02
  -2.2700000e+02
  -2.1800000e+02
  -2.0900000e+02
  -2.0000000e+02
  -1.9100000e+02
  -1.8200000e+02
  -1.7300000e+02
  -1.6400000e+02
  -1.5500000e+02
  -1.4600000e+02
  -1.3800000e+02
  -1.2900000e+02
  -1.2100000e+02
  -1.1300000e+02
  -1.0400000e+02
  -9.6000000e+01
  -8.8000000e+01
  -8.0000000e+01
  -7.2000000e+01
  -6.4000000e+01
  -5.7000000e+01
  -4.9000000e+01
  -4.2000000e+01
  -3.4000000e+01
  -2.7000000e+01
  -2.0000000e+01
  -1.3000000e+01
  -6.0000000e+00
   1.0000000e+00
   8.0000000e+00
   1.5000000e+01
   2.2000000e+01
   2.8000000e+01
   3.4000000e+01
   4.1000000e+01
   4.7000000e+01
   5.3000000e+01
   5.9000000e+01
   6.5000000e+01
   7.1000000e+01
   7.7000000e+01
   8.2000000e+01
   8.8000000e+01
   9.3000000e+01
   9.8000000e+01
   1.0300000e+02
   1.0900000e+02
   1.1300000e+02
   1.1800000e+02
   1.2300000e+02
   1.2800000e+02
   1.3200000e+02
   1.3700000e+02
   1.4100000e+02
   1.4500000e+02
   1.4900000e+02
   1.5300000e+02
   1.5700000e+02
   1.6100000e+02
   1.6500000e+02
   1.6900000e+02
   1.7200000e+02
   1.7500000e+02
   1.7900000e+02
   1.8200000e+02
   1.8500000e+02
   1.8800000e+02
   1.9100000e+02
   1.9400000e+02
   1.9700000e+02
   1.9900000e+02
   2.0200000e+02
   2.0400000e+02
   2.0600000e+02
   2.0900000e+02
   2.1100000e+02
   2.1300000e+02
   2.1500000e+02
   2.1700000e+02
   2.1800000e+02
   2.2000000e+02
   2.2200000e+02
   2.2300000e+02
   2.2500000e+02
   2.2600000e+02
   2.2700000e+02
   2.2800000e+02
   2.2900000e+02
   2.3000000e+02
   2.3100000e+02
   2.3200000e+02
   2.3300000e+02
   2.3300000e+02
   2.3400000e+02
   2.3400000e+02
   2.3500000e+02
   2.3500000e+02
   2.3500000e+02
   2.3600000e+02
   2.3600000e+02
   2.3600000e+02
   2.3600000e+02
   2.3600000e+02
   2.3500000e+02
   2.3500000e+02
   2.3500000e+02
   2.3400000e+02
   2.3400000e+02
   2.3400000e+02
   2.3300000e+02
   2.3200000e+02
   2.3200000e+02
   2.3100000e+02
   2.3000000e+02
   2.2900000e+02
   2.2800000e+02
   2.2700000e+02
   2.2600000e+02
   2.2500000e+02
   2.2400000e+02
   2.2300000e+02
   2.2100000e+02
   2.2000000e+02
   2.1900000e+02
   2.1700000e+02
   2.1600000e+02
   2.1400000e+02
   2.1300000e+02
   2.1100000e+02
   2.0900000e+02
   2.0800000e+02
   2.0600000e+02
   2.0400000e+02
   2.0200000e+02
   2.0100000e+02
   1.9900000e+02
   1.9700000e+02
   1.9500000e+02
   1.9300000e+02
   1.9100000e+02
   1.8900000e+02
   1.8700000e+02
   1.8500000e+02
   1.8200000e+02
   1.8000000e+02
   1.7800000e+02
   1.7600000e+02
   1.7400000e+02
   1.7100000e+02
   1.6900000e+02
   1.6700000e+02
   1.6500000e+02
   1.6200000e+02
   1.6000000e+02
   1.5800000e+02
   1.5500000e+02
   1.5300000e+02
   1.5000000e+02
   1.4800000e+02
   1.4500000e+02
   1.4300000e+02
   1.4100000e+02
   1.3800000e+02
   1.3600000e+02
   1.3300000e+02
   1.3100000e+02
   1.2800000e+02
   1.2600000e+02
   1.2300000e+02
   1.2100000e+02
   1.1800000e+02
   1.1600000e+02
   1.1300000e+02
   1.1100000e+02
   1.0800000e+02
   1.0500000e+02
   1.0300000e+02
   1.0000000e+02
   9.8000000e+01
   9.5000000e+01
   9.3000000e+01
   9.0000000e+01
   8.8000000e+01
   8.6000000e+01
   8.3000000e+01
   8.1000000e+01
   7.8000000e+01
   7.6000000e+01
   7.3000000e+01
   7.1000000e+01
   6.8000000e+01
   6.6000000e+01
   6.4000000e+01
   6.1000000e+01
   5.9000000e+01
   5.7000000e+01
   5.4000000e+01
   5.2000000e+01
   5.0000000e+01
   4.8000000e+01
   4.5000000e+01
   4.3000000e+01
   4.1000000e+01
   3.9000000e+01
   3.6000000e+01
   3.4000000e+01
   3.2000000e+01
   3.0000000e+01
   2.8000000e+01
   2.6000000e+01
   2.4000000e+01
   2.2000000e+01
   2.0000000e+01
   1.8000000e+01
   1.6000000e+01
   1.4000000e+01
   1.2000000e+01
   1.0000000e+01
   8.0000000e+00
   7.0000000e+00
   5.0000000e+00
   3.0000000e+00
   1.0000000e+00
  -1.0000000e+00
  -2.0000000e+00
  -4.0000000e+00
  -6.0000000e+00
  -7.0000000e+00
  -9.0000000e+00
  -1.0000000e+01
  -1.2000000e+01
  -1.3000000e+01
  -1.5000000e+01
  -1.6000000e+01
  -1.8000000e+01
  -1.9000000e+01
  -2.0000000e+01
  -2.2000000e+01
  -2.3000000e+01
  -2.4000000e+01
  -2.6000000e+01
  -2.7000000e+01
  -2.8000000e+01
  -2.9000000e+01
  -3.0000000e+01
  -3.2000000e+01
  -3.3000000e+01
  -3.4000000e+01
  -3.5000000e+01
  -3.6000000e+01
  -3.7000000e+01
  -3.8000000e+01
  -3.8000000e+01
  -3.9000000e+01
  -4.0000000e+01
  -4.1000000e+01
  -4.2000000e+01
  -4.3000000e+01
  -4.3000000e+01
  -4.4000000e+01
  -4.5000000e+01
  -4.5000000e+01
  -4.6000000e+01
  -4.7000000e+01
  -4.7000000e+01
  -4.8000000e+01
  -4.8000000e+01
  -4.9000000e+01
  -4.9000000e+01
  -5.0000000e+01
  -5.0000000e+01
  -5.0000000e+01
  -5.1000000e+01
  -5.1000000e+01
  -5.1000000e+01
  -5.2000000e+01
  -5.2000000e+01
  -5.2000000e+01
  -5.2000000e+01
  -5.2000000e+01
  -5.3000000e+01
  -5.3000000e+01
  -5.3000000e+01
  -5.3000000e+01
  -5.3000000e+01
  -5.3000000e+01
  -5.3000000e+01
  -5.3000000e+01
  -5.3000000e+01
  -5.3000000e+01
  -5.3000000e+01
  -5.3000000e+01
  -5.3000000e+01
  -5.2000000e+01
  -5.2000000e+01
  -5.2000000e+01
  -5.2000000e+01
  -5.2000000e+01
  -5.1000000e+01
  -5.1000000e+01
  -5.1000000e+01
  -5.0000000e+01
  -5.0000000e+01
  -5.0000000e+01
  -4.9000000e+01
  -4.9000000e+01
  -4.9000000e+01
  -4.8000000e+01
  -4.8000000e+01
  -4.7000000e+01
  -4.7000000e+01
  -4.6000000e+01
  -4.6000000e+01
  -4.5000000e+01
  -4.5000000e+01
  -4.4000000e+01
  -4.4000000e+01
  -4.3000000e+01
  -4.3000000e+01
  -4.2000000e+01
  -4.1000000e+01
  -4.1000000e+01
  -4.0000000e+01
  -3.9000000e+01
  -3.9000000e+01
  -3.8000000e+01
  -3.7000000e+01
  -3.7000000e+01
  -3.6000000e+01
  -3.5000000e+01
  -3.5000000e+01
  -3.4000000e+01
  -3.3000000e+01
  -3.2000000e+01
  -3.2000000e+01
  -3.1000000e+01
  -3.0000000e+01
  -2.9000000e+01
  -2.8000000e+01
  -2.8000000e+01
  -2.7000000e+01
  -2.6000000e+01
  -2.5000000e+01
  -2.4000000e+01
  -2.4000000e+01
  -2.3000000e+01
  -2.2000000e+01
  -2.1000000e+01
  -2.0000000e+01
  -1.9000000e+01
  -1.9000000e+01
  -1.8000000e+01
  -1.7000000e+01
  -1.6000000e+01
  -1.5000000e+01
  -1.4000000e+01
  -1.3000000e+01
  -1.3000000e+01
  -1.2000000e+01
  -1.1000000e+01
  -1.0000000e+01
  -9.0000000e+00
  -8.0000000e+00
  -7.0000000e+00
  -7.0000000e+00
  -6.0000000e+00
  -5.0000000e+00
  -4.0000000e+00
  -3.0000000e+00
  -2.0000000e+00
  -1.0000000e+00
  -1.0000000e+00
   0.0000000e+00
   1.0000000e+00
   2.0000000e+00
   3.0000000e+00
   4.0000000e+00
   4.0000000e+00
   5.0000000e+00
   6.0000000e+00
   7.0000000e+00
   8.0000000e+00
   8.0000000e+00
   9.0000000e+00
   1.0000000e+01
   1.1000000e+01
   1.2000000e+01
   1.2000000e+01
   1.3000000e+01
   1.4000000e+01
   1.5000000e+01
   1.5000000e+01
   1.6000000e+01
   1.7000000e+01
   1.8000000e+01
   1.8000000e+01
   1.9000000e+01
   2.0000000e+01
   2.0000000e+01
   2.1000000e+01
   2.2000000e+01
   2.2000000e+01
   2.3000000e+01
   2.4000000e+01
   2.4000000e+01
   2.5000000e+01
   2.6000000e+01
   2.6000000e+01
   2.7000000e+01
   2.8000000e+01
   2.8000000e+01
   2.9000000e+01
   2.9000000e+01
   3.0000000e+01
   3.0000000e+01
   3.1000000e+01
   3.1000000e+01
   3.2000000e+01
   3.2000000e+01
   3.3000000e+01
   3.3000000e+01
   3.4000000e+01
   3.4000000e+01
   3.5000000e+01
   3.5000000e+01
   3.6000000e+01
   3.6000000e+01
   3.7000000e+01
   3.7000000e+01
   3.7000000e+01
   3.8000000e+01
   3.8000000e+01
   3.9000000e+01
   3.9000000e+01
   3.9000000e+01
   4.0000000e+01
   4.0000000e+01
   4.0000000e+01
   4.1000000e+01
   4.1000000e+01
   4.1000000e+01
   4.1000000e+01
   4.2000000e+01
   4.2000000e+01
   4.2000000e+01
   4.2000000e+01
   4.3000000e+01
   4.3000000e+01
   4.3000000e+01
   4.3000000e+01
   4.3000000e+01
   4.3000000e+01
   4.4000000e+01
   4.4000000e+01
   4.4000000e+01
   4.4000000e+01
   4.4000000e+01
   4.4000000e+01
   4.4000000e+01
   4.4000000e+01
   4.4000000e+01
   4.4000000e+01
   4.4000000e+01
   4.4000000e+01
   4.5000000e+01
   4.5000000e+01
   4.5000000e+01
   4.4000000e+01
   4.4000000e+01
   4.4000000e+01
   4.4000000e+01
   4.4000000e+01
   4.4000000e+01
   4.4000000e+01
   4.4000000e+01
   4.4000000e+01
   4.4000000e+01
   4.4000000e+01
   4.4000000e+01
   4.4000000e+01
   4.3000000e+01
   4.3000000e+01
   4.3000000e+01
   4.3000000e+01
   4.3000000e+01
   4.3000000e+01
   4.2000000e+01
   4.2000000e+01
   4.2000000e+01
   4.2000000e+01
   4.2000000e+01
   4.1000000e+01
   4.1000000e+01
   4.1000000e+01
   4.1000000e+01
   4.0000000e+01
   4.0000000e+01
   4.0000000e+01
   3.9000000e+01
   3.9000000e+01
   3.9000000e+01
   3.9000000e+01
   3.8000000e+01
   3.8000000e+01
   3.8000000e+01
   3.7000000e+01
   3.7000000e+01
   3.7000000e+01
   3.6000000e+01
   3.6000000e+01
   3.5000000e+01
   3.5000000e+01
   3.5000000e+01
   3.4000000e+01
   3.4000000e+01
   3.3000000e+01
   3.3000000e+01
   3.3000000e+01
   3.2000000e+01
   3.2000000e+01
   3.1000000e+01
   3.1000000e+01
   3.1000000e+01
   3.0000000e+01
   3.0000000e+01
   2.9000000e+01
   2.9000000e+01
   2.8000000e+01
   2.8000000e+01
   2.7000000e+01
   2.7000000e+01
   2.6000000e+01
   2.6000000e+01
   2.5000000e+01
   2.5000000e+01
   2.4000000e+01
   2.4000000e+01
   2.3000000e+01
   2.3000000e+01
   2.2000000e+01
   2.2000000e+01
   2.1000000e+01
   2.1000000e+01
   2.0000000e+01
   2.0000000e+01
   1.9000000e+01
   1.9000000e+01
   1.8000000e+01
   1.8000000e+01
   1.7000000e+01
   1.7000000e+01
   1.6000000e+01
   1.6000000e+01
   1.5000000e+01
   1.5000000e+01
   1.4000000e+01
   1.4000000e+01
   1.3000000e+01
   1.3000000e+01
   1.2000000e+01
   1.1000000e+01
   1.1000000e+01
   1.0000000e+01
   1.0000000e+01
   9.0000000e+00
   9.0000000e+00
   8.0000000e+00
   8.0000000e+00
   7.0000000e+00
   7.0000000e+00
   6.0000000e+00
   6.0000000e+00
   5.0000000e+00
   4.0000000e+00
   4.0000000e+00
   3.0000000e+00
   3.0000000e+00
   2.0000000e+00
   2.0000000e+00
   1.0000000e+00
   1.0000000e+00
   0.0000000e+00
  -0.0000000e+00
  -1.0000000e+00
  -1.0000000e+00
  -2.0000000e+00
  -2.0000000e+00
  -3.0000000e+00
  -3.0000000e+00
  -4.0000000e+00
  -4.0000000e+00
  -5.0000000e+00
  -5.0000000e+00
  -6.0000000e+00
  -6.0000000e+00
  -7.0000000e+00
  -7.0000000e+00
  -8.0000000e+00
  -8.0000000e+00
  -9.0000000e+00
  -9.0000000e+00
  -1.0000000e+01
  -1.0000000e+01
  -1.1000000e+01
  -1.1000000e+01
  -1.2000000e+01
  -1.2000000e+01
  -1.3000000e+01
  -1.3000000e+01
  -1.4000000e+01
  -1.4000000e+01
  -1.4000000e+01
  -1.5000000e+01
  -1.5000000e+01
  -1.6000000e+01
  -1.6000000e+01
  -1.7000000e+01
  -1.7000000e+01
  -1.7000000e+01
  -1.8000000e+01
  -1.8000000e+01
  -1.9000000e+01
  -1.9000000e+01
  -1.9000000e+01
  -2.0000000e+01
  -2.0000000e+01
  -2.1000000e+01
  -2.1000000e+01
  -2.1000000e+01
  -2.2000000e+01
  -2.2000000e+01
  -2.2000000e+01
  -2.3000000e+01
  -2.3000000e+01
  -2.3000000e+01
  -2.4000000e+01
  -2.4000000e+01
  -2.4000000e+01
  -2.5000000e+01
  -2.5000000e+01
  -2.5000000e+01
  -2.6000000e+01
  -2.6000000e+01
  -2.6000000e+01
  -2.7000000e+01
  -2.7000000e+01
  -2.7000000e+01
  -2.7000000e+01
  -2.8000000e+01
  -2.8000000e+01
  -2.8000000e+01
  -2.9000000e+01
  -2.9000000e+01
  -2.9000000e+01
  -2.9000000e+01
  -3.0000000e+01
  -3.0000000e+01
  -3.0000000e+01
  -3.0000000e+01
  -3.0000000e+01
  -3.1000000e+01
  -3.1000000e+01
  -3.1000000e+01
  -3.1000000e+01
  -3.1000000e+01
  -3.2000000e+01
  -3.2000000e+01
  -3.2000000e+01
  -3.2000000e+01
  -3.2000000e+01
  -3.2000000e+01
  -3.3000000e+01
  -3.3000000e+01
  -3.3000000e+01
  -3.3000000e+01
  -3.3000000e+01
  -3.3000000e+01
  -3.3000000e+01
  -3.3000000e+01
  -3.4000000e+01
  -3.4000000e+01
  -3.4000000e+01
  -3.4000000e+01
  -3.4000000e+01
  -3.4000000e+01
  -3.4000000e+01
  -3.4000000e+01
  -3.4000000e+01
  -3.4000000e+01
  -3.4000000e+01
  -3.4000000e+01
  -3.4000000e+01
  -3.4000000e+01
  -3.4000000e+01
  -3.4000000e+01
  -3.4000000e+01
  -3.4000000e+01
  -3.5000000e+01
  -3.5000000e+01
  -3.5000000e+01
  -3.4000000e+01
  -3.4000000e+01
  -3.4000000e+01
