<?xml version="1.0" encoding="UTF-8"?>
<svg width="60px" height="56px" viewBox="0 0 60 56" version="1.1" xmlns="http://www.w3.org/2000/svg" xmlns:xlink="http://www.w3.org/1999/xlink">
    <!-- Generator: Sketch 47.1 (45422) - http://www.bohemiancoding.com/sketch -->
    <title>Icons/Flourishes/SingleCover</title>
    <desc>Created with Sketch.</desc>
    <defs></defs>
    <g id="Products" stroke="none" stroke-width="1" fill="none" fill-rule="evenodd">
        <g id="Products---desktop---life-insurance" transform="translate(-608.000000, -4208.000000)">
            <g id="Icons/Flourishes/SingleCover" transform="translate(609.000000, 4209.000000)">
                <g id="Page-1">
                    <path d="M31.5255549,32.8008522 C36.8605408,36.1175478 40.4066817,42.0027652 40.4066817,48.7105043 L40.4066817,53.6096348" id="Stroke-1" stroke="#46616E" stroke-width="2" stroke-linecap="round" stroke-linejoin="round"></path>
                    <path d="M2.58507042,53.6087739 L2.58507042,48.7096435 C2.58507042,42.0191217 6.11385915,36.1464261 11.4251831,32.8250348" id="Stroke-3" stroke="#46616E" stroke-width="2" stroke-linecap="round" stroke-linejoin="round"></path>
                    <path d="M27.5195042,19.6138174 C28.5614197,19.6138174 29.4069408,20.4519913 29.4069408,21.4858174 C29.4069408,22.5196435 28.5614197,23.3578174 27.5195042,23.3578174 C26.4775887,23.3578174 25.6328563,22.5196435 25.6328563,21.4858174 C25.6328563,20.4519913 26.4775887,19.6138174 27.5195042,19.6138174" id="Fill-5" fill="#46616E"></path>
                    <path d="M15.3264901,19.6138174 C16.3684056,19.6138174 17.2139268,20.4519913 17.2139268,21.4858174 C17.2139268,22.5196435 16.3684056,23.3578174 15.3264901,23.3578174 C14.2845746,23.3578174 13.4398423,22.5196435 13.4398423,21.4858174 C13.4398423,20.4519913 14.2845746,19.6138174 15.3264901,19.6138174" id="Fill-7" fill="#46616E"></path>
                    <path d="M23.952462,29.7181565 C23.6211944,30.4827652 22.8513915,31.2481565 21.4924056,31.2481565 C20.132631,31.2481565 19.2886873,30.4835478 19.033138,29.7189391" id="Stroke-9" stroke="#46616E" stroke-width="2" stroke-linecap="round"></path>
                    <path d="M21.4614873,21.267313 C21.4614873,21.267313 20.5205296,23.1166174 20.5205296,26.0545304 L22.9758535,26.0545304" id="Stroke-11" stroke="#46616E" stroke-width="2" stroke-linecap="round" stroke-linejoin="round"></path>
                    <path d="M42.9852845,38.8133217 C38.3838197,38.8133217 38.8933408,34.0738435 38.8933408,34.0738435 L38.8933408,17.1812348 C38.8933408,7.69210435 31.1401014,-0.000156521739 21.5767211,-0.000156521739 C12.0133408,-0.000156521739 4.26246761,7.69210435 4.26246761,17.1812348 L4.26246761,34.0730609 C4.26246761,34.0730609 4.86427042,38.8125391 0.000157746479,38.8125391" id="Stroke-13" stroke="#46616E" stroke-width="2" stroke-linecap="round"></path>
                    <path d="M35.6895099,16.4738348 L23.5296225,16.4738348 C14.8141296,16.4738348 13.4401577,9.59626957 13.4401577,9.59626957 C13.4401577,9.59626957 7.23362254,11.8134 7.23362254,19.297487 L7.23362254,22.8200087 C7.23362254,30.6163565 13.6034254,36.937487 21.4615662,36.937487 C29.319707,36.937487 35.6895099,30.6163565 35.6895099,22.8200087 L35.6895099,16.4738348" id="Stroke-15" stroke="#46616E" stroke-width="2" stroke-linecap="round" stroke-linejoin="round"></path>
                </g>
                <g id="Group-15-Copy" transform="translate(44.957746, 6.260870)" stroke="#CDDC29">
                    <ellipse id="Oval-2-Copy-6" stroke-width="2.12550018" cx="1.57746479" cy="16.4347826" rx="2.64021488" ry="2.62796748"></ellipse>
                    <ellipse id="Oval-2-Copy-6" stroke-width="2.12550018" cx="9.85915493" cy="1.17391304" rx="2.24584868" ry="2.23666313"></ellipse>
                </g>
            </g>
        </g>
    </g>
</svg>