<?xml version="1.0" encoding="UTF-8"?>
<svg width="240px" height="120px" viewBox="0 0 240 120" version="1.1" xmlns="http://www.w3.org/2000/svg" xmlns:xlink="http://www.w3.org/1999/xlink">
    <!-- Generator: Sketch 48.2 (47327) - http://www.bohemiancoding.com/sketch -->
    <title>Flourishes/Medium/Pensions/Pensions-Timeline3-240x120</title>
    <desc>Created with Sketch.</desc>
    <defs></defs>
    <g id="Symbols" stroke="none" stroke-width="1" fill="none" fill-rule="evenodd">
        <g id="Flourishes/Medium/Pensions/Pensions-Timeline3-240x120">
            <g id="Page-1" transform="translate(37.000000, 10.000000)">
                <path d="M109.564706,22.8752941 L104.590588,29.6635294 C104.270588,30.1 103.549412,30.4564706 102.985882,30.4564706 L65.8141176,30.4564706" id="Stroke-1" stroke="#C5CFD1" stroke-width="2"></path>
                <path d="M105.175882,31.2864706 C104.853529,31.7523529 104.125294,32.1323529 103.560588,32.1323529 L66.1582353,32.1323529 C65.5923529,32.1323529 65.1288235,31.6688235 65.1288235,31.1029412 L65.1288235,15.6617647 C65.1288235,15.0958824 65.5923529,14.6323529 66.1582353,14.6323529 L103.560588,14.6323529 C104.125294,14.6323529 104.859412,15.0088235 105.191176,15.4676471 L110.164118,22.3758824 C110.494706,22.8347059 110.501765,23.5923529 110.180588,24.0570588 L105.175882,31.2864706 Z" id="Stroke-3" stroke="#46616E" stroke-width="1.6" stroke-linecap="round" stroke-linejoin="round"></path>
                <g id="Group-8" transform="translate(70.588235, 20.475529)">
                    <path d="M1.06047059,0.332941176 L19.9322353,0.332941176" id="Fill-5" fill="#46616E"></path>
                    <path d="M1.06047059,0.332941176 L19.9322353,0.332941176" id="Stroke-7" stroke="#46616E" stroke-width="1.6" stroke-linecap="round" stroke-linejoin="round"></path>
                </g>
                <g id="Group-12" transform="translate(95.294118, 20.475529)">
                    <path d="M1.06047059,0.332941176 L3.46164706,0.332941176" id="Fill-9" fill="#46616E"></path>
                    <path d="M1.06047059,0.332941176 L3.46164706,0.332941176" id="Stroke-11" stroke="#46616E" stroke-width="1.6" stroke-linecap="round" stroke-linejoin="round"></path>
                </g>
                <path d="M51.5695294,46.5517647 L56.5436471,53.34 C56.8636471,53.7764706 57.5848235,54.1329412 58.1483529,54.1329412 L95.3201176,54.1329412" id="Stroke-13" stroke="#C5CFD1" stroke-width="2"></path>
                <path d="M55.9582353,54.9629412 C56.2805882,55.4288235 57.0088235,55.8088235 57.5735294,55.8088235 L94.9758824,55.8088235 C95.5417647,55.8088235 96.0052941,55.3452941 96.0052941,54.7794118 L96.0052941,39.3382353 C96.0052941,38.7723529 95.5417647,38.3088235 94.9758824,38.3088235 L57.5735294,38.3088235 C57.0088235,38.3088235 56.2747059,38.6852941 55.9429412,39.1441176 L50.97,46.0523529 C50.6394118,46.5111765 50.6323529,47.2688235 50.9535294,47.7335294 L55.9582353,54.9629412 Z" id="Stroke-15" stroke="#46616E" stroke-width="1.6" stroke-linecap="round" stroke-linejoin="round"></path>
                <g id="Group-20" transform="translate(70.588235, 44.004941)">
                    <path d="M18.8971765,0.48 L0.0254117647,0.48" id="Fill-17" fill="#46616E"></path>
                    <path d="M18.8971765,0.48 L0.0254117647,0.48" id="Stroke-19" stroke="#46616E" stroke-width="1.6" stroke-linecap="round" stroke-linejoin="round"></path>
                </g>
                <g id="Group-24" transform="translate(62.352941, 44.004941)">
                    <path d="M2.42658824,0.48 L0.0254117647,0.48" id="Fill-21" fill="#46616E"></path>
                    <path d="M2.42658824,0.48 L0.0254117647,0.48" id="Stroke-23" stroke="#46616E" stroke-width="1.6" stroke-linecap="round" stroke-linejoin="round"></path>
                </g>
                <polyline id="Stroke-25" stroke="#46616E" stroke-width="1.6" stroke-linecap="round" stroke-linejoin="round" points="78.4134118 38.0637647 78.4134118 33.652 78.4134118 32.4755294"></polyline>
                <polyline id="Stroke-27" stroke="#46616E" stroke-width="1.6" stroke-linecap="round" stroke-linejoin="round" points="83.1192941 56.2990588 83.1192941 90.7108235 78.4134118 90.7108235 78.4134118 56.0049412"></polyline>
                <path d="M83.1192941,32.4755294 L83.1192941,38.3578824" id="Stroke-29" stroke="#46616E" stroke-width="1.6" stroke-linecap="round" stroke-linejoin="round"></path>
                <path d="M78.4134118,13.9461176 L78.4134118,9.092 C78.4134118,8.68611765 78.7416471,8.35788235 79.1475294,8.35788235 L82.3851765,8.35788235 C82.7910588,8.35788235 83.1192941,8.68611765 83.1192941,9.092 L83.1192941,13.9461176" id="Stroke-31" stroke="#46616E" stroke-width="1.6" stroke-linecap="round" stroke-linejoin="round"></path>
                <path d="M83.7214118,85.442 C94.4967059,85.9431765 102.770824,88.8902353 102.770824,92.4502353 C102.770824,96.3631765 92.7825882,99.5349412 80.4614118,99.5349412 C68.1414118,99.5349412 58.1531765,96.3631765 58.1531765,92.4502353 C58.1531765,88.8243529 66.7355294,85.8337647 77.8049412,85.4172941" id="Stroke-33" stroke="#46616E" stroke-width="1.6" stroke-linecap="round" stroke-linejoin="round"></path>
                <path d="M76.7371765,71.8378824 C52.2689412,64.3625882 28.0548235,57.2755294 0.940705882,59.4096471" id="Stroke-35" stroke="#46616E" stroke-width="1.6" stroke-linecap="round" stroke-linejoin="round"></path>
                <path d="M116.121412,79.8342353 C105.173176,78.6765882 94.4343529,76.6554118 83.8755294,73.8883529" id="Stroke-37" stroke="#46616E" stroke-width="1.6" stroke-linecap="round" stroke-linejoin="round"></path>
                <g id="Group-42" transform="translate(15.294118, 22.828471)">
                    <path d="M0.105764706,5.04341176 C1.57752941,2.63870588 4.22929412,1.034 7.25517647,1.034 C11.8810588,1.034 15.6304706,4.78341176 15.6304706,9.40929412 C15.6304706,14.0351765 11.8810588,17.7845882 7.25517647,17.7845882 C5.23988235,17.7845882 3.39164706,17.074 1.94694118,15.8881176" id="Fill-39" fill="#CDDE00"></path>
                    <path d="M0.105764706,5.04341176 C1.57752941,2.63870588 4.22929412,1.034 7.25517647,1.034 C11.8810588,1.034 15.6304706,4.78341176 15.6304706,9.40929412 C15.6304706,14.0351765 11.8810588,17.7845882 7.25517647,17.7845882 C5.23988235,17.7845882 3.39164706,17.074 1.94694118,15.8881176" id="Stroke-41" stroke="#46616E" stroke-width="1.6" stroke-linecap="round" stroke-linejoin="round"></path>
                </g>
                <path d="M16.4051765,37.194 C16.7169412,36.4304706 16.8910588,35.5881176 16.8910588,34.7034118 C16.8910588,32.7187059 16.0228235,30.9516471 14.6675294,29.7975294 C15.0134118,29.1445882 15.2134118,28.3916471 15.2134118,27.5892941 C15.2134118,25.0892941 13.2981176,23.0634118 10.9369412,23.0634118 C8.57341176,23.0634118 6.65811765,25.0892941 6.65811765,27.5892941 C6.65811765,28.3916471 6.85811765,29.1445882 7.20517647,29.7975294 C5.84988235,30.9516471 4.98164706,32.7187059 4.98164706,34.7034118 C4.98164706,35.5881176 5.15458824,36.4304706 5.46635294,37.194 C4.65694118,38.374 4.17223529,39.8210588 4.17223529,41.3916471 C4.17223529,45.3445882 7.20047059,48.5469412 10.9369412,48.5469412 C14.6710588,48.5469412 17.7004706,45.3445882 17.7004706,41.3916471 C17.7004706,39.8210588 17.2157647,38.374 16.4051765,37.194 Z" id="Stroke-43" stroke="#46616E" stroke-width="1.6" stroke-linecap="round" stroke-linejoin="round"></path>
                <path d="M10.9364706,36.0577647 L10.9364706,58.686" id="Stroke-45" stroke="#46616E" stroke-width="1.6" stroke-linecap="round" stroke-linejoin="round"></path>
                <path d="M22.1037647,30.7682353 L22.1037647,59.3564706" id="Stroke-47" stroke="#46616E" stroke-width="1.6" stroke-linecap="round" stroke-linejoin="round"></path>
                <path d="M19.4635294,33.8542353 L22.0105882,36.7436471" id="Stroke-49" stroke="#46616E" stroke-width="1.6" stroke-linecap="round" stroke-linejoin="round"></path>
                <path d="M26.3695294,32.1389412 L22.3530588,35.8612941" id="Stroke-51" stroke="#46616E" stroke-width="1.6" stroke-linecap="round" stroke-linejoin="round"></path>
                <path d="M35.1368235,47.0447059 C35.1368235,49.7494118 32.9438824,51.9423529 30.2391765,51.9423529 C27.5332941,51.9423529 25.3415294,49.7494118 25.3415294,47.0447059 C25.3415294,44.3388235 27.5332941,42.1470588 30.2391765,42.1470588 C32.9438824,42.1470588 35.1368235,44.3388235 35.1368235,47.0447059" id="Fill-53" fill="#70B544"></path>
                <path d="M35.1368235,47.0447059 C35.1368235,49.7494118 32.9438824,51.9423529 30.2391765,51.9423529 C27.5332941,51.9423529 25.3415294,49.7494118 25.3415294,47.0447059 C25.3415294,44.3388235 27.5332941,42.1470588 30.2391765,42.1470588 C32.9438824,42.1470588 35.1368235,44.3388235 35.1368235,47.0447059 Z" id="Stroke-55" stroke="#46616E" stroke-width="1.6" stroke-linecap="round" stroke-linejoin="round"></path>
                <path d="M29.9782353,46.1852941 L29.9782353,59.5794118" id="Stroke-57" stroke="#46616E" stroke-width="1.6" stroke-linecap="round" stroke-linejoin="round"></path>
                <path d="M28.4341176,47.9902353 L29.9247059,49.6796471" id="Stroke-59" stroke="#46616E" stroke-width="1.6" stroke-linecap="round" stroke-linejoin="round"></path>
                <path d="M31.944,47.5847059 L30.124,49.1647059" id="Stroke-61" stroke="#46616E" stroke-width="1.6" stroke-linecap="round" stroke-linejoin="round"></path>
                <path d="M129.340588,22.0952941 C129.340588,19.4035294 131.521765,17.2223529 134.213529,17.2223529 C134.707647,17.2223529 135.184118,17.2964706 135.633529,17.4329412 C135.502941,16.8788235 135.433529,16.3011765 135.433529,15.7070588 C135.433529,11.5317647 138.819412,8.14470588 142.995882,8.14470588 C146.832353,8.14470588 149.999412,11 150.492353,14.7011765 C150.607647,14.6929412 150.726471,14.6870588 150.844118,14.6870588 C153.534706,14.6870588 155.717059,16.8682353 155.717059,19.56 C155.717059,19.7388235 155.706471,19.9164706 155.688824,20.0917647 L157.092353,20.0917647 C158.982941,20.0917647 160.531176,21.6376471 160.531176,23.5294118 C160.531176,25.42 158.982941,26.9682353 157.092353,26.9682353 L134.144118,26.9682353 C134.017059,26.9682353 133.891176,26.96 133.767647,26.9458824 C131.285294,26.7211765 129.340588,24.6352941 129.340588,22.0952941 Z" id="Stroke-63" stroke="#46616E" stroke-width="1.6" stroke-linecap="round" stroke-linejoin="round"></path>
                <path d="M158.696118,17.4767059 C159.316118,16.3990588 159.670235,15.1484706 159.670235,13.8178824 C159.670235,9.75788235 156.380824,6.46847059 152.322,6.46847059 C151.096118,6.46847059 149.942,6.76729412 148.924353,7.29905882" id="Stroke-65" stroke="#46616E" stroke-width="1.6" stroke-linecap="round" stroke-linejoin="round"></path>
                <path d="M155.614706,0.941764706 L155.071176,3.85588235" id="Stroke-67" stroke="#46616E" stroke-width="1.6" stroke-linecap="round" stroke-linejoin="round"></path>
                <path d="M165.237882,15.4545882 L162.764941,14.9945882" id="Stroke-69" stroke="#46616E" stroke-width="1.6" stroke-linecap="round" stroke-linejoin="round"></path>
                <path d="M163.476706,5.82917647 L161.228471,7.37152941" id="Stroke-71" stroke="#46616E" stroke-width="1.6" stroke-linecap="round" stroke-linejoin="round"></path>
                <path d="M145.884706,2.55141176 L147.481176,4.87847059" id="Stroke-73" stroke="#46616E" stroke-width="1.6" stroke-linecap="round" stroke-linejoin="round"></path>
            </g>
        </g>
    </g>
</svg>