<?xml version="1.0" encoding="UTF-8"?>
<svg width="9px" height="9px" viewBox="0 0 9 9" version="1.1" xmlns="http://www.w3.org/2000/svg" xmlns:xlink="http://www.w3.org/1999/xlink">
    <!-- Generator: Sketch 47.1 (45422) - http://www.bohemiancoding.com/sketch -->
    <title>Icons/Plus Blue</title>
    <desc>Created with Sketch.</desc>
    <defs>
        <polygon id="path-1" points="3.62162162 9 5.32432432 9 5.32432432 5.32432432 8.97297297 5.32432432 8.97297297 3.67567568 5.32432432 3.67567568 5.32432432 0 3.62162162 0 3.62162162 3.67567568 0 3.67567568 0 5.32432432 3.62162162 5.32432432"></polygon>
    </defs>
    <g id="Symbols" stroke="none" stroke-width="1" fill="none" fill-rule="evenodd">
        <g id="Modules/Mobile/Accordion_Footer" transform="translate(-268.000000, -15.000000)">
            <g id="Icons/PlusAccordion" transform="translate(260.000000, 7.000000)">
                <g id="Swatches/Dark-Blue" transform="translate(8.000000, 8.000000)">
                    <mask id="mask-2" fill="white">
                        <use xlink:href="#path-1"></use>
                    </mask>
                    <use id="Mask" fill="#003F74" xlink:href="#path-1"></use>
                    <g mask="url(#mask-2)" id="Rectangle-2" fill="#04589B">
                        <g transform="translate(-11.000000, -11.000000)">
                            <rect x="0" y="0" width="30" height="30"></rect>
                        </g>
                    </g>
                </g>
            </g>
        </g>
    </g>
</svg>