<svg width="67" height="67" viewBox="0 0 67 67" fill="none" xmlns="http://www.w3.org/2000/svg">
<path d="M33.3981 32.9845C37.7851 30.4735 40.7826 25.7981 40.7826 20.3914C40.7826 12.3602 34.2486 5.82617 26.2174 5.82617C18.1861 5.82617 11.6521 12.3602 11.6521 20.3914C11.6521 25.7981 14.6496 30.4735 19.0367 32.9845C8.06334 35.8656 0 45.1436 0 56.1403V59.7175C0 60.5215 0.652567 61.1741 1.45657 61.1741C2.26057 61.1741 2.91313 60.5215 2.91313 59.7175V56.1403C2.913 44.462 13.368 34.9567 26.2174 34.9567C39.0668 34.9567 49.5218 44.462 49.5218 56.1403V59.7175C49.5218 60.5215 50.1743 61.1741 50.9783 61.1741C51.7823 61.1741 52.4349 60.5215 52.4349 59.7175V56.1403C52.4348 45.1436 44.3714 35.8627 33.3981 32.9845ZM14.5653 20.3914C14.5653 13.9653 19.7913 8.7393 26.2174 8.7393C32.6435 8.7393 37.8695 13.9653 37.8695 20.3914C37.8695 26.8176 32.6435 32.0435 26.2174 32.0435C19.7913 32.0435 14.5653 26.8177 14.5653 20.3914Z" fill="#4670A3"/>
<path d="M53.0117 33.0224C56.1694 30.9337 58.261 27.3623 58.261 23.3045C58.261 16.8783 53.035 11.6523 46.6089 11.6523C45.8049 11.6523 45.1523 12.3049 45.1523 13.1089C45.1523 13.9129 45.8049 14.5655 46.6089 14.5655C51.427 14.5655 55.348 18.4865 55.348 23.3046C55.348 28.1227 51.427 32.0437 46.6089 32.0437C45.8049 32.0437 45.1523 32.6963 45.1523 33.5003C45.1523 34.3043 45.8048 34.9566 46.6088 34.9566C56.248 34.9566 64.087 42.2013 64.087 51.1094V53.8913C64.087 54.6953 64.7396 55.3478 65.5436 55.3478C66.3476 55.3478 67.0002 54.6953 67.0002 53.8913V51.1094C67.0002 42.6907 61.1275 35.5392 53.0117 33.0224Z" fill="#4670A3"/>
</svg>
