<svg viewBox="0 0 16 9" fill="none" xmlns="http://www.w3.org/2000/svg">
<path d="M14.6788 0.671143C14.4565 0.671143 14.2626 0.7429 14.1003 0.885037L8.0016 6.68507L1.90289 0.885037C1.73895 0.7429 1.54666 0.671143 1.3244 0.671143C1.10214 0.671143 0.909846 0.7429 0.745911 0.885037C0.581977 1.02855 0.5 1.20381 0.5 1.40667C0.5 1.60952 0.5804 1.79582 0.745911 1.95866L7.44043 8.27894C7.58072 8.42246 7.76673 8.49422 8.00002 8.49422C8.23331 8.49422 8.42086 8.42246 8.56115 8.27894L15.2557 1.95866C15.418 1.79582 15.5 1.6109 15.5 1.40667C15.5 1.20243 15.418 1.02855 15.2557 0.885037C15.0917 0.7429 14.8994 0.671143 14.6772 0.671143H14.6788Z" fill="#676767"/>
</svg>
