<svg  viewBox="0 0 13 8" fill="none" xmlns="http://www.w3.org/2000/svg">
<path d="M6.78906 7.53672C6.60406 7.53672 6.45654 7.47193 6.3457 7.34235L1.04788 1.6285C0.917523 1.48097 0.853516 1.3147 0.853516 1.1297C0.853516 0.944707 0.917523 0.787809 1.04788 0.658232C1.17746 0.529436 1.32968 0.463867 1.50531 0.463867C1.68094 0.463867 1.83314 0.529436 1.96272 0.658232L6.78906 5.90062L11.6154 0.658232C11.7442 0.529436 11.8972 0.463867 12.0728 0.463867C12.2484 0.463867 12.4007 0.529436 12.5302 0.658232C12.659 0.787809 12.7246 0.945487 12.7246 1.1297C12.7246 1.31392 12.6598 1.48175 12.5302 1.6285L7.23165 7.34235C7.1208 7.47193 6.97328 7.53672 6.78828 7.53672H6.78906Z" fill="white"/>
</svg>
