<svg width="24" height="19" viewBox="0 0 24 19" fill="none" xmlns="http://www.w3.org/2000/svg">
<path d="M20.8333 5.09042C20.8473 5.28685 20.8473 5.48333 20.8473 5.67977C20.8473 11.6714 16.287 18.5751 7.95201 18.5751C5.38416 18.5751 2.99876 17.8314 0.992188 16.5405C1.35703 16.5825 1.70779 16.5966 2.08667 16.5966C4.20545 16.5966 6.15592 15.881 7.71346 14.6602C5.72093 14.6181 4.05113 13.3131 3.47581 11.517C3.75647 11.5591 4.03709 11.5872 4.33179 11.5872C4.7387 11.5872 5.14566 11.531 5.52449 11.4329C3.44778 11.0119 1.89019 9.18773 1.89019 6.98473V6.92862C2.49354 7.26539 3.19519 7.47586 3.93883 7.50389C2.71805 6.69003 1.91827 5.30089 1.91827 3.72931C1.91827 2.88741 2.14274 2.11565 2.53565 1.44212C4.76673 4.19237 8.12037 5.98842 11.8809 6.1849C11.8107 5.84813 11.7686 5.49737 11.7686 5.14656C11.7686 2.64886 13.7892 0.614258 16.3009 0.614258C17.6059 0.614258 18.7846 1.1615 19.6125 2.04551C20.6368 1.84907 21.619 1.47019 22.489 0.951026C22.1522 2.00344 21.4366 2.88745 20.4965 3.44869C21.4086 3.35051 22.2926 3.09788 23.1064 2.74712C22.4891 3.64512 21.7173 4.44491 20.8333 5.09041V5.09042Z" fill="#98A2B2"/>
</svg>
