<svg viewBox="0 0 21 21" fill="none" xmlns="http://www.w3.org/2000/svg">
<g clip-path="url(#clip0_709_6878)">
<path d="M10.5 17.0625C17.3698 17.0625 20.7757 11.0736 20.9173 10.8188C21.0276 10.6204 21.0276 10.3794 20.9173 10.1811C20.7757 9.92644 17.3698 3.9375 10.5 3.9375C3.63021 3.9375 0.224274 9.92644 0.0826874 10.1812C-0.0275631 10.3796 -0.0275631 10.6206 0.0826874 10.8189C0.224274 11.0736 3.63021 17.0625 10.5 17.0625ZM19.5715 10.499C18.7909 11.6821 15.726 15.75 10.5 15.75C5.25738 15.75 2.20615 11.6854 1.42849 10.501C2.2091 9.31793 5.27395 5.25 10.5 5.25C15.7426 5.25 18.7939 9.31465 19.5715 10.499ZM10.5 14.4375C12.6712 14.4375 14.4375 12.6712 14.4375 10.5C14.4375 8.3288 12.6712 6.5625 10.5 6.5625C8.3288 6.5625 6.5625 8.3288 6.5625 10.5C6.5625 12.6712 8.3288 14.4375 10.5 14.4375ZM10.5 7.875C11.9474 7.875 13.125 9.05264 13.125 10.5C13.125 11.9474 11.9474 13.125 10.5 13.125C9.05264 13.125 7.875 11.9474 7.875 10.5C7.875 9.05264 9.05264 7.875 10.5 7.875Z" fill="#007E9A"/>
</g>
<defs>
<clipPath id="clip0_709_6878">
<rect width="21" height="21" fill="white" transform="matrix(-1 0 0 1 21 0)"/>
</clipPath>
</defs>
</svg>
