<svg width="20" height="20" viewBox="0 0 20 20" fill="none" xmlns="http://www.w3.org/2000/svg">
<path d="M9.68256 4.71548C6.93555 4.71548 4.7198 6.93123 4.7198 9.67824C4.7198 12.4253 6.93555 14.641 9.68256 14.641C12.4296 14.641 14.6453 12.4252 14.6453 9.67824C14.6453 6.93123 12.4296 4.71548 9.68256 4.71548ZM9.68256 12.9047C7.90737 12.9047 6.45612 11.4577 6.45612 9.67824C6.45612 7.89873 7.90305 6.4518 9.68256 6.4518C11.4621 6.4518 12.909 7.89873 12.909 9.67824C12.909 11.4577 11.4577 12.9047 9.68256 12.9047H9.68256ZM16.0059 4.51248C16.0059 5.15604 15.4876 5.67002 14.8483 5.67002C14.2048 5.67002 13.6908 5.15172 13.6908 4.51248C13.6908 3.87324 14.2091 3.35494 14.8483 3.35494C15.4876 3.35494 16.0059 3.87324 16.0059 4.51248ZM19.2928 5.6873C19.2193 4.13671 18.8652 2.76321 17.7292 1.63158C16.5976 0.499947 15.2241 0.145773 13.6735 0.0680273C12.0754 -0.0226758 7.2854 -0.0226758 5.6873 0.0680273C4.14103 0.141454 2.76752 0.495628 1.63158 1.62726C0.495628 2.75889 0.145773 4.13239 0.0680273 5.68298C-0.0226758 7.28109 -0.0226758 12.0711 0.0680273 13.6692C0.141454 15.2198 0.495628 16.5933 1.63158 17.7249C2.76752 18.8565 4.13671 19.2107 5.6873 19.2885C7.2854 19.3792 12.0754 19.3792 13.6735 19.2885C15.2241 19.215 16.5976 18.8608 17.7292 17.7249C18.8609 16.5933 19.215 15.2198 19.2928 13.6692C19.3835 12.0711 19.3835 7.2854 19.2928 5.6873L19.2928 5.6873ZM17.2282 15.3839C16.8913 16.2305 16.2391 16.8827 15.3882 17.2239C14.1141 17.7292 11.0906 17.6126 9.68256 17.6126C8.2745 17.6126 5.24674 17.7249 3.9769 17.2239C3.13034 16.887 2.47814 16.2348 2.13692 15.3839C1.63158 14.1097 1.74819 11.0863 1.74819 9.67824C1.74819 8.27018 1.6359 5.24242 2.13692 3.97258C2.47382 3.12602 3.12602 2.47382 3.9769 2.1326C5.25106 1.62726 8.2745 1.74388 9.68256 1.74388C11.0906 1.74388 14.1184 1.63158 15.3882 2.1326C16.2348 2.4695 16.887 3.1217 17.2282 3.97258C17.7335 5.24674 17.6169 8.27018 17.6169 9.67824C17.6169 11.0863 17.7335 14.1141 17.2282 15.3839Z" fill="#98A2B2"/>
</svg>
