module gitlab.com/sivabalan.ma/distribution/v3

go 1.15

require (
	github.com/Azure/azure-sdk-for-go v16.2.1+incompatible
	github.com/Azure/go-autorest v10.8.1+incompatible // indirect
	github.com/Shopify/logrus-bugsnag v0.0.0-20171204204709-577dee27f20d
	github.com/aws/aws-sdk-go v1.34.9
	github.com/bitly/go-simplejson v0.5.0 // indirect
	github.com/bmizerany/assert v0.0.0-20160611221934-b7ed37b82869 // indirect
	github.com/bshuster-repo/logrus-logstash-hook v1.0.0
	github.com/bugsnag/bugsnag-go v0.0.0-20141110184014-b1d153021fcd
	github.com/bugsnag/osext v0.0.0-20130617224835-0dd3f918b21b // indirect
	github.com/bugsnag/panicwrap v0.0.0-20151223152923-e2c28503fcd0 // indirect
	github.com/denverdino/aliyungo v0.0.0-20190125010748-a747050bb1ba
	github.com/dgrijalva/jwt-go v0.0.0-20170104182250-a601269ab70c // indirect
	github.com/dnaeon/go-vcr v1.0.1 // indirect
	github.com/docker/go-events v0.0.0-20190806004212-e31b211e4f1c
	github.com/docker/go-metrics v0.0.1
	github.com/docker/libtrust v0.0.0-20150114040149-fa567046d9b1
	github.com/gomodule/redigo v1.8.2
	github.com/gorilla/handlers v1.5.1
	github.com/gorilla/mux v1.8.0
	github.com/inconshreveable/mousetrap v1.0.0 // indirect
	github.com/kr/pretty v0.1.0 // indirect
	github.com/marstr/guid v1.1.0 // indirect
	github.com/mitchellh/mapstructure v1.1.2
	github.com/mitchellh/osext v0.0.0-20151018003038-5e2d6d41470f // indirect
	github.com/ncw/swift v1.0.47
	github.com/opencontainers/go-digest v1.0.0
	github.com/opencontainers/image-spec v1.0.1
	github.com/satori/go.uuid v1.2.0 // indirect
	github.com/sirupsen/logrus v1.8.1
	github.com/spf13/cobra v0.0.3
	github.com/spf13/pflag v1.0.3 // indirect
	github.com/yvasiyarov/go-metrics v0.0.0-20140926110328-57bccd1ccd43 // indirect
	github.com/yvasiyarov/gorelic v0.0.0-20141212073537-a9bba5b9ab50
	github.com/yvasiyarov/newrelic_platform_go v0.0.0-20140908184405-b21fdbd4370f // indirect
	golang.org/x/crypto v0.0.0-20200128174031-69ecbb4d6d5d
	golang.org/x/oauth2 v0.0.0-20190604053449-0f29369cfe45
	google.golang.org/api v0.0.0-20160322025152-9bf6e6e569ff
	google.golang.org/cloud v0.0.0-20151119220103-975617b05ea8
	google.golang.org/grpc v0.0.0-20160317175043-d3ddb4469d5a // indirect
	gopkg.in/check.v1 v1.0.0-20141024133853-64131543e789
	gopkg.in/yaml.v2 v2.4.0
)
