sample,MLII,V5,timestamp
0,995,1011,1589422548019500000
1,995,1011,1589422548119500000
2,995,1011,1589422548219500000
3,995,1011,1589422548319510000
4,995,1011,1589422548419510000
5,995,1011,1589422548519510000
6,995,1011,1589422548619510000
7,995,1011,1589422548719520000
8,1000,1008,1589422548819520000
9,997,1008,1589422548919520000
10,995,1007,1589422549019530000
11,994,1007,1589422549119530000
12,992,1009,1589422549219530000
13,993,1010,1589422549319530000
14,992,1010,1589422549419540000
15,989,1011,1589422549519540000
16,988,1013,1589422549619540000
17,987,1014,1589422549719540000
18,990,1014,1589422549819550000
19,993,1016,1589422549919550000
20,989,1016,1589422550019550000
21,988,1013,1589422550119560000
22,986,1009,1589422550219560000
23,988,1008,1589422550319560000
24,993,1007,1589422550419560000
25,997,1010,1589422550519570000
26,993,1008,1589422550619570000
27,986,1008,1589422550719570000
28,983,1006,1589422550819580000
29,977,1005,1589422550919580000
30,979,1006,1589422551019580000
31,975,1005,1589422551119580000
32,974,1002,1589422551219590000
33,972,1000,1589422551319590000
34,969,995,1589422551419590000
35,969,997,1589422551519600000
36,969,1003,1589422551619600000
37,971,1005,1589422551719600000
38,973,1003,1589422551819600000
39,971,1000,1589422551919610000
40,969,997,1589422552019610000
41,966,999,1589422552119610000
42,966,999,1589422552219620000
43,966,1001,1589422552319620000
44,966,1001,1589422552419620000
45,967,999,1589422552519620000
46,965,996,1589422552619630000
47,963,996,1589422552719630000
48,967,998,1589422552819630000
49,969,999,1589422552919630000
50,969,996,1589422553019640000
51,968,995,1589422553119640000
52,967,994,1589422553219640000
53,963,994,1589422553319650000
54,966,998,1589422553419650000
55,964,1001,1589422553519650000
56,968,999,1589422553619650000
57,966,997,1589422553719660000
58,964,992,1589422553819660000
59,961,985,1589422553919660000
60,960,984,1589422554019670000
61,957,983,1589422554119670000
62,952,979,1589422554219670000
63,947,973,1589422554319670000
64,947,964,1589422554419680000
65,943,966,1589422554519680000
66,933,977,1589422554619680000
67,927,998,1589422554719690000
68,927,1017,1589422554819690000
69,939,1034,1589422554919690000
70,958,1048,1589422555019690000
71,980,1064,1589422555119700000
72,1010,1086,1589422555219700000
73,1048,1111,1589422555319700000
74,1099,1131,1589422555419710000
75,1148,1140,1589422555519710000
76,1180,1119,1589422555619710000
77,1192,1066,1589422555719710000
78,1177,1007,1589422555819720000
79,1128,978,1589422555919720000
80,1058,974,1589422556019720000
81,991,981,1589422556119730000
82,951,988,1589422556219730000
83,937,987,1589422556319730000
84,939,992,1589422556419730000
85,950,994,1589422556519740000
86,958,994,1589422556619740000
87,959,988,1589422556719740000
88,957,988,1589422556819750000
89,955,992,1589422556919750000
90,958,991,1589422557019750000
91,959,990,1589422557119750000
92,961,991,1589422557219760000
93,962,987,1589422557319760000
94,960,987,1589422557419760000
95,957,987,1589422557519760000
96,956,990,1589422557619770000
97,959,992,1589422557719770000
98,955,993,1589422557819770000
99,957,989,1589422557919780000
100,958,985,1589422558019780000
101,957,987,1589422558119780000
102,958,987,1589422558219780000
103,959,989,1589422558319790000
104,958,989,1589422558419790000
105,958,985,1589422558519790000
106,955,986,1589422558619800000
107,953,988,1589422558719800000
108,957,991,1589422558819800000
109,959,990,1589422558919800000
110,963,990,1589422559019810000
111,960,990,1589422559119810000
112,960,986,1589422559219810000
113,958,987,1589422559319820000
114,956,988,1589422559419820000
115,957,990,1589422559519820000
116,956,989,1589422559619820000
117,955,986,1589422559719830000
118,953,984,1589422559819830000
119,953,985,1589422559919830000
120,956,987,1589422560019830000
121,958,990,1589422560119840000
122,958,990,1589422560219840000
123,958,987,1589422560319840000
124,956,985,1589422560419850000
125,954,989,1589422560519850000
126,959,984,1589422560619850000
127,959,987,1589422560719850000
128,958,988,1589422560819860000
129,958,987,1589422560919860000
130,957,983,1589422561019860000
131,957,986,1589422561119870000
132,956,988,1589422561219870000
133,958,987,1589422561319870000
134,956,984,1589422561419870000
135,954,981,1589422561519880000
136,953,983,1589422561619880000
137,954,982,1589422561719880000
138,955,984,1589422561819890000
139,958,987,1589422561919890000
140,960,983,1589422562019890000
141,957,984,1589422562119890000
142,958,982,1589422562219900000
143,955,983,1589422562319900000
144,958,987,1589422562419900000
145,957,987,1589422562519910000
146,957,984,1589422562619910000
147,955,981,1589422562719910000
148,955,979,1589422562819910000
149,953,980,1589422562919920000
150,956,984,1589422563019920000
151,956,984,1589422563119920000
152,957,981,1589422563219930000
153,958,979,1589422563319930000
154,954,977,1589422563419930000
155,954,975,1589422563519930000
156,955,976,1589422563619940000
157,957,976,1589422563719940000
158,957,976,1589422563819940000
159,957,975,1589422563919940000
160,954,972,1589422564019950000
161,953,972,1589422564119950000
162,953,971,1589422564219950000
163,955,971,1589422564319960000
164,955,968,1589422564419960000
165,957,967,1589422564519960000
166,954,965,1589422564619960000
167,952,965,1589422564719970000
168,952,964,1589422564819970000
169,952,966,1589422564919970000
170,951,964,1589422565019980000
171,952,961,1589422565119980000
172,950,961,1589422565219980000
173,947,961,1589422565319980000
174,950,961,1589422565419990000
175,952,962,1589422565519990000
176,953,962,1589422565619990000
177,952,959,1589422565720000000
178,949,958,1589422565820000000
179,949,959,1589422565920000000
180,951,961,1589422566020000000
181,951,963,1589422566120010000
182,952,963,1589422566220010000
183,952,966,1589422566320010000
184,951,966,1589422566420020000
185,950,969,1589422566520020000
186,953,970,1589422566620020000
187,958,975,1589422566720020000
188,959,976,1589422566820030000
189,959,974,1589422566920030000
190,957,974,1589422567020030000
191,956,977,1589422567120030000
192,961,980,1589422567220040000
193,964,985,1589422567320040000
194,964,986,1589422567420040000
195,966,986,1589422567520050000
196,965,986,1589422567620050000
197,966,988,1589422567720050000
198,967,992,1589422567820050000
199,969,995,1589422567920060000
200,973,994,1589422568020060000
201,974,992,1589422568120060000
202,974,992,1589422568220070000
203,971,993,1589422568320070000
204,973,995,1589422568420070000
205,975,996,1589422568520070000
206,978,992,1589422568620080000
207,975,994,1589422568720080000
208,975,989,1589422568820080000
209,973,990,1589422568920090000
210,973,992,1589422569020090000
211,976,992,1589422569120090000
212,974,994,1589422569220090000
213,973,993,1589422569320100000
214,975,992,1589422569420100000
215,973,990,1589422569520100000
216,974,993,1589422569620110000
217,974,993,1589422569720110000
218,971,994,1589422569820110000
219,972,991,1589422569920110000
220,972,989,1589422570020120000
221,971,991,1589422570120120000
222,970,991,1589422570220120000
223,971,992,1589422570320130000
224,972,992,1589422570420130000
225,969,988,1589422570520130000
226,968,989,1589422570620130000
227,966,987,1589422570720140000
228,969,991,1589422570820140000
229,970,994,1589422570920140000
230,972,994,1589422571020140000
231,968,990,1589422571120150000
232,968,987,1589422571220150000
233,967,985,1589422571320150000
234,969,986,1589422571420160000
235,969,986,1589422571520160000
236,971,987,1589422571620160000
237,970,986,1589422571720160000
238,967,982,1589422571820170000
239,966,985,1589422571920170000
240,968,986,1589422572020170000
241,969,988,1589422572120180000
242,967,983,1589422572220180000
243,968,981,1589422572320180000
244,964,979,1589422572420180000
245,964,982,1589422572520190000
246,963,983,1589422572620190000
247,965,985,1589422572720190000
248,964,984,1589422572820200000
249,962,985,1589422572920200000
250,962,982,1589422573020200000
251,963,981,1589422573120200000
252,965,983,1589422573220210000
253,967,987,1589422573320210000
254,967,985,1589422573420210000
255,966,985,1589422573520220000
256,965,980,1589422573620220000
257,962,980,1589422573720220000
258,966,982,1589422573820220000
259,965,981,1589422573920230000
260,964,980,1589422574020230000
261,963,980,1589422574120230000
262,962,979,1589422574220230000
263,959,982,1589422574320240000
264,962,984,1589422574420240000
265,964,982,1589422574520240000
266,966,979,1589422574620250000
267,962,978,1589422574720250000
268,959,979,1589422574820250000
269,958,980,1589422574920250000
270,961,978,1589422575020260000
271,964,982,1589422575120260000
272,963,981,1589422575220260000
273,962,981,1589422575320270000
274,960,978,1589422575420270000
275,958,981,1589422575520270000
276,959,980,1589422575620270000
277,961,983,1589422575720280000
278,962,983,1589422575820280000
279,963,982,1589422575920280000
280,963,981,1589422576020290000
281,962,979,1589422576120290000
282,964,981,1589422576220290000
283,963,981,1589422576320290000
284,966,981,1589422576420300000
285,964,979,1589422576520300000
286,964,979,1589422576620300000
287,963,979,1589422576720310000
288,963,983,1589422576820310000
289,966,985,1589422576920310000
290,968,982,1589422577020310000
291,965,982,1589422577120320000
292,963,981,1589422577220320000
293,961,977,1589422577320320000
294,963,978,1589422577420320000
295,965,980,1589422577520330000
296,966,980,1589422577620330000
297,968,978,1589422577720330000
298,970,979,1589422577820340000
299,969,978,1589422577920340000
300,969,981,1589422578020340000
301,970,985,1589422578120340000
302,974,985,1589422578220350000
303,974,986,1589422578320350000
304,973,984,1589422578420350000
305,979,985,1589422578520360000
306,980,988,1589422578620360000
307,983,990,1589422578720360000
308,984,988,1589422578820360000
309,983,989,1589422578920370000
310,981,985,1589422579020370000
311,978,985,1589422579120370000
312,980,990,1589422579220380000
313,979,989,1589422579320380000
314,979,989,1589422579420380000
315,979,988,1589422579520380000
316,978,987,1589422579620390000
317,977,987,1589422579720390000
318,976,989,1589422579820390000
319,977,989,1589422579920400000
320,980,989,1589422580020400000
321,982,986,1589422580120400000
322,983,983,1589422580220400000
323,975,984,1589422580320410000
324,967,983,1589422580420410000
325,967,983,1589422580520410000
326,964,981,1589422580620420000
327,962,981,1589422580720420000
328,958,979,1589422580820420000
329,958,981,1589422580920420000
330,959,982,1589422581020430000
331,961,984,1589422581120430000
332,960,981,1589422581220430000
333,961,979,1589422581320430000
334,959,975,1589422581420440000
335,956,975,1589422581520440000
336,955,974,1589422581620440000
337,956,979,1589422581720450000
338,956,978,1589422581820450000
339,954,977,1589422581920450000
340,955,976,1589422582020450000
341,953,977,1589422582120460000
342,958,977,1589422582220460000
343,957,980,1589422582320460000
344,958,978,1589422582420470000
345,960,976,1589422582520470000
346,955,976,1589422582620470000
347,953,975,1589422582720470000
348,956,979,1589422582820480000
349,958,979,1589422582920480000
350,959,977,1589422583020480000
351,958,974,1589422583120490000
352,954,970,1589422583220490000
353,951,968,1589422583320490000
354,952,966,1589422583420490000
355,948,964,1589422583520500000
356,939,958,1589422583620500000
357,935,952,1589422583720500000
358,929,953,1589422583820510000
359,922,963,1589422583920510000
360,917,983,1589422584020510000
361,923,1008,1589422584120510000
362,941,1027,1589422584220520000
363,964,1037,1589422584320520000
364,992,1047,1589422584420520000
365,1021,1062,1589422584520520000
366,1071,1084,1589422584620530000
367,1122,1106,1589422584720530000
368,1168,1123,1589422584820530000
369,1199,1121,1589422584920540000
370,1212,1096,1589422585020540000
371,1205,1045,1589422585120540000
372,1175,991,1589422585220540000
373,1122,954,1589422585320550000
374,1057,934,1589422585420550000
375,1002,930,1589422585520550000
376,970,934,1589422585620560000
377,946,945,1589422585720560000
378,934,955,1589422585820560000
379,929,962,1589422585920560000
380,933,965,1589422586020570000
381,939,967,1589422586120570000
382,946,965,1589422586220570000
383,946,965,1589422586320580000
384,947,968,1589422586420580000
385,946,967,1589422586520580000
386,948,967,1589422586620580000
387,948,967,1589422586720590000
388,948,966,1589422586820590000
389,945,969,1589422586920590000
390,947,969,1589422587020600000
391,947,969,1589422587120600000
392,947,970,1589422587220600000
393,949,967,1589422587320600000
394,945,965,1589422587420610000
395,942,966,1589422587520610000
396,942,969,1589422587620610000
397,944,971,1589422587720620000
398,945,971,1589422587820620000
399,946,969,1589422587920620000
400,943,965,1589422588020620000
401,945,966,1589422588120630000
402,947,967,1589422588220630000
403,949,970,1589422588320630000
404,946,971,1589422588420630000
405,946,969,1589422588520640000
406,943,968,1589422588620640000
407,942,968,1589422588720640000
408,942,970,1589422588820650000
409,946,971,1589422588920650000
410,946,970,1589422589020650000
411,945,970,1589422589120650000
412,943,968,1589422589220660000
413,941,970,1589422589320660000
414,944,971,1589422589420660000
415,942,971,1589422589520670000
416,943,971,1589422589620670000
417,942,970,1589422589720670000
418,941,967,1589422589820670000
419,942,967,1589422589920680000
420,944,971,1589422590020680000
421,944,971,1589422590120680000
422,945,973,1589422590220690000
423,946,969,1589422590320690000
424,943,969,1589422590420690000
425,942,968,1589422590520690000
426,946,970,1589422590620700000
427,946,971,1589422590720700000
428,947,969,1589422590820700000
429,947,967,1589422590920710000
430,942,968,1589422591020710000
431,943,968,1589422591120710000
432,945,969,1589422591220710000
433,946,969,1589422591320720000
434,949,969,1589422591420720000
435,946,967,1589422591520720000
436,945,965,1589422591620720000
437,942,965,1589422591720730000
438,944,969,1589422591820730000
439,946,969,1589422591920730000
440,946,967,1589422592020740000
441,947,966,1589422592120740000
442,943,961,1589422592220740000
443,941,961,1589422592320740000
444,941,963,1589422592420750000
445,944,966,1589422592520750000
446,945,962,1589422592620750000
447,943,960,1589422592720760000
448,941,960,1589422592820760000
449,940,957,1589422592920760000
450,940,958,1589422593020760000
451,942,959,1589422593120770000
452,941,955,1589422593220770000
453,939,954,1589422593320770000
454,940,951,1589422593420780000
455,937,950,1589422593520780000
456,938,953,1589422593620780000
457,938,952,1589422593720780000
458,940,950,1589422593820790000
459,938,946,1589422593920790000
460,934,945,1589422594020790000
461,933,944,1589422594120800000
462,934,946,1589422594220800000
463,937,947,1589422594320800000
464,935,946,1589422594420800000
465,934,944,1589422594520810000
466,933,942,1589422594620810000
467,930,940,1589422594720810000
468,932,943,1589422594820820000
469,933,942,1589422594920820000
470,934,942,1589422595020820000
471,933,944,1589422595120820000
472,930,943,1589422595220830000
473,929,946,1589422595320830000
474,932,947,1589422595420830000
475,934,951,1589422595520830000
476,935,953,1589422595620840000
477,936,955,1589422595720840000
478,937,953,1589422595820840000
479,936,958,1589422595920850000
480,942,965,1589422596020850000
481,945,969,1589422596120850000
482,950,970,1589422596220850000
483,951,972,1589422596320860000
484,952,971,1589422596420860000
485,951,971,1589422596520860000
486,956,975,1589422596620870000
487,959,979,1589422596720870000
488,961,982,1589422596820870000
489,960,981,1589422596920870000
490,958,981,1589422597020880000
491,958,983,1589422597120880000
492,960,985,1589422597220880000
493,962,987,1589422597320890000
494,964,987,1589422597420890000
495,964,985,1589422597520890000
496,960,985,1589422597620890000
497,960,985,1589422597720900000
498,961,987,1589422597820900000
499,963,990,1589422597920900000
500,963,987,1589422598020910000
501,965,985,1589422598120910000
502,960,985,1589422598220910000
503,958,985,1589422598320910000
504,963,987,1589422598420920000
505,962,989,1589422598520920000
506,964,989,1589422598620920000
507,964,987,1589422598720920000
508,960,985,1589422598820930000
509,959,985,1589422598920930000
510,962,985,1589422599020930000
511,963,988,1589422599120940000
512,961,987,1589422599220940000
513,963,986,1589422599320940000
514,961,985,1589422599420940000
515,961,985,1589422599520950000
516,962,986,1589422599620950000
517,965,987,1589422599720950000
518,966,987,1589422599820960000
519,963,986,1589422599920960000
520,962,984,1589422600020960000
521,960,981,1589422600120960000
522,961,985,1589422600220970000
523,964,987,1589422600320970000
524,961,987,1589422600420970000
525,961,987,1589422600520980000
526,961,984,1589422600620980000
527,958,983,1589422600720980000
528,961,986,1589422600820980000
529,960,986,1589422600920990000
530,961,984,1589422601020990000
531,959,984,1589422601120990000
532,957,985,1589422601221000000
533,956,980,1589422601321000000
534,957,983,1589422601421000000
535,957,986,1589422601521000000
536,958,984,1589422601621010000
537,959,980,1589422601721010000
538,955,978,1589422601821010000
539,954,982,1589422601921010000
540,955,983,1589422602021020000
541,957,984,1589422602121020000
542,958,985,1589422602221020000
543,958,980,1589422602321030000
544,955,979,1589422602421030000
545,955,979,1589422602521030000
546,955,981,1589422602621030000
547,960,983,1589422602721040000
548,958,983,1589422602821040000
549,957,981,1589422602921040000
550,956,979,1589422603021050000
551,953,980,1589422603121050000
552,957,979,1589422603221050000
553,958,985,1589422603321050000
554,958,981,1589422603421060000
555,957,980,1589422603521060000
556,953,981,1589422603621060000
557,952,979,1589422603721070000
558,953,981,1589422603821070000
559,954,982,1589422603921070000
560,956,982,1589422604021070000
561,955,979,1589422604121080000
562,955,978,1589422604221080000
563,955,980,1589422604321080000
564,955,982,1589422604421090000
565,958,983,1589422604521090000
566,958,984,1589422604621090000
567,957,983,1589422604721090000
568,955,980,1589422604821100000
569,954,978,1589422604921100000
570,954,981,1589422605021100000
571,956,983,1589422605121100000
572,958,984,1589422605221110000
573,955,978,1589422605321110000
574,955,980,1589422605421110000
575,953,981,1589422605521120000
576,954,983,1589422605621120000
577,956,984,1589422605721120000
578,958,983,1589422605821120000
579,956,980,1589422605921130000
580,956,980,1589422606021130000
581,956,979,1589422606121130000
582,958,983,1589422606221140000
583,957,984,1589422606321140000
584,958,984,1589422606421140000
585,957,982,1589422606521140000
586,955,978,1589422606621150000
587,955,981,1589422606721150000
588,956,984,1589422606821150000
589,958,984,1589422606921160000
590,961,983,1589422607021160000
591,965,982,1589422607121160000
592,964,981,1589422607221160000
593,965,980,1589422607321170000
594,967,983,1589422607421170000
595,969,984,1589422607521170000
596,971,985,1589422607621180000
597,971,983,1589422607721180000
598,971,983,1589422607821180000
599,973,983,1589422607921180000
600,974,988,1589422608021190000
601,976,990,1589422608121190000
602,979,986,1589422608221190000
603,981,986,1589422608321200000
604,976,984,1589422608421200000
605,975,987,1589422608521200000
606,976,991,1589422608621200000
607,975,995,1589422608721210000
608,977,995,1589422608821210000
609,975,990,1589422608921210000
610,974,989,1589422609021210000
611,969,990,1589422609121220000
612,969,991,1589422609221220000
613,971,994,1589422609321220000
614,974,992,1589422609421230000
615,979,989,1589422609521230000
616,980,986,1589422609621230000
617,978,986,1589422609721230000
618,971,987,1589422609821240000
619,970,987,1589422609921240000
620,968,989,1589422610021240000
621,967,985,1589422610121250000
622,963,981,1589422610221250000
623,960,983,1589422610321250000
624,956,984,1589422610421250000
625,958,985,1589422610521260000
626,957,983,1589422610621260000
627,957,982,1589422610721260000
628,953,980,1589422610821270000
629,950,981,1589422610921270000
630,952,982,1589422611021270000
631,955,983,1589422611121270000
632,954,984,1589422611221280000
633,953,982,1589422611321280000
634,951,980,1589422611421280000
635,949,980,1589422611521290000
636,948,980,1589422611621290000
637,950,984,1589422611721290000
638,951,983,1589422611821290000
639,951,981,1589422611921300000
640,948,979,1589422612021300000
641,947,980,1589422612121300000
642,948,981,1589422612221300000
643,949,983,1589422612321310000
644,953,980,1589422612421310000
645,950,979,1589422612521310000
646,946,976,1589422612621320000
647,943,972,1589422612721320000
648,942,968,1589422612821320000
649,937,964,1589422612921320000
650,931,955,1589422613021330000
651,926,949,1589422613121330000
652,920,955,1589422613221330000
653,913,972,1589422613321340000
654,910,999,1589422613421340000
655,919,1029,1589422613521340000
656,943,1053,1589422613621340000
657,974,1076,1589422613721350000
658,1006,1099,1589422613821350000
659,1048,1125,1589422613921350000
660,1106,1151,1589422614021360000
661,1162,1165,1589422614121360000
662,1201,1146,1589422614221360000
663,1216,1088,1589422614321360000
664,1194,1015,1589422614421370000
665,1128,974,1589422614521370000
666,1034,970,1589422614621370000
667,960,976,1589422614721380000
668,924,976,1589422614821380000
669,923,974,1589422614921380000
670,935,973,1589422615021380000
671,941,975,1589422615121390000
672,945,975,1589422615221390000
673,946,975,1589422615321390000
674,945,973,1589422615421390000
675,946,972,1589422615521400000
676,945,972,1589422615621400000
677,943,970,1589422615721400000
678,945,975,1589422615821410000
679,943,975,1589422615921410000
680,946,974,1589422616021410000
681,945,971,1589422616121410000
682,945,970,1589422616221420000
683,942,970,1589422616321420000
684,943,971,1589422616421420000
685,944,972,1589422616521430000
686,944,972,1589422616621430000
687,941,970,1589422616721430000
688,943,968,1589422616821430000
689,940,968,1589422616921440000
690,941,970,1589422617021440000
691,943,973,1589422617121440000
692,943,971,1589422617221450000
693,940,968,1589422617321450000
694,940,966,1589422617421450000
695,937,969,1589422617521450000
696,940,971,1589422617621460000
697,942,973,1589422617721460000
698,942,972,1589422617821460000
699,943,972,1589422617921470000
700,939,968,1589422618021470000
701,938,968,1589422618121470000
702,940,971,1589422618221470000
703,941,972,1589422618321480000
704,942,973,1589422618421480000
705,942,972,1589422618521480000
706,939,969,1589422618621490000
707,940,970,1589422618721490000
708,944,969,1589422618821490000
709,945,971,1589422618921490000
710,944,971,1589422619021500000
711,944,970,1589422619121500000
712,945,968,1589422619221500000
713,941,967,1589422619321500000
714,943,968,1589422619421510000
715,946,973,1589422619521510000
716,944,970,1589422619621510000
717,944,968,1589422619721520000
718,941,966,1589422619821520000
719,939,966,1589422619921520000
720,939,970,1589422620021520000
721,941,970,1589422620121530000
722,941,967,1589422620221530000
723,942,964,1589422620321530000
724,939,964,1589422620421540000
725,939,964,1589422620521540000
726,940,965,1589422620621540000
727,941,969,1589422620721540000
728,944,965,1589422620821550000
729,944,964,1589422620921550000
730,942,962,1589422621021550000
731,939,962,1589422621121560000
732,942,961,1589422621221560000
733,943,962,1589422621321560000
734,945,962,1589422621421560000
735,944,957,1589422621521570000
736,944,955,1589422621621570000
737,943,953,1589422621721570000
738,947,954,1589422621821580000
739,944,955,1589422621921580000
740,946,952,1589422622021580000
741,946,950,1589422622121580000
742,944,949,1589422622221590000
743,941,947,1589422622321590000
744,943,950,1589422622421590000
745,943,950,1589422622521590000
746,942,947,1589422622621600000
747,941,944,1589422622721600000
748,940,941,1589422622821600000
749,940,943,1589422622921610000
750,939,942,1589422623021610000
751,941,946,1589422623121610000
752,941,943,1589422623221610000
753,942,942,1589422623321620000
754,937,939,1589422623421620000
755,938,940,1589422623521620000
756,937,942,1589422623621630000
757,940,943,1589422623721630000
758,940,944,1589422623821630000
759,940,944,1589422623921630000
760,940,943,1589422624021640000
761,939,947,1589422624121640000
762,939,951,1589422624221640000
763,941,955,1589422624321650000
764,945,957,1589422624421650000
765,945,959,1589422624521650000
766,946,962,1589422624621650000
767,949,965,1589422624721660000
768,952,969,1589422624821660000
769,956,973,1589422624921660000
770,957,974,1589422625021670000
771,958,976,1589422625121670000
772,957,975,1589422625221670000
773,957,978,1589422625321670000
774,959,983,1589422625421680000
775,960,984,1589422625521680000
776,963,984,1589422625621680000
777,963,983,1589422625721690000
778,961,982,1589422625821690000
779,962,980,1589422625921690000
780,963,985,1589422626021690000
781,964,986,1589422626121700000
782,964,984,1589422626221700000
783,964,984,1589422626321700000
784,962,982,1589422626421700000
785,962,984,1589422626521710000
786,962,986,1589422626621710000
787,961,989,1589422626721710000
788,964,984,1589422626821720000
789,963,983,1589422626921720000
790,961,982,1589422627021720000
791,960,984,1589422627121720000
792,959,984,1589422627221730000
793,962,988,1589422627321730000
794,963,986,1589422627421730000
795,963,986,1589422627521740000
796,960,983,1589422627621740000
797,959,983,1589422627721740000
798,963,985,1589422627821740000
799,962,987,1589422627921750000
800,965,986,1589422628021750000
801,962,986,1589422628121750000
802,959,982,1589422628221760000
803,958,982,1589422628321760000
804,960,983,1589422628421760000
805,960,983,1589422628521760000
806,960,984,1589422628621770000
807,959,981,1589422628721770000
808,954,979,1589422628821770000
809,954,982,1589422628921780000
810,956,982,1589422629021780000
811,957,982,1589422629121780000
812,958,981,1589422629221780000
813,957,979,1589422629321790000
814,956,979,1589422629421790000
815,952,978,1589422629521790000
816,954,982,1589422629621790000
817,954,982,1589422629721800000
818,953,978,1589422629821800000
819,952,974,1589422629921800000
820,953,974,1589422630021810000
821,951,975,1589422630121810000
822,953,978,1589422630221810000
823,954,981,1589422630321810000
824,956,978,1589422630421820000
825,953,976,1589422630521820000
826,954,975,1589422630621820000
827,951,975,1589422630721830000
828,951,976,1589422630821830000
829,954,981,1589422630921830000
830,953,979,1589422631021830000
831,954,976,1589422631121840000
832,950,976,1589422631221840000
833,948,975,1589422631321840000
834,950,976,1589422631421850000
835,952,978,1589422631521850000
836,951,977,1589422631621850000
837,952,976,1589422631721850000
838,951,978,1589422631821860000
839,948,974,1589422631921860000
840,950,979,1589422632021860000
841,951,981,1589422632121870000
842,954,978,1589422632221870000
843,954,976,1589422632321870000
844,954,974,1589422632421870000
845,950,971,1589422632521880000
846,951,978,1589422632621880000
847,955,980,1589422632721880000
848,955,977,1589422632821890000
849,956,979,1589422632921890000
850,953,977,1589422633021890000
851,951,977,1589422633121890000
852,952,979,1589422633221900000
853,953,979,1589422633321900000
854,953,981,1589422633421900000
855,953,979,1589422633521900000
856,949,977,1589422633621910000
857,947,978,1589422633721910000
858,953,979,1589422633821910000
859,952,979,1589422633921920000
860,953,979,1589422634021920000
861,952,979,1589422634121920000
862,952,978,1589422634221920000
863,950,978,1589422634321930000
864,952,981,1589422634421930000
865,955,982,1589422634521930000
866,953,979,1589422634621940000
867,955,976,1589422634721940000
868,955,977,1589422634821940000
869,955,976,1589422634921940000
870,956,979,1589422635021950000
871,962,981,1589422635121950000
872,963,980,1589422635221950000
873,963,980,1589422635321960000
874,962,978,1589422635421960000
875,963,978,1589422635521960000
876,966,983,1589422635621960000
877,967,984,1589422635721970000
878,969,983,1589422635821970000
879,968,985,1589422635921970000
880,968,982,1589422636021980000
881,969,983,1589422636121980000
882,971,986,1589422636221980000
883,973,987,1589422636321980000
884,975,984,1589422636421990000
885,972,985,1589422636521990000
886,971,984,1589422636621990000
887,969,986,1589422636721990000
888,968,990,1589422636822000000
889,971,996,1589422636922000000
890,970,991,1589422637022000000
891,969,991,1589422637122010000
892,968,987,1589422637222010000
893,969,988,1589422637322010000
894,968,990,1589422637422010000
895,969,994,1589422637522020000
896,971,991,1589422637622020000
897,973,988,1589422637722020000
898,976,984,1589422637822030000
899,972,982,1589422637922030000
900,968,982,1589422638022030000
901,962,987,1589422638122030000
902,962,986,1589422638222040000
903,955,984,1589422638322040000
904,952,981,1589422638422040000
905,948,980,1589422638522050000
906,947,982,1589422638622050000
907,948,985,1589422638722050000
908,950,983,1589422638822050000
909,949,980,1589422638922060000
910,947,979,1589422639022060000
911,946,978,1589422639122060000
912,945,980,1589422639222070000
913,947,982,1589422639322070000
914,947,982,1589422639422070000
915,947,978,1589422639522070000
916,945,977,1589422639622080000
917,943,978,1589422639722080000
918,944,979,1589422639822080000
919,949,981,1589422639922080000
920,949,980,1589422640022090000
921,946,980,1589422640122090000
922,945,978,1589422640222090000
923,941,976,1589422640322100000
924,943,980,1589422640422100000
925,944,979,1589422640522100000
926,946,977,1589422640622100000
927,943,974,1589422640722110000
928,939,968,1589422640822110000
929,932,963,1589422640922110000
930,929,959,1589422641022120000
931,923,955,1589422641122120000
932,922,949,1589422641222120000
933,919,941,1589422641322120000
934,916,939,1589422641422130000
935,904,947,1589422641522130000
936,895,965,1589422641622130000
937,898,988,1589422641722140000
938,909,1011,1589422641822140000
939,925,1031,1589422641922140000
940,947,1050,1589422642022140000
941,970,1072,1589422642122150000
942,1001,1098,1589422642222150000
943,1042,1123,1589422642322150000
944,1098,1146,1589422642422160000
945,1151,1155,1589422642522160000
946,1186,1133,1589422642622160000
947,1196,1070,1589422642722160000
948,1178,1003,1589422642822170000
949,1119,968,1589422642922170000
950,1037,967,1589422643022170000
951,963,973,1589422643122180000
952,924,973,1589422643222180000
953,920,972,1589422643322180000
954,929,978,1589422643422180000
955,942,980,1589422643522190000
956,946,975,1589422643622190000
957,946,973,1589422643722190000
958,944,972,1589422643822190000
959,942,974,1589422643922200000
960,943,977,1589422644022200000
961,947,975,1589422644122200000
962,946,975,1589422644222210000
963,945,972,1589422644322210000
964,943,971,1589422644422210000
965,942,971,1589422644522210000
966,943,972,1589422644622220000
967,944,976,1589422644722220000
968,946,975,1589422644822220000
969,945,972,1589422644922230000
970,942,970,1589422645022230000
971,941,970,1589422645122230000
972,942,973,1589422645222230000
973,945,973,1589422645322240000
974,943,974,1589422645422240000
975,942,971,1589422645522240000
976,943,970,1589422645622250000
977,943,970,1589422645722250000
978,942,971,1589422645822250000
979,946,974,1589422645922250000
980,947,975,1589422646022260000
981,946,971,1589422646122260000
982,945,970,1589422646222260000
983,944,972,1589422646322270000
984,944,973,1589422646422270000
985,944,975,1589422646522270000
986,945,974,1589422646622270000
987,945,972,1589422646722280000
988,943,970,1589422646822280000
989,943,972,1589422646922280000
990,944,973,1589422647022280000
991,945,974,1589422647122290000
992,947,973,1589422647222290000
993,949,973,1589422647322290000
994,947,969,1589422647422300000
995,945,970,1589422647522300000
996,946,971,1589422647622300000
997,947,972,1589422647722300000
998,949,972,1589422647822310000
