a 0
X 31 3 0 0 30
D 17 2 3 0
L 8 2 4
L 6 0 14
L 5 1 0
L 3 1 200
L 1 5 200
D 10 5 5 1
L 3 5 200
X 31 5 1 0 20
D 17 6 5 5
L 9 6 6
X 31 0 0 0 31
X 31 0 0 0 20
L 5 1 10
L 3 1 201
L 1 5 201
D 10 5 5 1
L 3 5 201
L 5 2 43
X 31 2 2 0 20
X 31 5 1 0 20
D 17 6 5 18
L 9 6 16
X 31 0 0 0 31
X 31 0 0 0 20
e
s 9
STOP 0
PRINT 1
PRINTC 2
CNT1 200
CNT2 201
COUNT1 4
COUNT2 14
LOOP1 6
LOOP2 16
