{
    "images" : [
      {
        "size" : "20x20",
        "idiom" : "iphone",
        "filename" : "circle.png",
        "scale" : "2x"
      },
      {
        "size" : "20x20",
        "idiom" : "iphone",
        "filename" : "circle.png",
        "scale" : "3x"
      },
      {
        "size" : "29x29",
        "idiom" : "iphone",
        "filename" : "circle.png",
        "scale" : "1x"
      },
      {
        "size" : "29x29",
        "idiom" : "iphone",
        "filename" : "circle.png",
        "scale" : "2x"
      },
      {
        "size" : "29x29",
        "idiom" : "iphone",
        "filename" : "circle.png",
        "scale" : "3x"
      },
      {
        "size" : "40x40",
        "idiom" : "iphone",
        "filename" : "circle.png",
        "scale" : "2x"
      },
      {
        "size" : "40x40",
        "idiom" : "iphone",
        "filename" : "circle.png",
        "scale" : "3x"
      },
      {
        "size" : "60x60",
        "idiom" : "iphone",
        "filename" : "circle.png",
        "scale" : "2x"
      },
      {
        "size" : "60x60",
        "idiom" : "iphone",
        "filename" : "circle.png",
        "scale" : "3x"
      },
      {
        "size" : "20x20",
        "idiom" : "ipad",
        "filename" : "circle.png",
        "scale" : "1x"
      },
      {
        "size" : "20x20",
        "idiom" : "ipad",
        "filename" : "circle.png",
        "scale" : "2x"
      },
      {
        "size" : "29x29",
        "idiom" : "ipad",
        "filename" : "circle.png",
        "scale" : "1x"
      },
      {
        "size" : "29x29",
        "idiom" : "ipad",
        "filename" : "circle.png",
        "scale" : "2x"
      },
      {
        "size" : "40x40",
        "idiom" : "ipad",
        "filename" : "circle.png",
        "scale" : "1x"
      },
      {
        "size" : "40x40",
        "idiom" : "ipad",
        "filename" : "circle.png",
        "scale" : "2x"
      },
      {
        "size" : "76x76",
        "idiom" : "ipad",
        "filename" : "circle.png",
        "scale" : "1x"
      },
      {
        "size" : "76x76",
        "idiom" : "ipad",
        "filename" : "circle.png",
        "scale" : "2x"
      },
      {
        "size" : "83.5x83.5",
        "idiom" : "ipad",
        "filename" : "circle.png",
        "scale" : "2x"
      },
      {
        "size" : "1024x1024",
        "idiom" : "ios-marketing",
        "filename" : "circle.png",
        "scale" : "1x"
      }
    ],
    "info" : {
      "version" : 1,
      "author" : "xcode"
    }
  }
  