[
    {
        "seccion":"Backlog",
        "items": [
            {
                "id": 1,
                "priority": 0,
                "title": "Company website redesing",
                "chat":1,
                "attachment":1,
                "assignees": [
                    {
                        "avg":"https://randomuser.me/api/portraits/men/30.jpg"
                    }
                ]
            },
            {
                "id": 2,
                "priority": 0,
                "title": "Mobile login prototype",
                "chat":1,
                "attachment":1,
                "assignees": [
                    {
                        "avg":"https://randomuser.me/api/portraits/men/40.jpg"
                    }
                ]
            },
            {
                "id": 3,
                "priority": 3,
                "title": "UI Interface desing promotions",
                "chat":2,
                "attachment":1,
                "assignees": [
                    {
                        "avg":"https://randomuser.me/api/portraits/men/52.jpg"
                    },
                    {
                        "avg":"https://randomuser.me/api/portraits/men/30.jpg"
                    }
                ]
            }
        ]
    },
    {
        "seccion":"To Do",
        "items": [
            {
                "id": 4,
                "priority": 0,
                "title": "Company website redesing",
                "chat":1,
                "attachment":1,
                "assignees": [
                    {
                        "avg":"https://randomuser.me/api/portraits/men/30.jpg"
                    }
                ]
            },
            {
                "id": 5,
                "priority": 0,
                "title": "Mobile login prototype",
                "chat":1,
                "attachment":1,
                "assignees": [
                    {
                        "avg":"https://randomuser.me/api/portraits/men/40.jpg"
                    }
                ]
            },
            {
                "id": 6,
                "priority": 3,
                "title": "UI Interface desing promotions",
                "chat":2,
                "attachment":1,
                "assignees": [
                    {
                        "avg":"https://randomuser.me/api/portraits/men/52.jpg"
                    },
                    {
                        "avg":"https://randomuser.me/api/portraits/men/30.jpg"
                    }
                ]
            }
        ]
    },
    {
        "seccion":"In Progress",
        "items": [
            {
                "id": 7,
                "priority": 2,
                "title": "Deploy web page",
                "chat":1,
                "attachment":1,
                "assignees": [
                    {
                        "avg":"https://randomuser.me/api/portraits/men/30.jpg"
                    }
                ]
            },
            {
                "id": 8,
                "priority": 1,
                "title": "Mobile login maquetation",
                "chat":1,
                "attachment":1,
                "assignees": [
                    {
                        "avg":"https://randomuser.me/api/portraits/men/40.jpg"
                    }
                ]
            },
            {
                "id": 9,
                "priority": 2,
                "title": "UI Interface desing promotions",
                "chat":2,
                "attachment":1,
                "assignees": [
                    {
                        "avg":"https://randomuser.me/api/portraits/men/52.jpg"
                    },
                    {
                        "avg":"https://randomuser.me/api/portraits/men/30.jpg"
                    }
                ]
            }
        ]
    },
    {
        "seccion":"In Review",
        "items": [
            {
                "id": 10,
                "priority": 2,
                "title": "Dashboard layout redesign",
                "chat":1,
                "attachment":1,
                "assignees": [
                    {
                        "avg":"https://randomuser.me/api/portraits/men/30.jpg"
                    }
                ]
            },
            {
                "id": 11,
                "priority": 1,
                "title": "Mobile login prototype",
                "chat":1,
                "attachment":1,
                "assignees": [
                    {
                        "avg":"https://randomuser.me/api/portraits/men/40.jpg"
                    }
                ]
            },
            {
                "id": 12,
                "priority": 0,
                "title": "UI Interface desing promotions",
                "chat":2,
                "attachment":1,
                "assignees": [
                    {
                        "avg":"https://randomuser.me/api/portraits/men/52.jpg"
                    },
                    {
                        "avg":"https://randomuser.me/api/portraits/men/30.jpg"
                    }
                ]
            }
        ]
    },
    {
        "seccion":"Completed",
        "items": [
            {
                "id": 13,
                "priority": 2,
                "title": "Dashboard layout redesign",
                "chat":1,
                "attachment":1,
                "assignees": [
                    {
                        "avg":"https://randomuser.me/api/portraits/men/30.jpg"
                    }
                ]
            },
            {
                "id": 14,
                "priority": 1,
                "title": "Mobile login prototype",
                "chat":1,
                "attachment":1,
                "assignees": [
                    {
                        "avg":"https://randomuser.me/api/portraits/men/40.jpg"
                    }
                ]
            },
            {
                "id": 15,
                "priority": 0,
                "title": "UI Interface desing promotions",
                "chat":2,
                "attachment":1,
                "assignees": [
                    {
                        "avg":"https://randomuser.me/api/portraits/men/52.jpg"
                    },
                    {
                        "avg":"https://randomuser.me/api/portraits/men/30.jpg"
                    }
                ]
            }
        ]
    }
]