{
  "meta": {
    "id": "IREF779004",
    "test": false,
    "schema": "https://raw.githubusercontent.com/sdmx-twg/sdmx-json/develop/structure-message/tools/schemas/2.0.0/sdmx-json-structure-schema.json",
    "prepared": "2022-01-12T08:58:26Z",
    "contentLanguages": [
      "en"
    ],
    "sender": {
      "id": "FusionRegistry"
    }
  },
  "data": {
    "categorisations": [
      {
        "id": "FREQUENCY2CL_FREQ_A",
        "name": "TEST",
        "names": {
          "en": "TEST"
        },
        "version": "1.0.0",
        "agencyID": "ACY",
        "isExternalReference": false,
        "source": "urn:sdmx:org.sdmx.infomodel.categoryscheme.Category=TEST:CS(1.0).FREQUENCY",
        "target": "urn:sdmx:org.sdmx.infomodel.codelist.Code=TEST:CL_FREQ(1.0).A",
        "links": [
          {
            "rel": "self",
            "urn": "urn:sdmx:org.sdmx.infomodel.categoryscheme.Categorisation=ACY:FREQUENCY2CL_FREQ_A(1.0.0)",
            "uri": "https://raw.githubusercontent.com/sdmx-twg/sdmx-json/develop/structure-message/tools/schemas/2.0.0/sdmx-json-structure-schema.json",
            "type": "categorisation"
          }
        ]
      }
    ]
  }
}