{
  "meta": {
    "id": "IREF915401",
    "test": false,
    "schema": "https://raw.githubusercontent.com/sdmx-twg/sdmx-json/develop/structure-message/tools/schemas/2.0.0/sdmx-json-structure-schema.json",
    "prepared": "2022-01-12T12:45:47Z",
    "contentLanguages": [
      "en"
    ],
    "sender": {
      "id": "FusionRegistry"
    }
  },
  "data": {
    "codelists": [
      {
        "id": "CL_GENDER",
        "name": "TEST",
        "names": {
          "en": "TEST"
        },
        "version": "1.0.2",
        "agencyID": "SDMX",
        "isExternalReference": false,
        "codelistExtensions": [
          {
            "prefix": "EX_",
            "codelist": "urn:sdmx:org.sdmx.infomodel.codelist.Codelist=SDMX:CL_REF_ARAEA(1.0.2)",
            "exclusiveCodeSelection": {
              "wildcardedMemberValues": [
                "%US",
                "%EU"
              ],
              "memberValues": [
                {
                  "value": "UK"
                },
                {
                  "value": "FR"
                },
                {
                  "value": "ASIA",
                  "cascadeValues": true
                }
              ]
            }
          }
        ],
        "isPartial": false,
        "codes": [
          {
            "id": "ES",
            "name": "ES-name",
            "names": {
              "en": "ES-name"
            },
            "links": [
              {
                "rel": "self",
                "urn": "urn:sdmx:org.sdmx.infomodel.codelist.Code=SDMX:CL_GENDER(1.0.2).ES",
                "uri": "https://raw.githubusercontent.com/sdmx-twg/sdmx-json/develop/structure-message/tools/schemas/2.0.0/sdmx-json-structure-schema.json",
                "type": "code"
              }
            ]
          },
          {
            "id": "FR",
            "name": "FR-name",
            "names": {
              "en": "FR-name"
            },
            "links": [
              {
                "rel": "self",
                "urn": "urn:sdmx:org.sdmx.infomodel.codelist.Code=SDMX:CL_GENDER(1.0.2).FR",
                "uri": "https://raw.githubusercontent.com/sdmx-twg/sdmx-json/develop/structure-message/tools/schemas/2.0.0/sdmx-json-structure-schema.json",
                "type": "code"
              }
            ]
          }
        ],
        "links": [
          {
            "rel": "self",
            "urn": "urn:sdmx:org.sdmx.infomodel.codelist.Codelist=SDMX:CL_GENDER(1.0.2)",
            "uri": "https://raw.githubusercontent.com/sdmx-twg/sdmx-json/develop/structure-message/tools/schemas/2.0.0/sdmx-json-structure-schema.json",
            "type": "codelist"
          }
        ]
      }
    ]
  }
}