{
  "meta": {
    "id": "IREF796703",
    "test": false,
    "schema": "https://raw.githubusercontent.com/sdmx-twg/sdmx-json/develop/structure-message/tools/schemas/2.0.0/sdmx-json-structure-schema.json",
    "prepared": "2022-01-12T09:27:50Z",
    "contentLanguages": [
      "en"
    ],
    "sender": {
      "id": "FusionRegistry"
    }
  },
  "data": {
    "codelists": [
      {
        "id": "CL_ACTIVITY",
        "name": "TEST",
        "names": {
          "en": "TEST"
        },
        "version": "1.0.2",
        "agencyID": "ESTAT",
        "isExternalReference": false,
        "isPartial": false,
        "codes": [
          {
            "id": "_T",
            "name": "Total - All activities",
            "names": {
              "en": "Total - All activities"
            },
            "description": "This aggregate includes all activities",
            "descriptions": {
              "en": "This aggregate includes all activities"
            },
            "links": [
              {
                "rel": "self",
                "urn": "urn:sdmx:org.sdmx.infomodel.codelist.Code=ESTAT:CL_ACTIVITY(1.0.2)._T",
                "uri": "https://raw.githubusercontent.com/sdmx-twg/sdmx-json/develop/structure-message/tools/schemas/2.0.0/sdmx-json-structure-schema.json",
                "type": "code"
              }
            ]
          },
          {
            "id": "_X",
            "name": "Unspecified",
            "names": {
              "en": "Unspecified"
            },
            "links": [
              {
                "rel": "self",
                "urn": "urn:sdmx:org.sdmx.infomodel.codelist.Code=ESTAT:CL_ACTIVITY(1.0.2)._X",
                "uri": "https://raw.githubusercontent.com/sdmx-twg/sdmx-json/develop/structure-message/tools/schemas/2.0.0/sdmx-json-structure-schema.json",
                "type": "code"
              }
            ]
          },
          {
            "id": "_Z",
            "name": "Not appliable",
            "names": {
              "en": "Not appliable"
            },
            "links": [
              {
                "rel": "self",
                "urn": "urn:sdmx:org.sdmx.infomodel.codelist.Code=ESTAT:CL_ACTIVITY(1.0.2)._Z",
                "uri": "https://raw.githubusercontent.com/sdmx-twg/sdmx-json/develop/structure-message/tools/schemas/2.0.0/sdmx-json-structure-schema.json",
                "type": "code"
              }
            ]
          },
          {
            "id": "A",
            "name": "Agriculture, forestry and fishing",
            "names": {
              "en": "Agriculture, forestry and fishing"
            },
            "links": [
              {
                "rel": "self",
                "urn": "urn:sdmx:org.sdmx.infomodel.codelist.Code=ESTAT:CL_ACTIVITY(1.0.2).A",
                "uri": "https://raw.githubusercontent.com/sdmx-twg/sdmx-json/develop/structure-message/tools/schemas/2.0.0/sdmx-json-structure-schema.json",
                "type": "code"
              }
            ]
          },
          {
            "id": "A_B",
            "name": "Total Primary sector",
            "names": {
              "en": "Total Primary sector"
            },
            "description": "A+B",
            "descriptions": {
              "en": "A+B"
            },
            "links": [
              {
                "rel": "self",
                "urn": "urn:sdmx:org.sdmx.infomodel.codelist.Code=ESTAT:CL_ACTIVITY(1.0.2).A_B",
                "uri": "https://raw.githubusercontent.com/sdmx-twg/sdmx-json/develop/structure-message/tools/schemas/2.0.0/sdmx-json-structure-schema.json",
                "type": "code"
              }
            ]
          }
        ],
        "links": [
          {
            "rel": "self",
            "urn": "urn:sdmx:org.sdmx.infomodel.codelist.Codelist=ESTAT:CL_ACTIVITY(1.0.2)",
            "uri": "https://raw.githubusercontent.com/sdmx-twg/sdmx-json/develop/structure-message/tools/schemas/2.0.0/sdmx-json-structure-schema.json",
            "type": "codelist"
          }
        ]
      }
    ]
  }
}