{
  "meta": {
    "id": "IREF915301",
    "test": false,
    "schema": "https://raw.githubusercontent.com/sdmx-twg/sdmx-json/develop/structure-message/tools/schemas/2.0.0/sdmx-json-structure-schema.json",
    "prepared": "2022-02-25T12:18:59Z",
    "contentLanguages": [
      "en"
    ],
    "sender": {
      "id": "FusionRegistry"
    }
  },
  "data": {
    "dataStructures": [
      {
        "id": "TEST",
        "name": "TEST",
        "names": {
          "en": "TEST"
        },
        "version": "1.0",
        "agencyID": "TEST",
        "isExternalReference": false,
        "dataStructureComponents": {
          "attributeList": {
            "id": "AttributeDescriptor",
            "attributes": [
              {
                "usage": "optional",
                "attributeRelationship": {
                  "dimensions": [
                    "FREQ",
                    "REF_AREA"
                  ]
                },
                "measureRelationship": [
                  "MEASURE1",
                  "MEASURE3"
                ],
                "id": "ATTR1",
                "conceptIdentity": "urn:sdmx:org.sdmx.infomodel.conceptscheme.Concept=TEST:CS(1.0).ATTR1",
                "links": [
                  {
                    "rel": "self",
                    "urn": "urn:sdmx:org.sdmx.infomodel.datastructure.DataAttribute=TEST:TEST(1.0).ATTR1",
                    "uri": "https://raw.githubusercontent.com/sdmx-twg/sdmx-json/develop/structure-message/tools/schemas/2.0.0/sdmx-json-structure-schema.json",
                    "type": "dataattribute"
                  }
                ]
              }
            ],
            "links": [
              {
                "rel": "self",
                "urn": "urn:sdmx:org.sdmx.infomodel.datastructure.AttributeDescriptor=TEST:TEST(1.0).AttributeDescriptor",
                "uri": "https://raw.githubusercontent.com/sdmx-twg/sdmx-json/develop/structure-message/tools/schemas/2.0.0/sdmx-json-structure-schema.json",
                "type": "attributedescriptor"
              }
            ]
          },
          "dimensionList": {
            "id": "DimensionDescriptor",
            "links": [
              {
                "rel": "self",
                "urn": "urn:sdmx:org.sdmx.infomodel.datastructure.DimensionDescriptor=TEST:TEST(1.0).DimensionDescriptor",
                "uri": "https://raw.githubusercontent.com/sdmx-twg/sdmx-json/develop/structure-message/tools/schemas/2.0.0/sdmx-json-structure-schema.json",
                "type": "dimensiondescriptor"
              }
            ],
            "dimensions": [
              {
                "position": 1,
                "type": "Dimension",
                "id": "FREQ",
                "conceptIdentity": "urn:sdmx:org.sdmx.infomodel.conceptscheme.Concept=TEST:CS(1.0).FREQ",
                "links": [
                  {
                    "rel": "self",
                    "urn": "urn:sdmx:org.sdmx.infomodel.datastructure.Dimension=TEST:TEST(1.0).FREQ",
                    "uri": "https://raw.githubusercontent.com/sdmx-twg/sdmx-json/develop/structure-message/tools/schemas/2.0.0/sdmx-json-structure-schema.json",
                    "type": "dimension"
                  }
                ]
              },
              {
                "position": 2,
                "type": "Dimension",
                "id": "REF_AREA",
                "conceptIdentity": "urn:sdmx:org.sdmx.infomodel.conceptscheme.Concept=TEST:CS(1.0).REF_AREA",
                "links": [
                  {
                    "rel": "self",
                    "urn": "urn:sdmx:org.sdmx.infomodel.datastructure.Dimension=TEST:TEST(1.0).REF_AREA",
                    "uri": "https://raw.githubusercontent.com/sdmx-twg/sdmx-json/develop/structure-message/tools/schemas/2.0.0/sdmx-json-structure-schema.json",
                    "type": "dimension"
                  }
                ]
              }
            ],
            "timeDimensions": [
              {
                "position": 3,
                "type": "TimeDimension",
                "id": "TIME_PERIOD",
                "localRepresentation": {
                  "format": {
                    "textType": "ObservationalTimePeriod"
                  }
                },
                "conceptIdentity": "urn:sdmx:org.sdmx.infomodel.conceptscheme.Concept=TEST:CS(1.0).T",
                "links": [
                  {
                    "rel": "self",
                    "urn": "urn:sdmx:org.sdmx.infomodel.datastructure.TimeDimension=TEST:TEST(1.0).TIME_PERIOD",
                    "uri": "https://raw.githubusercontent.com/sdmx-twg/sdmx-json/develop/structure-message/tools/schemas/2.0.0/sdmx-json-structure-schema.json",
                    "type": "timedimension"
                  }
                ]
              }
            ]
          },
          "measureList": {
            "id": "MeasureDescriptor",
            "links": [
              {
                "rel": "self",
                "urn": "urn:sdmx:org.sdmx.infomodel.datastructure.MeasureDescriptor=TEST:TEST(1.0).MeasureDescriptor",
                "uri": "https://raw.githubusercontent.com/sdmx-twg/sdmx-json/develop/structure-message/tools/schemas/2.0.0/sdmx-json-structure-schema.json",
                "type": "measuredescriptor"
              }
            ],
            "measures": [
              {
                "id": "MEASURE1",
                "usage": "optional",
                "conceptIdentity": "urn:sdmx:org.sdmx.infomodel.conceptscheme.Concept=TEST:CS(1.0).MEASURE1",
                "links": [
                  {
                    "rel": "self",
                    "urn": "urn:sdmx:org.sdmx.infomodel.datastructure.Measure=TEST:TEST(1.0).MEASURE1",
                    "uri": "https://raw.githubusercontent.com/sdmx-twg/sdmx-json/develop/structure-message/tools/schemas/2.0.0/sdmx-json-structure-schema.json",
                    "type": "measure"
                  }
                ]
              },
              {
                "id": "MEASURE2",
                "usage": "optional",
                "conceptIdentity": "urn:sdmx:org.sdmx.infomodel.conceptscheme.Concept=TEST:CS(1.0).MEASURE2",
                "links": [
                  {
                    "rel": "self",
                    "urn": "urn:sdmx:org.sdmx.infomodel.datastructure.Measure=TEST:TEST(1.0).MEASURE2",
                    "uri": "https://raw.githubusercontent.com/sdmx-twg/sdmx-json/develop/structure-message/tools/schemas/2.0.0/sdmx-json-structure-schema.json",
                    "type": "measure"
                  }
                ]
              },
              {
                "id": "MEASURE3",
                "usage": "optional",
                "conceptIdentity": "urn:sdmx:org.sdmx.infomodel.conceptscheme.Concept=TEST:CS(1.0).MEASURE3",
                "links": [
                  {
                    "rel": "self",
                    "urn": "urn:sdmx:org.sdmx.infomodel.datastructure.Measure=TEST:TEST(1.0).MEASURE3",
                    "uri": "https://raw.githubusercontent.com/sdmx-twg/sdmx-json/develop/structure-message/tools/schemas/2.0.0/sdmx-json-structure-schema.json",
                    "type": "measure"
                  }
                ]
              }
            ]
          }
        },
        "links": [
          {
            "rel": "self",
            "urn": "urn:sdmx:org.sdmx.infomodel.datastructure.DataStructure=TEST:TEST(1.0)",
            "uri": "https://raw.githubusercontent.com/sdmx-twg/sdmx-json/develop/structure-message/tools/schemas/2.0.0/sdmx-json-structure-schema.json",
            "type": "datastructure"
          }
        ]
      }
    ]
  }
}