<ticker>,<date>,<open>,<high>,<low>,<close>,<volume>,<o/i>
20MICRONS,20200101,36,36.8,35.25,35.8,49077,36031
3IINFOTECH,20200101,2,2.05,1.95,2,800982,641119
3MINDIA,20200101,21350.7,21820.9,21348.85,21721.95,773,461
3PLAND,20200101,6,6,6,6,167,167
5PAISA,20200101,192.05,211.75,192.05,205.5,107432,30263
63MOONS,20200101,101.1,115,101.1,110.4,731910,225138
A2ZINFRA,20200101,7.65,8.1,7.5,7.75,298173,208536
AARTIDRUGS,20200101,579.3,598.4,575.55,591.9,13121,6883
AARTIIND,20200101,836,843,831.1,837.8,87969,66232
AARVEEDEN,20200101,14,14.45,13.8,13.9,4874,4211
AAVAS,20200101,1981.1,1998,1925,1969.2,45666,25277
ABAN,20200101,26,26.15,25.25,25.55,36475,20181
ABB,20200101,1296.95,1296.95,1275,1290,6827,0
ABBOTINDIA,20200101,13170.6,13452.15,13080,13140,4037,1754
ABCAPITAL,20200101,103.2,103.4,101.2,101.5,982667,374847
ABFRL,20200101,232.9,236.85,230.15,234.1,241005,79395
ABMINTLTD,20200101,14.75,14.75,14.75,14.75,105,0
ABSLBANETF,20200101,321.57,321.57,321.57,321.57,1,1
