{
  "plugins": [
    "plugins/markdown"
  ],
  "source": {
    "includePattern": ".+\\.js$",
    "exclude": "node_modules"
  },
  "opts": {
    "destination": "./jsdoc/"
  },
  "templates": {
    "default": {
      "outputSourceFiles": false,
      "includeDate": false
    }
  }
}
