NOM;PRENOM
BARANOWSKI;Vincent
BIENKOWSKI;Rudy
BOULAFA;Kamil
CLERSY;Quentin
DELATTRE;Pierre
FILATERO;Antoine
LAMBERT;Rodrigue
LEFEBVRE;Anthony
LEGRAND;Damien
MAERTENS;Corentin
MAGNIER;Corentin
MASCART;Victorien
OLEJNIK;Sylvain
THIOT;Fabien
VAN DE WEGHE;Donovan
