{
    "fluentMethods": true,
    "relationships": [],
    "fields": [
        {
            "fieldName": "idee",
            "fieldType": "String"
        },
        {
            "fieldName": "scenario",
            "fieldType": "String"
        },
        {
            "fieldName": "genre",
            "fieldType": "String"
        }
    ],
    "dto": "mapstruct",
    "service": "serviceImpl",
    "entityTableName": "scenario",
    "jpaMetamodelFiltering": false,
    "pagination": "no"
}
