<?xml version="1.0" encoding="UTF-8"?>
<svg width="32px" height="32px" viewBox="0 0 32 32" version="1.1" xmlns="http://www.w3.org/2000/svg" xmlns:xlink="http://www.w3.org/1999/xlink">
    <title>A3A22D00-B19A-4D31-995B-7FBB32904F85</title>
    <g id="Home" stroke="none" stroke-width="1" fill="none" fill-rule="evenodd">
        <g id="Eco-Home" transform="translate(-750.000000, -4181.000000)" fill-rule="nonzero">
            <g id="Footer" transform="translate(0.000000, 3936.000000)">
                <g id="Group-38" transform="translate(0.000000, 160.000000)">
                    <g id="Group-32" transform="translate(135.000000, 80.000000)">
                        <g id="icons8-services" transform="translate(615.000000, 5.000000)">
                            <path d="M11.3749995,8.53333333 C11.1179339,8.53333333 10.8990165,8.71493333 10.8520832,8.96666667 L10.6541666,10.0208333 C10.5720334,10.4592334 10.22275,10.7822997 9.78541664,10.8708331 C9.42168331,10.9444331 9.0644,11.0379499 8.71666667,11.1520832 C8.29426667,11.2907499 7.83073333,11.1870667 7.54166667,10.85 L6.84791669,10.0395834 C6.68045003,9.84545003 6.39686667,9.79908331 6.175,9.92708331 L5.55833333,10.2833333 C5.3354,10.4113333 5.23549995,10.6807829 5.32083328,10.9229163 L5.67916672,11.9374997 C5.82636672,12.3577664 5.68589995,12.8097163 5.35416661,13.1062496 C5.08003328,13.3515829 4.81926667,13.6112832 4.575,13.8854165 C4.27846667,14.2171499 3.82651669,14.3576171 3.40625003,14.2104171 L2.38958336,13.8541664 C2.14745003,13.7688331 1.88008331,13.8697995 1.75208331,14.0916672 L1.39374997,14.7083328 C1.26468331,14.9312661 1.31313333,15.2137835 1.50833333,15.3812501 L2.31874997,16.0749995 C2.65581664,16.3640672 2.75949995,16.8276 2.62083328,17.25 C2.50669995,17.5977333 2.41318336,17.9550165 2.33958336,18.3187499 C2.25105003,18.7560832 1.92798336,19.1053664 1.48958336,19.1874997 L0.435416661,19.3854165 C0.182616672,19.4323499 0,19.6512672 0,19.9083328 L0,20.6250005 C0,20.8820661 0.1816,21.1009835 0.433333333,21.1479168 L1.48749995,21.3458336 C1.92589995,21.4279669 2.24896661,21.7772501 2.33749995,22.2145835 C2.41110005,22.5793835 2.50461664,22.9356 2.61874997,23.2833333 C2.75741664,23.7057333 2.65373333,24.1692661 2.31666667,24.4583339 L1.50625003,25.1520832 C1.31211669,25.3195499 1.26574997,25.6031339 1.39374997,25.8250005 L1.75,26.4416661 C1.878,26.6645995 2.14745003,26.7645003 2.38958336,26.6791669 L3.40416661,26.3208331 C3.82443339,26.1736331 4.27638336,26.3141003 4.57291669,26.6458336 C4.81825003,26.9199669 5.07794997,27.1807339 5.35208331,27.4250005 C5.68381664,27.7215328 5.82428331,28.1734837 5.67708331,28.5937504 L5.32083328,29.6104171 C5.23549995,29.8525504 5.33646667,30.1199168 5.55833333,30.2479168 L6.175,30.6062496 C6.39793333,30.7353163 6.68045003,30.6868661 6.84791669,30.4916672 L7.54166667,29.6812501 C7.83073333,29.3441835 8.29426667,29.2405003 8.71666667,29.3791669 C9.0644,29.4933003 9.42168331,29.5868171 9.78541664,29.6604171 C10.22275,29.7489504 10.5720334,30.0720171 10.6541666,30.5104171 L10.8520832,31.5645835 C10.8990165,31.8173835 11.1179339,32 11.3749995,32 L12.0916672,32 C12.3487339,32 12.5677003,31.8173333 12.6125003,31.5666667 L12.8104171,30.5125003 C12.8925504,30.0741003 13.2418336,29.7510336 13.6791669,29.6625003 C14.0439669,29.5889003 14.4001835,29.4953835 14.7479168,29.3812501 C15.1703168,29.2425835 15.6338496,29.3462667 15.9229163,29.6833333 L16.6166667,30.4937504 C16.7841333,30.6878837 17.0656331,30.7363339 17.2874997,30.6083328 L17.9062496,30.25 C18.1291829,30.122 18.2290837,29.8546336 18.1437504,29.6125003 L17.7874997,28.5958336 C17.6402997,28.1755669 17.7807669,27.7236171 18.1125003,27.4270837 C18.3866336,27.1817504 18.6474005,26.9220501 18.8916672,26.6479168 C19.1881995,26.3161835 19.6412171,26.1757163 20.0604171,26.3229163 L21.0770837,26.6791669 C21.3192171,26.7645003 21.5865835,26.6635328 21.7145835,26.4416661 L22.0729163,25.8250005 C22.2019829,25.6020661 22.1535328,25.3195499 21.9583339,25.1520832 L21.1479168,24.4583339 C20.8108501,24.1692672 20.7071669,23.7057333 20.8458336,23.2833333 C20.9599669,22.9356 21.0534837,22.5783168 21.1270837,22.2145835 C21.2156171,21.7772501 21.5386837,21.4279669 21.9770837,21.3458336 L23.0312501,21.1479168 C23.2840501,21.1009835 23.4666667,20.8820661 23.4666667,20.6250005 L23.4666667,19.9083328 C23.4666667,19.6512672 23.284,19.4333664 23.0333333,19.3874997 L21.9791669,19.1895829 C21.5407669,19.1074496 21.2177003,18.7560832 21.1291669,18.3187499 C21.0555669,17.9550165 20.9620501,17.5977333 20.8479168,17.25 C20.7092501,16.8276 20.8129333,16.3661504 21.15,16.0770837 L21.9604171,15.3833333 C22.1545504,15.2158667 22.2030005,14.9322837 22.0749995,14.7104171 L21.7166667,14.0916672 C21.5886667,13.8687328 21.3213003,13.7688331 21.0791669,13.8541664 L20.0625003,14.2125003 C19.6422336,14.3597003 19.1902837,14.2192331 18.8937504,13.8874997 C18.6484171,13.6133664 18.3887168,13.3525995 18.1145835,13.1083328 C17.7828501,12.8118005 17.6423829,12.3598496 17.7895829,11.9395829 L18.1458336,10.9229163 C18.2311669,10.6807829 18.1301995,10.4134166 17.9083328,10.2854166 L17.2916672,9.92708331 C17.0687339,9.79801664 16.7862165,9.84646667 16.6187499,10.0416667 L15.9250005,10.8520832 C15.6359328,11.1891499 15.1724,11.2928331 14.75,11.1541664 C14.4022667,11.0400331 14.0449835,10.9465163 13.6812501,10.8729163 C13.2439168,10.7843829 12.8946336,10.4613167 12.8125003,10.0229167 L12.6145835,8.96874997 C12.5676501,8.71594997 12.3487328,8.53333333 12.0916672,8.53333333 L11.3749995,8.53333333 Z M21.3333333,9.6 C20.7442296,9.6 20.2666667,10.0775629 20.2666667,10.6666667 C20.2666667,11.2557704 20.7442296,11.7333333 21.3333333,11.7333333 C21.9224371,11.7333333 22.4,11.2557704 22.4,10.6666667 C22.4,10.0775629 21.9224371,9.6 21.3333333,9.6 Z M11.7333333,13.8666667 C15.2682667,13.8666667 18.1333333,16.7317333 18.1333333,20.2666667 C18.1333333,23.8016 15.2682667,26.6666667 11.7333333,26.6666667 C8.1984,26.6666667 5.33333333,23.8016 5.33333333,20.2666667 C5.33333333,16.7317333 8.1984,13.8666667 11.7333333,13.8666667 Z M11.7333333,18.1333333 C10.5546667,18.1333333 9.6,19.088 9.6,20.2666667 C9.6,21.4453333 10.5546667,22.4 11.7333333,22.4 C12.912,22.4 13.8666667,21.4453333 13.8666667,20.2666667 C13.8666667,19.088 12.912,18.1333333 11.7333333,18.1333333 Z" id="Shape" fill="#FFFFFF"></path>
                            <path d="M20.9749995,0 C20.7179339,0 20.4990165,0.182616672 20.4520832,0.435416661 L20.2166667,1.68958336 C20.1558667,2.01491669 19.8982496,2.2578 19.5729163,2.325 C19.2699829,2.38793333 18.9713835,2.46654997 18.6812501,2.56041664 C18.3665835,2.66281664 18.0238005,2.58191669 17.8083328,2.33125003 L16.9812501,1.36458336 C16.8137835,1.16938336 16.5312661,1.12301664 16.3083328,1.25208331 L15.6916672,1.60833333 C15.4697995,1.73633333 15.3688331,2.00578336 15.4541664,2.24791669 L15.8770837,3.45 C15.9869504,3.76146667 15.8859829,4.10003339 15.6395829,4.32083328 C15.4102496,4.52669995 15.1933664,4.74358336 14.9874997,4.97291669 C14.7666997,5.21931669 14.4281333,5.32236661 14.1166667,5.21250005 L12.9125003,4.78749995 C12.6703669,4.70216661 12.4030005,4.80206667 12.2749995,5.025 L11.9166667,5.64374997 C11.7886667,5.86561664 11.8371168,6.1492 12.0312501,6.31666667 L12.1354165,6.40625003 C13.3972832,6.42758336 14.4768171,7.3302 14.7104171,8.575 L14.7749995,8.91458336 L14.9979168,8.65208331 C15.4875168,8.08248331 16.1729835,7.77274997 16.8812501,7.73541664 C17.8369835,6.29008331 19.472,5.33333333 21.3333333,5.33333333 C24.2784,5.33333333 26.6666667,7.7216 26.6666667,10.6666667 C26.6666667,12.528 25.7099168,14.1630667 24.2645835,15.1166667 C24.2272501,15.8249333 23.9175168,16.5114667 23.3479168,17 L23.0854165,17.2229163 L23.4250005,17.2874997 C24.6698005,17.5210997 25.5724171,18.6006336 25.5937504,19.8625003 L25.6833333,19.9666667 C25.8508,20.1618667 26.1333163,20.2103168 26.3562496,20.0812501 L26.9749995,19.7229163 C27.1968661,19.5949163 27.2978336,19.3275499 27.2125003,19.0854165 L26.7874997,17.8812501 C26.6776331,17.5697835 26.7806837,17.2312171 27.0270837,17.0104171 C27.2564171,16.8045504 27.4733003,16.5876672 27.6791669,16.3583339 C27.8999669,16.1119339 28.2385333,16.0109664 28.55,16.1208331 L29.7520832,16.5437504 C29.9942165,16.6290837 30.2636661,16.5291829 30.3916672,16.3062496 L30.7479168,15.6874997 C30.8759168,15.4656331 30.8295499,15.1841333 30.6354165,15.0166667 L29.6687499,14.1874997 C29.4180832,13.9720331 29.3371829,13.6292501 29.4395829,13.3145835 C29.5334496,13.0244501 29.6120661,12.7279339 29.6749995,12.4250005 C29.7421995,12.1007328 29.9850837,11.8431168 30.3104171,11.7812501 L31.5645835,11.5437504 C31.8173835,11.5000171 32,11.2820672 32,11.0250005 L32,10.3083333 C32,10.0512667 31.8173835,9.83234997 31.5645835,9.78541664 L30.3104171,9.55 C29.9850837,9.4892 29.7421995,9.23158336 29.6749995,8.90625003 C29.6120661,8.60331669 29.5334496,8.30471669 29.4395829,8.01458336 C29.3371829,7.69991669 29.4180832,7.35713333 29.6687499,7.14166667 L30.6354165,6.31458336 C30.8306165,6.14711669 30.8769835,5.8646 30.7479168,5.64166667 L30.3916672,5.025 C30.2636661,4.80313333 29.9942165,4.70216661 29.7520832,4.78749995 L28.55,5.21041664 C28.2385333,5.32028331 27.8999669,5.21931669 27.6791669,4.97291669 C27.4733003,4.74358336 27.2564171,4.52670005 27.0270837,4.32083328 C26.7806837,4.10003339 26.6776331,3.76146667 26.7874997,3.45 L27.2125003,2.24583339 C27.2978336,2.00369995 27.1979339,1.73633333 26.9749995,1.60833333 L26.3562496,1.25 C26.1343829,1.122 25.8508,1.17045003 25.6833333,1.36458336 L24.8562496,2.33125003 C24.6407829,2.58191669 24.298,2.66281664 23.9833333,2.56041664 C23.6932,2.46654997 23.3946005,2.38793333 23.0916672,2.325 C22.7674005,2.2578 22.5097835,2.01283328 22.4479168,1.68749995 L22.2125003,0.433333333 C22.1677003,0.1816 21.9487328,0 21.6916672,0 L20.9749995,0 Z M21.3333333,9.6 C20.7442296,9.6 20.2666667,10.0775629 20.2666667,10.6666667 C20.2666667,11.2557704 20.7442296,11.7333333 21.3333333,11.7333333 C21.9224371,11.7333333 22.4,11.2557704 22.4,10.6666667 C22.4,10.0775629 21.9224371,9.6 21.3333333,9.6 Z" id="Shape-Copy-2" fill="#0090FF"></path>
                        </g>
                    </g>
                </g>
            </g>
        </g>
    </g>
</svg>