{
     "log": {
          "access": "/dev/null",
          "error": "/dev/null",
          "loglevel": "warning"
     },
     "inbounds": [{
               "port": 10000,
               "listen": "127.0.0.1",
               "protocol": "vmess",
               "settings": {
                    "clients": [{
                         "id": "UUID",
                         "alterId": 0
                    }]
               },
               "streamSettings": {
                    "network": "ws",
                    "wsSettings": {
                         "path": "/falcon/vm/fly"
                    }
               }
          },
          {
               "port": 20000,
               "listen": "127.0.0.1",
               "protocol": "vless",
               "settings": {
                    "clients": [{
                         "id": "UUID"
                    }],
                    "decryption": "none"
               },
               "streamSettings": {
                    "network": "ws",
                    "wsSettings": {
                         "path": "/falcon/vl/fly"
                    }
               }
          }
     ],
     "outbounds": [{
          "protocol": "freedom",
          "settings": {}
     }],
     "dns": {
          "server": [
               "8.8.8.8",
               "8.8.4.4",
               "localhost"
          ]
     }
}