user_id,nm_cat_mgr
B619953,JODI RIVERA
C509126,RICK MULAC
S487250,CHRIS LEAL
A170859,MARK BRADSHAW
L149987,DEBBIE LOZANO
A169952,KRISTIN ALBERT
J112341,SYLVAIN BRIGANT
B171614,MARK BRADSHAW
L392735,HUGO LIZARRAGA
L314567,CANDYCE CAVAZOS
J549117,MARK BRADSHAW
B544562,GUILEBALDO ELIZONDO
O351070,THELMA CAVAZOS-TRIBBLE
B311796,EDOUARD DAMEZ
D100624,JENNIFER YOUNG
N688607,CRISTINA PENA-WALLS
S533843,LORI HARN
Z567357,LINDY ZALESKI
H439102,NICK HUDEK
R677532,MARK BRADSHAW
L187766,CHRIS LEAL
L636565,JAMES SALAZAR
R573580,CHELSEA RHODES
P155446,CANDYCE CAVAZOS
F100297,BEN FERREIRA
D516299,LINDY ZALESKI
R604623,LINDSAY VOIGT
W167653,ROB WILLIAMS
G111436,GUILEBALDO ELIZONDO
Z156622,JUSTIN HUGHES
C692677,THELMA CAVAZOS-TRIBBLE
W658456,RUSTY WOODLAND
P598836,JEFF ZALESKI
M418041,AMY PARSONS
M390364,BEN COVARRUBIA
C431843,TAMMY ACKERLY
D698715,JEFF OGAN
D140740,RANIA DANIELS
A175673,JON ENGLISH
W112374,PAMELA KENNEY
K619608,TERESA MOORE
S161026,BRANDI STONE
U115061,STACEY PARK
B108260,TAMMY ACKERLY
S102910,SCOTT PRY
R240358,JOHN HICKMAN
F112363,ROB WILLIAMS
H148194,ANDY HENRIQUES
R389071,THELMA CAVAZOS-TRIBBLE
O207819,JEANNE TAMAYO
R544707,BRETT RAMSEY
B509106,JODI RIVERA
B124845,ANDY HENRIQUES
Z729279,TERESA MOORE
A535973,AMANDA ALMANZA
M141681,JON ENGLISH
Q429312,THOMAS QUILES
L551185,HUGO LIZARRAGA
B500804,MELISSA BRANIN
M394937,YVAN COURNOYER
R677532,CRISTINA PENA-WALLS
F333727,ANDY HENRIQUES
A163606,SYLVAIN BRIGANT
K456154,MELISSA KAVANAUGH
T713819,AUDRA TEEL
J164806,STACEY PARK
S161026,ANDY HENRIQUES
W585924,DUNCAN WEBB
M390364,JEANNE TAMAYO
A515441,RUY D'AMICO
P135939,INA PERALES
C550269,RUY D'AMICO
K603326,MATT SERRANO
S659496,SYLVAIN BRIGANT
A535973,MATT SERRANO
B110530,STEVEN FARGO
G125181,GRANT MOORE
S155766,AUDRA TEEL
S155766,JEFF OGAN
D687485,LORI HARN
T173976,SKYE MOODY
M169442,STEVEN FARGO
H250865,SKYE MOODY
A552767,AMANDA ALMANZA
G162583,RANDY MILLER
A515441,NEIL COCHRAN
C431843,THELMA CAVAZOS-TRIBBLE
V162765,TAMMY ACKERLY
A593378,ALAN BRIDGES
B311796,DAVID KISER
A179141,RICK MULAC
C159375,GREG DOUGLAS
P166277,GUILEBALDO ELIZONDO
U170606,TOM SUCHENSKI
P595108,AMY PARSONS
C287431,PAMELA KENNEY
D541010,RUY D'AMICO
B612707,ANDREW MARTIN
W711483,SCOTT PRY
S499902,TOM SUCHENSKI
J167210,CRISTINA PENA-WALLS
B596516,CLAY MCANALLY
L493036,KRISTIN ALBERT
M394287,CLAY MCANALLY
L225487,TERESA MOORE
F583345,RANDY MILLER
B311796,REX HOWELL-SMITH
L187766,BEN COVARRUBIA
M161985,ANGELICA MARTINEZ
D203803,GREG DOUGLAS
B108175,KAREN BELL
R102145,BRANDON JANES
G188816,MALLORY BURNSIDE
W112374,GREG DOUGLAS
M485656,ANGELICA MARTINEZ
F333727,MALLORY BURNSIDE
J166670,JOHN HICKMAN
M162887,JODI RIVERA
E585447,SYLVIA EVERITT
D516299,NEIL COCHRAN
N593754,LAEL WILDER
D279210,RUY D'AMICO
W109891,MELISSA BRANIN
R505844,JENNIFER WIKLANDOUR
A115275,JUSTIN HUGHES
B581725,SYLVAIN BRIGANT
N502642,NEIL COCHRAN
H270428,GREG DOUGLAS
L115315,TAMMY ACKERLY
C128838,KAREN SCHIFFMACHER
W181233,DUNCAN WEBB
F163355,CANDYCE CAVAZOS
A244247,RANDY MILLER
F525701,CLAUDE AARON
M133764,ELAN NGUYEN
W712921,MARY DIPLACIDO
S450244,MATT SERRANO
M160022,BILL TATE
B610658,BRIAN BOUTIN
A545269,NICK MCDONALD
B620583,RANDY MILLER
F163355,TOM SUCHENSKI
M720703,SYLVAIN BRIGANT
B163908,BEN COVARRUBIA
A614889,SHERRI KOPPOLD
B623125,KARLA BAYONA
L111074,JEFF OGAN
N112247,TAMMY ACKERLY
M486504,CANDYCE MONROE
W443240,SHERRI KOPPOLD
N162590,ELAN NGUYEN
C580222,KURT MAYER
R166250,BRETT RAMSEY
I324608,THOMAS QUILES
D554736,TISH DEHOYOS
A792090,ANDREA ATRIPALDI
V108770,YVETTE CHAVANA
C528058,NEIL COCHRAN
Z156622,JENNIFER YOUNG
W741290,CANDYCE MONROE
M402377,NEIL COCHRAN
T471659,AVILIA GUARDIOLA
F213102,AMY PARSONS
M275236,TERESA MOORE
C589036,THELMA CAVAZOS-TRIBBLE
N112247,TERESA MOORE
M597352,WALKER JONES
K684442,FRANCISCO SANCHEZ
P155446,THELMA CAVAZOS-TRIBBLE
O163875,ROB WILLIAMS
J166670,ERIK PATEK
M573905,BEN FERREIRA
M597352,NICK MCDONALD
G347110,JASON RADICH
L590781,DAVID FIGLIOLA
W711483,MALLORY BURNSIDE
T165711,RUY D'AMICO
I108939,AMANDA ZIMMERMAN
J165773,TAMMY ACKERLY
C469358,BILL TATE
G776937,GUILEBALDO ELIZONDO
D504872,MARY DIPLACIDO
A218847,STEPHANIE AFFLERBACH
J331059,CANDYCE CAVAZOS
T604010,SYLVAIN BRIGANT
R716144,NEIL COCHRAN
O000000,44OPEN OPEN
B163908,JEANNE TAMAYO
Z626882,JEFF ZALESKI
B509630,MALLORY BURNSIDE
S175219,BRIAN BOUTIN
L440200,MARK BRADSHAW
L393720,MATT SERRANO
I324608,INGRID MARRERO
R240358,INA PERALES
S405770,STEPHANIE AFFLERBACH
G114630,LINDSAY VOIGT
V444202,LINDSAY VOIGT
P423034,ANDY HENRIQUES
W651226,JEFF OGAN
Q793026,TERESA MOORE
J138385,AUDRA TEEL
R139078,BEN COVARRUBIA
D689253,GREG SALAZAR
J331059,KIM TILL
S101895,ANDY HENRIQUES
W255326,ROB WILLIAMS
O106383,JEFF OGAN
S490345,BRIAN BOUTIN
G156163,MARY DIPLACIDO
D734156,AMY PARSONS
Z719486,STACEY PARK
D171856,EDOUARD DAMEZ
F341329,NICK HUDEK
P531878,STACEY PARK
B253867,TISH DEHOYOS
F237560,STEVEN FARGO
D698715,AUDRA TEEL
K164810,PAMELA KENNEY
H323314,RANIA DANIELS
W792480,NICK HUDEK
R759185,TERESA MOORE
S177213,FRANCISCO SANCHEZ
C568449,HUGO LIZARRAGA
F333727,THELMA CAVAZOS-TRIBBLE
W741290,KIM TILL
H620871,CANDYCE MONROE
M329128,INGRID MARRERO
R604623,CLAUDE AARON
G218365,JODI RIVERA
L168511,CHRIS LEAL
B311796,KEITH JANOSIK
M482974,RANDY MILLER
P694341,SCOTT PROFFITT
S122577,GREG SALAZAR
G549657,CANDYCE MONROE
Z729279,AMY PARSONS
P473818,MARK BRADSHAW
M573905,JENNIFER WIKLANDOUR
L551714,YVETTE CHAVANA
K141395,GRANT MOORE
R716144,JEFF ZALESKI
G105060,ERIK PATEK
A165253,DEBBIE LOZANO
S161026,TISH DEHOYOS
T165711,LINDY ZALESKI
L314567,ANDY HENRIQUES
J158040,SCOTT PROFFITT
F423255,NICK HUDEK
A183206,KAREN BELL
M441324,AUSTIN MOORE
H135759,JOHN HICKMAN
N751323,CHRIS LEAL
G655306,ERIN MAY
R716340,KARLA BAYONA
M260739,KURT MAYER
M471229,BRIAN BOUTIN
T474523,JEANNE TAMAYO
M155065,ANDREW MARTIN
G729907,AVILIA GUARDIOLA
B110530,SYLVIA EVERITT
S159607,RANDY MILLER
S405770,MALLORY BURNSIDE
B163908,CLAY MCANALLY
D392835,HUGO LIZARRAGA
W711483,JEANNE TAMAYO
S185908,TIM STABLEIN
B612707,MATT SERRANO
T165711,NEIL COCHRAN
L154722,BRIAN BOUTIN
R428846,RANDY MILLER
S658538,BEN COVARRUBIA
R759187,SCOTT PROFFITT
H360102,THELMA CAVAZOS-TRIBBLE
E554469,GUILEBALDO ELIZONDO
R167181,GREG SALAZAR
A515441,LINDY ZALESKI
L115315,MALLORY BURNSIDE
R126932,JODI RIVERA
H568569,JUSTIN HUGHES
B327498,CLAUDE AARON
R102145,JAMES SALAZAR
H510902,SKYE MOODY
D504872,YVETTE CHAVANA
F171298,MARK BRADSHAW
H590005,MARK BRADSHAW
Q793026,TAMMY ACKERLY
M204889,KARLA BAYONA
G132552,SCOTT PRY
M382505,RANDY MILLER
S161979,AMY PARSONS
S162177,DUNCAN WEBB
G146455,TIM STABLEIN
H175602,JAMES SALAZAR
S102910,LAEL WILDER
D784530,SARAH BLOXHAM
A140201,RUY D'AMICO
F333727,TAMMY ACKERLY
W711483,TERESA MOORE
P166277,TIM STABLEIN
D173546,JEFF OGAN
B621630,SHERRI KOPPOLD
C349584,YVAN COURNOYER
C395093,BEN COVARRUBIA
H290889,REX HOWELL-SMITH
L309631,CHRIS LEAL
S442319,STUART SHEFFER
W289595,KAREN SCHIFFMACHER
F333727,AMY PARSONS
M626280,JEFF ZALESKI
T177227,BILL TATE
S170300,RUSTY WOODLAND
O499150,KAREN SCHIFFMACHER
F333727,SHERRI KOPPOLD
L382278,THELMA CAVAZOS-TRIBBLE
R156567,RANIA DANIELS
H638197,CRISTINA PENA-WALLS
S354935,JAMES SALAZAR
D516299,RUY D'AMICO
B526845,SHERRI KOPPOLD
H335272,KIM TILL
S487245,BRANDI STONE
A126395,AUDRA TEEL
P293261,ERIK PATEK
D729722,ANDREA ATRIPALDI
R504041,MARK BRADSHAW
B163908,CHRIS LEAL
J505889,AMANDA ZIMMERMAN
T738172,ASHLEY BURRIS
I785607,CANDYCE CAVAZOS
M626280,NICK MCDONALD
A160147,MARK BRADSHAW
A651475,KARLA BAYONA
T124749,FRANCISCO SANCHEZ
L715856,MARK BRADSHAW
C169956,ARIANNE CAMP
M663199,MALLORY BURNSIDE
W145276,DUNCAN WEBB
P252695,AMY PARSONS
C438382,CANDYCE CAVAZOS
L168511,ANGELICA MARTINEZ
B596516,JEANNE TAMAYO
F622450,DAVID FIGLIOLA
M678904,JEANNE TAMAYO
K189079,SHERRI KOPPOLD
M186093,SKYE MOODY
H571348,ASHLEY BURRIS
B129525,SYLVIA EVERITT
P301025,CRISTINA PENA-WALLS
W149453,RUSTY WOODLAND
J348561,BRANDON JANES
D104832,JODI RIVERA
S320313,FRANCISCO SANCHEZ
M439726,SYLVIA EVERITT
R540780,JASON RADICH
R389071,AMY PARSONS
R551867,NEIL COCHRAN
K240819,DAVID KISER
S101014,KAREN SCHIFFMACHER
J166670,INA PERALES
R595112,BRANDI STONE
S487973,STEPHANIE AFFLERBACH
H186333,ANDY HENRIQUES
D103838,MARY DIPLACIDO
W112374,HUGO LIZARRAGA
R329030,CANDYCE CAVAZOS
A144304,CLAUDE AARON
M402377,LINDY ZALESKI
K619608,TAMMY ACKERLY
D138759,YVETTE CHAVANA
A127797,TAMMY ACKERLY
E175662,JENNIFER YOUNG
F333727,TOM SUCHENSKI
B316979,ERIN MAY
B509106,ASHLEY BURRIS
K644092,MARK BRADSHAW
M439726,YVAN COURNOYER
G108436,MARY DIPLACIDO
H796590,TAMMY ACKERLY
P165020,SCOTT PRY
J502643,DUNCAN WEBB
C457893,ELAN NGUYEN
T231912,TAMMY ACKERLY
B253867,MELISSA BRANIN
L187766,JEANNE TAMAYO
L184093,CHRIS LEAL
K103559,PAMELA KENNEY
B102366,ALAN BRIDGES
T223706,KIM TILL
M390364,CHRIS LEAL
W142707,MALLORY BURNSIDE
A115275,JENNIFER YOUNG
W240338,LAUREN WHEELER
M402377,RUY D'AMICO
C257904,YVETTE CHAVANA
O335933,AUSTIN MOORE
F380950,BEN COVARRUBIA
E127847,JON ENGLISH
M500853,RICK MULAC
D357370,NICK HUDEK
T138022,KAREN SCHIFFMACHER
B135374,TAMMY ACKERLY
J727724,KEITH JANOSIK
B158024,TOM SUCHENSKI
R257383,CHELSEA RHODES
I169876,ANDREW MARTIN
H398889,LORI HARN
C459944,SCOTT PRY
O207819,LAEL WILDER
M696677,RANDY MILLER
W169685,LAEL WILDER
C356579,TAMMY ACKERLY
O688558,AMY PARSONS
I324608,SARAH BLOXHAM
M537739,GRANT MOORE
F233861,CANDYCE CAVAZOS
C128838,ELAN NGUYEN
M304707,CORINE NORTH
M517388,ERIN MAY
M428846,RANDY MILLER
T122425,JEANNE TAMAYO
R604623,RANIA DANIELS
K156672,AUDRA TEEL
N282482,CORINE NORTH
R759185,BRETT RAMSEY
I276602,TIM STABLEIN
G590779,GRANT MOORE
B279376,YVETTE CHAVANA
F372270,GREG SALAZAR
C715828,AMANDA ZIMMERMAN
V228011,CHRISTINA KOCH
V228011,TAMMY ACKERLY
H287937,ARIANNE CAMP 
W284563,AMY PARSONS
F163355,MELISSA BRANIN
W741290,CANDYCE GARCIA
G143487,TAMERA SEALS
B158024,STACEY PARK
G183147,TOM SUCHENSKI
U115061,KRISTIN ALBERT
M114813,BRANDON JANES
B773504,CHRISTINA KOCH
M135588,KRISTIN ALBERT
L636565,LAUREN WHEELER
R513484,ARIANNE CAMP 
R513484,LAUREN WHEELER
A600104,MELISSA BRANIN
Z240081,ALYSSA STUMBERG
M486504,CANDYCE GARCIA
J113550,MALLORY BURNSIDE
M301978,LORI HARN
M301978,GUILEBALDO ELIZONDO
M301978,AMANDA ZIMMERMAN
M171234,ANDREW MARTIN
M171234,MATT SERRANO
M171234,NICK HUDEK
D306363,TIM STABLEIN
D306363,KAREN SCHIFFMACHER
S181225,JEFF OGAN
C570091,SKYE MOODY
