sku,season,version
1692443,COVID_1,1
560160,COVID_1,1
1025295,COVID_1,1
2146232,COVID_1,1
2483520,COVID_1,1
2160838,COVID_1,1
3950796,COVID_1,1
3135008,COVID_1,1
1040170,COVID_1,1
1865977,COVID_1,1
2120482,COVID_1,1
2175656,COVID_1,1
2042778,COVID_1,1
1976770,COVID_1,1
4216506,COVID_1,1
130292,COVID_1,1
2482568,COVID_1,1
1804766,COVID_1,1
1232734,COVID_1,1
1397632,COVID_1,1
582900,COVID_1,1
1832215,COVID_1,1
919149,COVID_1,1
2107931,COVID_1,1
2193398,COVID_1,1
1343267,COVID_1,1
1956901,COVID_1,1
2235247,COVID_1,1
2614528,COVID_1,1
377494,COVID_1,1
2209516,COVID_1,1
1390611,COVID_1,1
4421514,COVID_1,1
228117,COVID_1,1
2044359,COVID_1,1
1884460,COVID_1,1
2732092,COVID_1,1
2047521,COVID_1,1
2220833,COVID_1,1
1361929,COVID_1,1
1801456,COVID_1,1
1848089,COVID_1,1
1947237,COVID_1,1
1408662,COVID_1,1
2171887,COVID_1,1
2949511,COVID_1,1
1021220,COVID_1,1
2234671,COVID_1,1
1265064,COVID_1,1
2161119,COVID_1,1
372477,COVID_1,1
30054,COVID_1,1
1355317,COVID_1,1
1509355,COVID_1,1
2091794,COVID_1,1
735621,COVID_1,1
459571,COVID_1,1
2229866,COVID_1,1
1400790,COVID_1,1
246894,COVID_1,1
1859020,COVID_1,1
3066113,COVID_1,1
2865092,COVID_1,1
3097549,COVID_1,1
539930,COVID_1,1
3973011,COVID_1,1
1584671,COVID_1,1
2730544,COVID_1,1
3740030,COVID_1,1
2167761,COVID_1,1
374284,COVID_1,1
2180075,COVID_1,1
81510,COVID_1,1
2173139,COVID_1,1
2187842,COVID_1,1
1432120,COVID_1,1
852372,COVID_1,1
624284,COVID_1,1
2042944,COVID_1,1
2031192,COVID_1,1
3264033,COVID_1,1
3112546,COVID_1,1
3101508,COVID_1,1
1956897,COVID_1,1
1431206,COVID_1,1
3325054,COVID_1,1
220457,COVID_1,1
1947470,COVID_1,1
304643,COVID_1,1
83083,COVID_1,1
1626202,COVID_1,1
2205102,COVID_1,1
1967749,COVID_1,1
1995172,COVID_1,1
1486062,COVID_1,1
2053444,COVID_1,1
2134695,COVID_1,1
1999903,COVID_1,1
1779375,COVID_1,1
596413,COVID_1,1
2168182,COVID_1,1
1771683,COVID_1,1
2472517,COVID_1,1
2732093,COVID_1,1
2210789,COVID_1,1
1778988,COVID_1,1
1036170,COVID_1,1
2120600,COVID_1,1
1775847,COVID_1,1
912605,COVID_1,1
1460216,COVID_1,1
3097524,COVID_1,1
1881909,COVID_1,1
1669570,COVID_1,1
4010003,COVID_1,1
22919,COVID_1,1
1632190,COVID_1,1
1948532,COVID_1,1
541494,COVID_1,1
3974536,COVID_1,1
3730580,COVID_1,1
1535756,COVID_1,1
1944430,COVID_1,1
2868052,COVID_1,1
2601043,COVID_1,1
1853382,COVID_1,1
1629943,COVID_1,1
1976784,COVID_1,1
3321588,COVID_1,1
1868953,COVID_1,1
2083270,COVID_1,1
582879,COVID_1,1
1382936,COVID_1,1
1969655,COVID_1,1
939081,COVID_1,1
1703503,COVID_1,1
1103914,COVID_1,1
1286536,COVID_1,1
2128671,COVID_1,1
1226415,COVID_1,1
1853713,COVID_1,1
1687067,COVID_1,1
3810017,COVID_1,1
440737,COVID_1,1
1997278,COVID_1,1
1741914,COVID_1,1
2601034,COVID_1,1
1152166,COVID_1,1
696420,COVID_1,1
1853710,COVID_1,1
2135615,COVID_1,1
3659033,COVID_1,1
125019,COVID_1,1
302577,COVID_1,1
708155,COVID_1,1
1826883,COVID_1,1
2519532,COVID_1,1
2067013,COVID_1,1
2051692,COVID_1,1
940315,COVID_1,1
1932523,COVID_1,1
160278,COVID_1,1
2173963,COVID_1,1
245961,COVID_1,1
1504903,COVID_1,1
2296009,COVID_1,1
1235851,COVID_1,1
500821,COVID_1,1
2821533,COVID_1,1
2172487,COVID_1,1
583168,COVID_1,1
921751,COVID_1,1
1926545,COVID_1,1
2996525,COVID_1,1
2185357,COVID_1,1
3311048,COVID_1,1
708859,COVID_1,1
3606094,COVID_1,1
695265,COVID_1,1
2040010,COVID_1,1
1200254,COVID_1,1
862887,COVID_1,1
2107929,COVID_1,1
1456549,COVID_1,1
1825288,COVID_1,1
3849695,COVID_1,1
2227676,COVID_1,1
170358,COVID_1,1
1955055,COVID_1,1
1405359,COVID_1,1
1907986,COVID_1,1
1853141,COVID_1,1
596108,COVID_1,1
1655260,COVID_1,1
228114,COVID_1,1
1194731,COVID_1,1
2408539,COVID_1,1
1057193,COVID_1,1
2048043,COVID_1,1
4487020,COVID_1,1
1383298,COVID_1,1
143418,COVID_1,1
2864040,COVID_1,1
699312,COVID_1,1
1709795,COVID_1,1
1969654,COVID_1,1
3038074,COVID_1,1
2721080,COVID_1,1
1761064,COVID_1,1
116001,COVID_1,1
2074048,COVID_1,1
1638556,COVID_1,1
1660275,COVID_1,1
2047399,COVID_1,1
1900361,COVID_1,1
130290,COVID_1,1
1976787,COVID_1,1
1358071,COVID_1,1
115997,COVID_1,1
1634209,COVID_1,1
1877091,COVID_1,1
1819952,COVID_1,1
1905009,COVID_1,1
684100,COVID_1,1
1670612,COVID_1,1
2485552,COVID_1,1
1529378,COVID_1,1
2129273,COVID_1,1
4134017,COVID_1,1
3284006,COVID_1,1
2251573,COVID_1,1
1400786,COVID_1,1
1786662,COVID_1,1
1414637,COVID_1,1
2482566,COVID_1,1
2174398,COVID_1,1
252346,COVID_1,1
1826030,COVID_1,1
3391534,COVID_1,1
3398608,COVID_1,1
252345,COVID_1,1
318627,COVID_1,1
3871550,COVID_1,1
1346691,COVID_1,1
3122040,COVID_1,1
1792511,COVID_1,1
2078326,COVID_1,1
2909005,COVID_1,1
1584269,COVID_1,1
2114505,COVID_1,1
2084727,COVID_1,1
2217444,COVID_1,1
3077037,COVID_1,1
1577772,COVID_1,1
126136,COVID_1,1
2040594,COVID_1,1
1997270,COVID_1,1
1526614,COVID_1,1
2434095,COVID_1,1
581009,COVID_1,1
3815019,COVID_1,1
1769150,COVID_1,1
4252503,COVID_1,1
170384,COVID_1,1
613992,COVID_1,1
191628,COVID_1,1
1158047,COVID_1,1
79196,COVID_1,1
754413,COVID_1,1
888871,COVID_1,1
540107,COVID_1,1
87985,COVID_1,1
465322,COVID_1,1
1202518,COVID_1,1
3950800,COVID_1,1
940121,COVID_1,1
1704422,COVID_1,1
2962037,COVID_1,1
1617678,COVID_1,1
374302,COVID_1,1
939778,COVID_1,1
1400780,COVID_1,1
1431729,COVID_1,1
449847,COVID_1,1
2127370,COVID_1,1
1905420,COVID_1,1
311882,COVID_1,1
3438530,COVID_1,1
251854,COVID_1,1
151644,COVID_1,1
1604731,COVID_1,1
3412528,COVID_1,1
1929610,COVID_1,1
1920061,COVID_1,1
1261891,COVID_1,1
2136033,COVID_1,1
3974534,COVID_1,1
2048212,COVID_1,1
1786841,COVID_1,1
1947242,COVID_1,1
2886009,COVID_1,1
2233666,COVID_1,1
2067002,COVID_1,1
3900007,COVID_1,1
2485568,COVID_1,1
2230074,COVID_1,1
706206,COVID_1,1
2416508,COVID_1,1
1755393,COVID_1,1
2234636,COVID_1,1
1995151,COVID_1,1
2184246,COVID_1,1
1670940,COVID_1,1
2131660,COVID_1,1
2417041,COVID_1,1
3857089,COVID_1,1
1490058,COVID_1,1
486278,COVID_1,1
1665761,COVID_1,1
1795097,COVID_1,1
547285,COVID_1,1
2196443,COVID_1,1
1969645,COVID_1,1
4416594,COVID_1,1
1159307,COVID_1,1
2601044,COVID_1,1
2028025,COVID_1,1
1853105,COVID_1,1
1780287,COVID_1,1
1853139,COVID_1,1
4699049,COVID_1,1
2044563,COVID_1,1
2605583,COVID_1,1
1483449,COVID_1,1
2230419,COVID_1,1
675469,COVID_1,1
2185439,COVID_1,1
129151,COVID_1,1
3081517,COVID_1,1
1044773,COVID_1,1
1856390,COVID_1,1
3557508,COVID_1,1
1899727,COVID_1,1
2911508,COVID_1,1
4335518,COVID_1,1
1584890,COVID_1,1
2047560,COVID_1,1
2041223,COVID_1,1
2162588,COVID_1,1
2173248,COVID_1,1
2448576,COVID_1,1
1642095,COVID_1,1
1770764,COVID_1,1
1947510,COVID_1,1
1276583,COVID_1,1
1835804,COVID_1,1
2047431,COVID_1,1
607530,COVID_1,1
3264045,COVID_1,1
2105286,COVID_1,1
3480550,COVID_1,1
956878,COVID_1,1
374301,COVID_1,1
79200,COVID_1,1
246886,COVID_1,1
3781009,COVID_1,1
2086494,COVID_1,1
1995174,COVID_1,1
1375934,COVID_1,1
1853088,COVID_1,1
2047369,COVID_1,1
2647014,COVID_1,1
1097887,COVID_1,1
1809271,COVID_1,1
1457186,COVID_1,1
2316538,COVID_1,1
1549682,COVID_1,1
2039493,COVID_1,1
4006003,COVID_1,1
1342518,COVID_1,1
2230091,COVID_1,1
2175673,COVID_1,1
1646631,COVID_1,1
1674425,COVID_1,1
1956913,COVID_1,1
923328,COVID_1,1
708861,COVID_1,1
2136023,COVID_1,1
296990,COVID_1,1
1825297,COVID_1,1
3811019,COVID_1,1
1967164,COVID_1,1
3893560,COVID_1,1
1264923,COVID_1,1
1290182,COVID_1,1
1968458,COVID_1,1
1192688,COVID_1,1
2051706,COVID_1,1
372534,COVID_1,1
3088015,COVID_1,1
140817,COVID_1,1
461641,COVID_1,1
2483506,COVID_1,1
2127699,COVID_1,1
1456545,COVID_1,1
1280701,COVID_1,1
1038460,COVID_1,1
1804791,COVID_1,1
1976758,COVID_1,1
2127280,COVID_1,1
1932669,COVID_1,1
3107052,COVID_1,1
521178,COVID_1,1
3891055,COVID_1,1
256822,COVID_1,1
596415,COVID_1,1
78961,COVID_1,1
997929,COVID_1,1
486461,COVID_1,1
1947194,COVID_1,1
104613,COVID_1,1
1597050,COVID_1,1
3107050,COVID_1,1
1666477,COVID_1,1
2053677,COVID_1,1
1524640,COVID_1,1
1618261,COVID_1,1
78955,COVID_1,1
1232049,COVID_1,1
1657115,COVID_1,1
2351507,COVID_1,1
1838406,COVID_1,1
1810657,COVID_1,1
2125566,COVID_1,1
1905370,COVID_1,1
2114508,COVID_1,1
958223,COVID_1,1
2048210,COVID_1,1
2221963,COVID_1,1
1883128,COVID_1,1
3542036,COVID_1,1
1580190,COVID_1,1
2047558,COVID_1,1
2044349,COVID_1,1
1771459,COVID_1,1
1170641,COVID_1,1
1719133,COVID_1,1
126629,COVID_1,1
459391,COVID_1,1
1947210,COVID_1,1
3810054,COVID_1,1
1948855,COVID_1,1
888872,COVID_1,1
1653213,COVID_1,1
83594,COVID_1,1
1497483,COVID_1,1
1657864,COVID_1,1
1795364,COVID_1,1
1877037,COVID_1,1
1856428,COVID_1,1
1382937,COVID_1,1
1245431,COVID_1,1
1542868,COVID_1,1
372476,COVID_1,1
1976768,COVID_1,1
1802040,COVID_1,1
768307,COVID_1,1
1412106,COVID_1,1
2018893,COVID_1,1
2052276,COVID_1,1
1507715,COVID_1,1
3909066,COVID_1,1
1749948,COVID_1,1
1787144,COVID_1,1
1947880,COVID_1,1
2485540,COVID_1,1
2127680,COVID_1,1
2230478,COVID_1,1
1428761,COVID_1,1
1726519,COVID_1,1
1878571,COVID_1,1
30067,COVID_1,1
2166029,COVID_1,1
1485998,COVID_1,1
1645353,COVID_1,1
517914,COVID_1,1
1947506,COVID_1,1
1412930,COVID_1,1
3894547,COVID_1,1
1458454,COVID_1,1
2935506,COVID_1,1
374314,COVID_1,1
3849656,COVID_1,1
1638923,COVID_1,1
2086496,COVID_1,1
3139021,COVID_1,1
1235855,COVID_1,1
2128501,COVID_1,1
1372107,COVID_1,1
1887901,COVID_1,1
3086045,COVID_1,1
3810023,COVID_1,1
1594373,COVID_1,1
1724837,COVID_1,1
624285,COVID_1,1
1793165,COVID_1,1
647011,COVID_1,1
2228238,COVID_1,1
95110,COVID_1,1
2611520,COVID_1,1
1134259,COVID_1,1
1851576,COVID_1,1
1912015,COVID_1,1
2062557,COVID_1,1
596412,COVID_1,1
1877094,COVID_1,1
540324,COVID_1,1
735122,COVID_1,1
2174394,COVID_1,1
1853138,COVID_1,1
1704112,COVID_1,1
1143479,COVID_1,1
272020,COVID_1,1
1030312,COVID_1,1
1856429,COVID_1,1
2241840,COVID_1,1
1049778,COVID_1,1
129153,COVID_1,1
2959062,COVID_1,1
1718329,COVID_1,1
1769126,COVID_1,1
529638,COVID_1,1
1423436,COVID_1,1
1132749,COVID_1,1
3559020,COVID_1,1
1684204,COVID_1,1
696315,COVID_1,1
2127279,COVID_1,1
1867718,COVID_1,1
582699,COVID_1,1
1021303,COVID_1,1
2222866,COVID_1,1
3997016,COVID_1,1
2969046,COVID_1,1
3498016,COVID_1,1
1791093,COVID_1,1
1389439,COVID_1,1
794628,COVID_1,1
3101045,COVID_1,1
1492810,COVID_1,1
1912989,COVID_1,1
4412553,COVID_1,1
1743184,COVID_1,1
3728517,COVID_1,1
1755343,COVID_1,1
3189591,COVID_1,1
2485547,COVID_1,1
1666486,COVID_1,1
126124,COVID_1,1
1282093,COVID_1,1
313197,COVID_1,1
675470,COVID_1,1
2083308,COVID_1,1
1902930,COVID_1,1
163669,COVID_1,1
1694461,COVID_1,1
3260546,COVID_1,1
372332,COVID_1,1
2101612,COVID_1,1
1286080,COVID_1,1
2240089,COVID_1,1
1947329,COVID_1,1
1132750,COVID_1,1
4524058,COVID_1,1
1884676,COVID_1,1
1965441,COVID_1,1
1527452,COVID_1,1
1237751,COVID_1,1
2172072,COVID_1,1
1428824,COVID_1,1
4439758,COVID_1,1
1763522,COVID_1,1
2106098,COVID_1,1
4599001,COVID_1,1
3854051,COVID_1,1
2450051,COVID_1,1
1253629,COVID_1,1
2968095,COVID_1,1
1786928,COVID_1,1
2176985,COVID_1,1
1497485,COVID_1,1
4421512,COVID_1,1
3659035,COVID_1,1
1524641,COVID_1,1
2173904,COVID_1,1
509559,COVID_1,1
2698590,COVID_1,1
2105283,COVID_1,1
1748362,COVID_1,1
1245432,COVID_1,1
2173965,COVID_1,1
1887128,COVID_1,1
1884659,COVID_1,1
1146869,COVID_1,1
1559507,COVID_1,1
1947338,COVID_1,1
943506,COVID_1,1
1576282,COVID_1,1
3163538,COVID_1,1
1795356,COVID_1,1
2086470,COVID_1,1
1722155,COVID_1,1
2125237,COVID_1,1
2028693,COVID_1,1
2051703,COVID_1,1
2020362,COVID_1,1
2483504,COVID_1,1
2125738,COVID_1,1
2022626,COVID_1,1
3398607,COVID_1,1
3862504,COVID_1,1
2959515,COVID_1,1
1145126,COVID_1,1
4439760,COVID_1,1
3871510,COVID_1,1
3101016,COVID_1,1
1335731,COVID_1,1
1597054,COVID_1,1
647149,COVID_1,1
2031429,COVID_1,1
81509,COVID_1,1
1921014,COVID_1,1
2171994,COVID_1,1
1956906,COVID_1,1
2078324,COVID_1,1
1706614,COVID_1,1
561468,COVID_1,1
3659017,COVID_1,1
2666572,COVID_1,1
1656700,COVID_1,1
3089013,COVID_1,1
1634132,COVID_1,1
1627430,COVID_1,1
899190,COVID_1,1
1779837,COVID_1,1
3660006,COVID_1,1
1805874,COVID_1,1
2114506,COVID_1,1
2182041,COVID_1,1
2105284,COVID_1,1
3163543,COVID_1,1
3030049,COVID_1,1
1289514,COVID_1,1
2039426,COVID_1,1
126489,COVID_1,1
129159,COVID_1,1
4183569,COVID_1,1
1976767,COVID_1,1
716418,COVID_1,1
851560,COVID_1,1
1653125,COVID_1,1
4136016,COVID_1,1
2084705,COVID_1,1
1690292,COVID_1,1
581882,COVID_1,1
1428300,COVID_1,1
1669492,COVID_1,1
2048032,COVID_1,1
1534761,COVID_1,1
1520665,COVID_1,1
1011215,COVID_1,1
1061845,COVID_1,1
374362,COVID_1,1
2228039,COVID_1,1
152940,COVID_1,1
4506531,COVID_1,1
3857624,COVID_1,1
1583167,COVID_1,1
1804647,COVID_1,1
1361783,COVID_1,1
3750550,COVID_1,1
2047235,COVID_1,1
2156076,COVID_1,1
1863236,COVID_1,1
1805926,COVID_1,1
1582548,COVID_1,1
1274893,COVID_1,1
4412550,COVID_1,1
2171991,COVID_1,1
3131057,COVID_1,1
1133760,COVID_1,1
2630521,COVID_1,1
1425521,COVID_1,1
1969909,COVID_1,1
2199683,COVID_1,1
1604826,COVID_1,1
2239326,COVID_1,1
2519534,COVID_1,1
3593538,COVID_1,1
481240,COVID_1,1
1665100,COVID_1,1
2020719,COVID_1,1
2175981,COVID_1,1
1805673,COVID_1,1
1875182,COVID_1,1
2040012,COVID_1,1
1947881,COVID_1,1
185801,COVID_1,1
251699,COVID_1,1
4013530,COVID_1,1
1130029,COVID_1,1
1735844,COVID_1,1
1361794,COVID_1,1
1994665,COVID_1,1
1655560,COVID_1,1
2127277,COVID_1,1
3987511,COVID_1,1
1887899,COVID_1,1
2172665,COVID_1,1
1774104,COVID_1,1
1417849,COVID_1,1
1936976,COVID_1,1
3815021,COVID_1,1
1800988,COVID_1,1
379,COVID_1,1
1580692,COVID_1,1
1359803,COVID_1,1
482689,COVID_1,1
4221501,COVID_1,1
2083306,COVID_1,1
3810539,COVID_1,1
28246,COVID_1,1
1947260,COVID_1,1
3903585,COVID_1,1
2105583,COVID_1,1
2631007,COVID_1,1
3460075,COVID_1,1
1620352,COVID_1,1
2233662,COVID_1,1
1148392,COVID_1,1
760442,COVID_1,1
2160261,COVID_1,1
1509194,COVID_1,1
2217570,COVID_1,1
1828433,COVID_1,1
4736036,COVID_1,1
699311,COVID_1,1
4183578,COVID_1,1
2055703,COVID_1,1
4503503,COVID_1,1
1479863,COVID_1,1
272017,COVID_1,1
2184229,COVID_1,1
1969875,COVID_1,1
1847170,COVID_1,1
638867,COVID_1,1
1687818,COVID_1,1
1956911,COVID_1,1
493626,COVID_1,1
1029371,COVID_1,1
910677,COVID_1,1
3790045,COVID_1,1
576979,COVID_1,1
678523,COVID_1,1
1078930,COVID_1,1
2269337,COVID_1,1
1805658,COVID_1,1
1523495,COVID_1,1
1548407,COVID_1,1
1450601,COVID_1,1
634661,COVID_1,1
4487017,COVID_1,1
1631456,COVID_1,1
2051970,COVID_1,1
1994411,COVID_1,1
847538,COVID_1,1
1596988,COVID_1,1
318634,COVID_1,1
2053704,COVID_1,1
1414635,COVID_1,1
3759016,COVID_1,1
1499234,COVID_1,1
272007,COVID_1,1
2031381,COVID_1,1
1195310,COVID_1,1
2251084,COVID_1,1
1455310,COVID_1,1
1856394,COVID_1,1
2139258,COVID_1,1
3949013,COVID_1,1
1548406,COVID_1,1
4506520,COVID_1,1
459568,COVID_1,1
2934508,COVID_1,1
3916060,COVID_1,1
517915,COVID_1,1
1141904,COVID_1,1
421940,COVID_1,1
1582319,COVID_1,1
1826008,COVID_1,1
3112570,COVID_1,1
754608,COVID_1,1
693640,COVID_1,1
938523,COVID_1,1
2139128,COVID_1,1
1610008,COVID_1,1
440794,COVID_1,1
1358527,COVID_1,1
372325,COVID_1,1
2042600,COVID_1,1
991209,COVID_1,1
1671168,COVID_1,1
1358251,COVID_1,1
1688880,COVID_1,1
1049783,COVID_1,1
1290178,COVID_1,1
1576742,COVID_1,1
1703326,COVID_1,1
1393794,COVID_1,1
2239890,COVID_1,1
1694577,COVID_1,1
1864145,COVID_1,1
394961,COVID_1,1
126880,COVID_1,1
2480515,COVID_1,1
3104036,COVID_1,1
2125465,COVID_1,1
1883073,COVID_1,1
1158045,COVID_1,1
82459,COVID_1,1
1786421,COVID_1,1
3910037,COVID_1,1
2047557,COVID_1,1
3172508,COVID_1,1
1172712,COVID_1,1
1583113,COVID_1,1
2232480,COVID_1,1
2964652,COVID_1,1
4008506,COVID_1,1
2230075,COVID_1,1
372324,COVID_1,1
2048030,COVID_1,1
1502741,COVID_1,1
1158044,COVID_1,1
1653127,COVID_1,1
1586609,COVID_1,1
267224,COVID_1,1
2175837,COVID_1,1
2216795,COVID_1,1
1923576,COVID_1,1
1853697,COVID_1,1
2031376,COVID_1,1
978132,COVID_1,1
1686260,COVID_1,1
1853717,COVID_1,1
2472512,COVID_1,1
2217587,COVID_1,1
1805053,COVID_1,1
374296,COVID_1,1
447277,COVID_1,1
374364,COVID_1,1
2239328,COVID_1,1
3015599,COVID_1,1
703366,COVID_1,1
1920053,COVID_1,1
708858,COVID_1,1
1833116,COVID_1,1
3894539,COVID_1,1
1779396,COVID_1,1
3871553,COVID_1,1
30069,COVID_1,1
367984,COVID_1,1
1779839,COVID_1,1
3847026,COVID_1,1
3289704,COVID_1,1
2112222,COVID_1,1
1640457,COVID_1,1
2129266,COVID_1,1
4006005,COVID_1,1
1994666,COVID_1,1
4256502,COVID_1,1
2134690,COVID_1,1
1743189,COVID_1,1
1413383,COVID_1,1
1270808,COVID_1,1
4105516,COVID_1,1
1392614,COVID_1,1
1780289,COVID_1,1
2131656,COVID_1,1
95104,COVID_1,1
3773503,COVID_1,1
1036166,COVID_1,1
1666942,COVID_1,1
2221964,COVID_1,1
1856664,COVID_1,1
1795951,COVID_1,1
191624,COVID_1,1
301949,COVID_1,1
1746392,COVID_1,1
3443018,COVID_1,1
1827583,COVID_1,1
1545012,COVID_1,1
2055699,COVID_1,1
4449573,COVID_1,1
1582494,COVID_1,1
1755223,COVID_1,1
1887885,COVID_1,1
2184224,COVID_1,1
395886,COVID_1,1
3559114,COVID_1,1
1349091,COVID_1,1
1507719,COVID_1,1
794629,COVID_1,1
1099675,COVID_1,1
1427718,COVID_1,1
1853165,COVID_1,1
1552072,COVID_1,1
1535359,COVID_1,1
4409179,COVID_1,1
4130009,COVID_1,1
1612143,COVID_1,1
2933526,COVID_1,1
1657831,COVID_1,1
2300045,COVID_1,1
1920056,COVID_1,1
1901969,COVID_1,1
586418,COVID_1,1
1011580,COVID_1,1
1690930,COVID_1,1
1688819,COVID_1,1
2048211,COVID_1,1
2964532,COVID_1,1
3601033,COVID_1,1
2105279,COVID_1,1
1437073,COVID_1,1
129154,COVID_1,1
2033675,COVID_1,1
3586522,COVID_1,1
1527443,COVID_1,1
695266,COVID_1,1
220797,COVID_1,1
4183530,COVID_1,1
1999380,COVID_1,1
2045149,COVID_1,1
3722022,COVID_1,1
1943449,COVID_1,1
1559509,COVID_1,1
1948527,COVID_1,1
3195537,COVID_1,1
2173953,COVID_1,1
1878967,COVID_1,1
497775,COVID_1,1
31018,COVID_1,1
1771685,COVID_1,1
2055720,COVID_1,1
2130241,COVID_1,1
2132076,COVID_1,1
1460329,COVID_1,1
4191009,COVID_1,1
2093133,COVID_1,1
1220019,COVID_1,1
2209519,COVID_1,1
2209294,COVID_1,1
170381,COVID_1,1
2128669,COVID_1,1
1076607,COVID_1,1
677551,COVID_1,1
156415,COVID_1,1
4412528,COVID_1,1
367001,COVID_1,1
3857623,COVID_1,1
1265415,COVID_1,1
2448633,COVID_1,1
1641084,COVID_1,1
2129302,COVID_1,1
1456543,COVID_1,1
374273,COVID_1,1
956879,COVID_1,1
1245485,COVID_1,1
1956921,COVID_1,1
2849030,COVID_1,1
1805885,COVID_1,1
1976785,COVID_1,1
1341127,COVID_1,1
635181,COVID_1,1
1774555,COVID_1,1
1970346,COVID_1,1
493076,COVID_1,1
1669237,COVID_1,1
1853171,COVID_1,1
3997527,COVID_1,1
372991,COVID_1,1
2083640,COVID_1,1
1017980,COVID_1,1
1267784,COVID_1,1
1858991,COVID_1,1
1217257,COVID_1,1
2234669,COVID_1,1
1793621,COVID_1,1
1660282,COVID_1,1
1901965,COVID_1,1
2129693,COVID_1,1
1604717,COVID_1,1
1548410,COVID_1,1
4636091,COVID_1,1
293589,COVID_1,1
2269353,COVID_1,1
1947198,COVID_1,1
2482569,COVID_1,1
2171986,COVID_1,1
2094899,COVID_1,1
1878968,COVID_1,1
1956917,COVID_1,1
2048016,COVID_1,1
377478,COVID_1,1
2184248,COVID_1,1
1997440,COVID_1,1
1976755,COVID_1,1
3311038,COVID_1,1
2140792,COVID_1,1
1976774,COVID_1,1
2300041,COVID_1,1
1096673,COVID_1,1
1997274,COVID_1,1
2112227,COVID_1,1
1584850,COVID_1,1
1436990,COVID_1,1
1627891,COVID_1,1
2173135,COVID_1,1
2317003,COVID_1,1
1653910,COVID_1,1
2044325,COVID_1,1
3572050,COVID_1,1
2136030,COVID_1,1
83091,COVID_1,1
2616639,COVID_1,1
2601005,COVID_1,1
1190557,COVID_1,1
1234731,COVID_1,1
1538236,COVID_1,1
83595,COVID_1,1
1169638,COVID_1,1
1826059,COVID_1,1
1195306,COVID_1,1
1833882,COVID_1,1
1947291,COVID_1,1
587953,COVID_1,1
2647015,COVID_1,1
596122,COVID_1,1
3082014,COVID_1,1
1489061,COVID_1,1
1284124,COVID_1,1
1670925,COVID_1,1
1776254,COVID_1,1
1549689,COVID_1,1
949165,COVID_1,1
2225497,COVID_1,1
3472058,COVID_1,1
2043177,COVID_1,1
3317013,COVID_1,1
28127,COVID_1,1
1597055,COVID_1,1
4506545,COVID_1,1
1200360,COVID_1,1
1858210,COVID_1,1
2177375,COVID_1,1
115991,COVID_1,1
934852,COVID_1,1
2613549,COVID_1,1
1389851,COVID_1,1
1864144,COVID_1,1
1857426,COVID_1,1
2242927,COVID_1,1
2822039,COVID_1,1
1928461,COVID_1,1
1412111,COVID_1,1
1389437,COVID_1,1
2020399,COVID_1,1
2907532,COVID_1,1
455073,COVID_1,1
1345075,COVID_1,1
2205091,COVID_1,1
1690992,COVID_1,1
1448561,COVID_1,1
4406529,COVID_1,1
1597047,COVID_1,1
2144539,COVID_1,1
3973008,COVID_1,1
2184344,COVID_1,1
1694490,COVID_1,1
1025325,COVID_1,1
1847862,COVID_1,1
2047561,COVID_1,1
1490239,COVID_1,1
1535361,COVID_1,1
2053401,COVID_1,1
1586226,COVID_1,1
1804789,COVID_1,1
2220834,COVID_1,1
997366,COVID_1,1
1430248,COVID_1,1
1811165,COVID_1,1
1686108,COVID_1,1
1604709,COVID_1,1
1883085,COVID_1,1
719668,COVID_1,1
2054847,COVID_1,1
3317012,COVID_1,1
130287,COVID_1,1
2140138,COVID_1,1
551799,COVID_1,1
1782532,COVID_1,1
1815323,COVID_1,1
1424460,COVID_1,1
2242014,COVID_1,1
440736,COVID_1,1
1669236,COVID_1,1
2047410,COVID_1,1
2047430,COVID_1,1
2127285,COVID_1,1
1021227,COVID_1,1
1822600,COVID_1,1
459564,COVID_1,1
4733029,COVID_1,1
1788694,COVID_1,1
3111555,COVID_1,1
3593536,COVID_1,1
855406,COVID_1,1
125020,COVID_1,1
590844,COVID_1,1
1899003,COVID_1,1
883887,COVID_1,1
1886842,COVID_1,1
1816554,COVID_1,1
1666984,COVID_1,1
246895,COVID_1,1
1875181,COVID_1,1
2125456,COVID_1,1
1627804,COVID_1,1
1078931,COVID_1,1
1928337,COVID_1,1
1855918,COVID_1,1
734999,COVID_1,1
946183,COVID_1,1
1969021,COVID_1,1
1947324,COVID_1,1
1485993,COVID_1,1
681713,COVID_1,1
1779262,COVID_1,1
1826058,COVID_1,1
2125737,COVID_1,1
1634130,COVID_1,1
3264046,COVID_1,1
3829062,COVID_1,1
1274894,COVID_1,1
2228013,COVID_1,1
1261271,COVID_1,1
4502026,COVID_1,1
4083017,COVID_1,1
3800533,COVID_1,1
1936899,COVID_1,1
1279781,COVID_1,1
3987508,COVID_1,1
1919050,COVID_1,1
1036171,COVID_1,1
1431211,COVID_1,1
1753223,COVID_1,1
1250540,COVID_1,1
3690094,COVID_1,1
2216268,COVID_1,1
126746,COVID_1,1
2047446,COVID_1,1
250386,COVID_1,1
95034,COVID_1,1
2118172,COVID_1,1
125619,COVID_1,1
3081514,COVID_1,1
2601039,COVID_1,1
1584847,COVID_1,1
1802175,COVID_1,1
1961692,COVID_1,1
2160929,COVID_1,1
2064981,COVID_1,1
1510704,COVID_1,1
1425515,COVID_1,1
1237188,COVID_1,1
1621871,COVID_1,1
1856392,COVID_1,1
2114507,COVID_1,1
3187065,COVID_1,1
2173113,COVID_1,1
2053683,COVID_1,1
2758006,COVID_1,1
2240096,COVID_1,1
3044522,COVID_1,1
126108,COVID_1,1
762397,COVID_1,1
1718987,COVID_1,1
1425520,COVID_1,1
153141,COVID_1,1
1099179,COVID_1,1
3477054,COVID_1,1
1976775,COVID_1,1
1911928,COVID_1,1
3894033,COVID_1,1
1458449,COVID_1,1
4574088,COVID_1,1
2138899,COVID_1,1
3264040,COVID_1,1
1928375,COVID_1,1
691401,COVID_1,1
126638,COVID_1,1
1146871,COVID_1,1
2047545,COVID_1,1
2047378,COVID_1,1
453074,COVID_1,1
1549674,COVID_1,1
1813853,COVID_1,1
1956907,COVID_1,1
596096,COVID_1,1
1691298,COVID_1,1
1202926,COVID_1,1
2519526,COVID_1,1
2047522,COVID_1,1
1346918,COVID_1,1
1787025,COVID_1,1
2043623,COVID_1,1
2047559,COVID_1,1
1612038,COVID_1,1
1761483,COVID_1,1
2174396,COVID_1,1
2043579,COVID_1,1
2047544,COVID_1,1
1162887,COVID_1,1
1743122,COVID_1,1
148449,COVID_1,1
4095510,COVID_1,1
1915892,COVID_1,1
1776015,COVID_1,1
3559130,COVID_1,1
2132079,COVID_1,1
1137508,COVID_1,1
4105519,COVID_1,1
1762739,COVID_1,1
2996520,COVID_1,1
1769828,COVID_1,1
1200256,COVID_1,1
2053696,COVID_1,1
927756,COVID_1,1
2173955,COVID_1,1
1939806,COVID_1,1
185803,COVID_1,1
84461,COVID_1,1
3654062,COVID_1,1
549966,COVID_1,1
2178379,COVID_1,1
727867,COVID_1,1
1497481,COVID_1,1
531710,COVID_1,1
1947190,COVID_1,1
2228240,COVID_1,1
2055731,COVID_1,1
1762751,COVID_1,1
374270,COVID_1,1
601415,COVID_1,1
4391592,COVID_1,1
2662001,COVID_1,1
635024,COVID_1,1
2161180,COVID_1,1
2191508,COVID_1,1
4412548,COVID_1,1
756730,COVID_1,1
300697,COVID_1,1
1947269,COVID_1,1
665523,COVID_1,1
1706340,COVID_1,1
735000,COVID_1,1
3654509,COVID_1,1
1783265,COVID_1,1
1097889,COVID_1,1
2179338,COVID_1,1
764548,COVID_1,1
2319516,COVID_1,1
2064965,COVID_1,1
22917,COVID_1,1
2094414,COVID_1,1
127315,COVID_1,1
3533061,COVID_1,1
1622987,COVID_1,1
2144267,COVID_1,1
1725675,COVID_1,1
2494514,COVID_1,1
1338785,COVID_1,1
1786925,COVID_1,1
2064957,COVID_1,1
2822037,COVID_1,1
4421513,COVID_1,1
459569,COVID_1,1
2020750,COVID_1,1
1664124,COVID_1,1
1634133,COVID_1,1
1349088,COVID_1,1
2327064,COVID_1,1
3318551,COVID_1,1
1787180,COVID_1,1
4506522,COVID_1,1
1245428,COVID_1,1
1782520,COVID_1,1
1973763,COVID_1,1
2494508,COVID_1,1
3729011,COVID_1,1
1577903,COVID_1,1
3939522,COVID_1,1
1583076,COVID_1,1
1412659,COVID_1,1
2232479,COVID_1,1
4136018,COVID_1,1
1509761,COVID_1,1
852374,COVID_1,1
3894050,COVID_1,1
4105517,COVID_1,1
3224525,COVID_1,1
1622990,COVID_1,1
944346,COVID_1,1
1288869,COVID_1,1
1017077,COVID_1,1
2635010,COVID_1,1
1795519,COVID_1,1
2200468,COVID_1,1
4335522,COVID_1,1
3264037,COVID_1,1
2872022,COVID_1,1
1374899,COVID_1,1
1738955,COVID_1,1
1999377,COVID_1,1
4183517,COVID_1,1
1853114,COVID_1,1
2058784,COVID_1,1
1192926,COVID_1,1
1772908,COVID_1,1
1929367,COVID_1,1
475136,COVID_1,1
979593,COVID_1,1
4231535,COVID_1,1
1972662,COVID_1,1
942499,COVID_1,1
581405,COVID_1,1
1629691,COVID_1,1
1640454,COVID_1,1
894433,COVID_1,1
637199,COVID_1,1
2217997,COVID_1,1
2039485,COVID_1,1
1526612,COVID_1,1
1006875,COVID_1,1
1510707,COVID_1,1
1662044,COVID_1,1
486279,COVID_1,1
2146720,COVID_1,1
4438116,COVID_1,1
3587602,COVID_1,1
2089078,COVID_1,1
2172085,COVID_1,1
721028,COVID_1,1
3857081,COVID_1,1
1735840,COVID_1,1
1622984,COVID_1,1
1422057,COVID_1,1
2238606,COVID_1,1
1630688,COVID_1,1
2371511,COVID_1,1
1923570,COVID_1,1
1947308,COVID_1,1
2198164,COVID_1,1
2173969,COVID_1,1
2160845,COVID_1,1
2129301,COVID_1,1
946184,COVID_1,1
1086944,COVID_1,1
2140784,COVID_1,1
3904510,COVID_1,1
1158043,COVID_1,1
1838395,COVID_1,1
374287,COVID_1,1
183253,COVID_1,1
1923093,COVID_1,1
719671,COVID_1,1
1257838,COVID_1,1
1826886,COVID_1,1
1689325,COVID_1,1
1456412,COVID_1,1
1793982,COVID_1,1
2162178,COVID_1,1
116002,COVID_1,1
2120961,COVID_1,1
3690095,COVID_1,1
1877040,COVID_1,1
1816561,COVID_1,1
3659010,COVID_1,1
2093131,COVID_1,1
1152165,COVID_1,1
1619579,COVID_1,1
940317,COVID_1,1
3443045,COVID_1,1
78954,COVID_1,1
509406,COVID_1,1
1856420,COVID_1,1
1660286,COVID_1,1
713796,COVID_1,1
1952155,COVID_1,1
1202834,COVID_1,1
1061847,COVID_1,1
1976759,COVID_1,1
2230070,COVID_1,1
754607,COVID_1,1
2087973,COVID_1,1
691256,COVID_1,1
958487,COVID_1,1
4574083,COVID_1,1
3260547,COVID_1,1
1947313,COVID_1,1
1216736,COVID_1,1
1811163,COVID_1,1
2105281,COVID_1,1
3587061,COVID_1,1
115983,COVID_1,1
1499232,COVID_1,1
28160,COVID_1,1
1141912,COVID_1,1
176428,COVID_1,1
2199681,COVID_1,1
2222856,COVID_1,1
2601025,COVID_1,1
1999346,COVID_1,1
3775509,COVID_1,1
1666482,COVID_1,1
2251570,COVID_1,1
1856356,COVID_1,1
1029471,COVID_1,1
2217992,COVID_1,1
1743125,COVID_1,1
2599549,COVID_1,1
1492894,COVID_1,1
1583068,COVID_1,1
2128336,COVID_1,1
3078663,COVID_1,1
2078310,COVID_1,1
2128672,COVID_1,1
2051356,COVID_1,1
93644,COVID_1,1
1660279,COVID_1,1
3097512,COVID_1,1
681881,COVID_1,1
1549665,COVID_1,1
473207,COVID_1,1
2230395,COVID_1,1
2207998,COVID_1,1
122939,COVID_1,1
2707525,COVID_1,1
2020718,COVID_1,1
1749702,COVID_1,1
2118642,COVID_1,1
3077526,COVID_1,1
2964546,COVID_1,1
1510885,COVID_1,1
2086429,COVID_1,1
2327027,COVID_1,1
946182,COVID_1,1
1750893,COVID_1,1
1838399,COVID_1,1
1809048,COVID_1,1
4384511,COVID_1,1
4303640,COVID_1,1
130649,COVID_1,1
130288,COVID_1,1
3189019,COVID_1,1
1887889,COVID_1,1
3596505,COVID_1,1
313273,COVID_1,1
126255,COVID_1,1
1853148,COVID_1,1
1687793,COVID_1,1
1485997,COVID_1,1
708862,COVID_1,1
3022512,COVID_1,1
2055712,COVID_1,1
3391542,COVID_1,1
1261586,COVID_1,1
1646630,COVID_1,1
915776,COVID_1,1
3593537,COVID_1,1
2028026,COVID_1,1
2482561,COVID_1,1
2466571,COVID_1,1
1632370,COVID_1,1
1442638,COVID_1,1
185888,COVID_1,1
1948423,COVID_1,1
2232877,COVID_1,1
4412560,COVID_1,1
1142401,COVID_1,1
1237841,COVID_1,1
978131,COVID_1,1
1854711,COVID_1,1
2040091,COVID_1,1
2251569,COVID_1,1
2187864,COVID_1,1
148430,COVID_1,1
1969908,COVID_1,1
4010002,COVID_1,1
3104033,COVID_1,1
545930,COVID_1,1
2347046,COVID_1,1
1390003,COVID_1,1
4240507,COVID_1,1
1686109,COVID_1,1
4010004,COVID_1,1
2243355,COVID_1,1
2160083,COVID_1,1
4439766,COVID_1,1
2927053,COVID_1,1
372402,COVID_1,1
1290170,COVID_1,1
1454096,COVID_1,1
1956918,COVID_1,1
2027828,COVID_1,1
1408869,COVID_1,1
3550539,COVID_1,1
1584875,COVID_1,1
2045401,COVID_1,1
4183505,COVID_1,1
1814313,COVID_1,1
2047423,COVID_1,1
1127293,COVID_1,1
188676,COVID_1,1
695263,COVID_1,1
1795293,COVID_1,1
1694493,COVID_1,1
1952156,COVID_1,1
956883,COVID_1,1
2210078,COVID_1,1
1748361,COVID_1,1
3320078,COVID_1,1
1825965,COVID_1,1
1006876,COVID_1,1
2964534,COVID_1,1
2448564,COVID_1,1
1805914,COVID_1,1
78962,COVID_1,1
1976777,COVID_1,1
1419265,COVID_1,1
1361782,COVID_1,1
2055656,COVID_1,1
2988547,COVID_1,1
116012,COVID_1,1
3810520,COVID_1,1
1776585,COVID_1,1
1431033,COVID_1,1
3797007,COVID_1,1
2217450,COVID_1,1
696422,COVID_1,1
1638612,COVID_1,1
1226290,COVID_1,1
160146,COVID_1,1
1943790,COVID_1,1
3139024,COVID_1,1
3086506,COVID_1,1
313195,COVID_1,1
2129409,COVID_1,1
2047550,COVID_1,1
2173909,COVID_1,1
2068858,COVID_1,1
1450603,COVID_1,1
3112536,COVID_1,1
1853152,COVID_1,1
4506546,COVID_1,1
1763528,COVID_1,1
2635014,COVID_1,1
1812451,COVID_1,1
939435,COVID_1,1
296992,COVID_1,1
1859001,COVID_1,1
148485,COVID_1,1
2107932,COVID_1,1
1238536,COVID_1,1
2601036,COVID_1,1
2988538,COVID_1,1
586419,COVID_1,1
1956916,COVID_1,1
160172,COVID_1,1
1838394,COVID_1,1
2055702,COVID_1,1
2217451,COVID_1,1
372463,COVID_1,1
78960,COVID_1,1
2029084,COVID_1,1
1021213,COVID_1,1
2172685,COVID_1,1
2105582,COVID_1,1
1427744,COVID_1,1
4412562,COVID_1,1
2030921,COVID_1,1
1213526,COVID_1,1
1947219,COVID_1,1
128531,COVID_1,1
29068,COVID_1,1
648618,COVID_1,1
1887302,COVID_1,1
3862501,COVID_1,1
453904,COVID_1,1
3542041,COVID_1,1
2179231,COVID_1,1
2220071,COVID_1,1
2698588,COVID_1,1
126621,COVID_1,1
372475,COVID_1,1
2653109,COVID_1,1
1583086,COVID_1,1
2138249,COVID_1,1
1363891,COVID_1,1
1417036,COVID_1,1
1977333,COVID_1,1
2130238,COVID_1,1
3891057,COVID_1,1
648616,COVID_1,1
2205097,COVID_1,1
374295,COVID_1,1
1508830,COVID_1,1
665526,COVID_1,1
956882,COVID_1,1
2519529,COVID_1,1
374309,COVID_1,1
2416507,COVID_1,1
713793,COVID_1,1
2908520,COVID_1,1
3731502,COVID_1,1
1021223,COVID_1,1
1969649,COVID_1,1
4502027,COVID_1,1
927755,COVID_1,1
1482757,COVID_1,1
374412,COVID_1,1
79197,COVID_1,1
2171976,COVID_1,1
1901819,COVID_1,1
2217588,COVID_1,1
1640453,COVID_1,1
1904616,COVID_1,1
1811162,COVID_1,1
1956915,COVID_1,1
2865097,COVID_1,1
665521,COVID_1,1
1967325,COVID_1,1
2020754,COVID_1,1
2172498,COVID_1,1
2105291,COVID_1,1
1917798,COVID_1,1
1875954,COVID_1,1
1947218,COVID_1,1
547744,COVID_1,1
1582495,COVID_1,1
87984,COVID_1,1
2031147,COVID_1,1
1141909,COVID_1,1
1704234,COVID_1,1
1508742,COVID_1,1
1553075,COVID_1,1
2240097,COVID_1,1
3015602,COVID_1,1
1489266,COVID_1,1
1994663,COVID_1,1
1969911,COVID_1,1
2041501,COVID_1,1
1522818,COVID_1,1
2040498,COVID_1,1
1957369,COVID_1,1
2601041,COVID_1,1
1501405,COVID_1,1
4330665,COVID_1,1
630716,COVID_1,1
2158237,COVID_1,1
79198,COVID_1,1
372323,COVID_1,1
1634146,COVID_1,1
2872021,COVID_1,1
1793156,COVID_1,1
1727224,COVID_1,1
1928464,COVID_1,1
482691,COVID_1,1
1976776,COVID_1,1
1907988,COVID_1,1
3987513,COVID_1,1
2050734,COVID_1,1
2102038,COVID_1,1
2180711,COVID_1,1
1606431,COVID_1,1
2018780,COVID_1,1
3055505,COVID_1,1
1345880,COVID_1,1
2048029,COVID_1,1
1736996,COVID_1,1
1932532,COVID_1,1
3587057,COVID_1,1
1833842,COVID_1,1
1905395,COVID_1,1
1584854,COVID_1,1
2217989,COVID_1,1
2217984,COVID_1,1
781076,COVID_1,1
2167766,COVID_1,1
1235849,COVID_1,1
1901658,COVID_1,1
2118170,COVID_1,1
1586599,COVID_1,1
1905008,COVID_1,1
2060018,COVID_1,1
1665096,COVID_1,1
1599464,COVID_1,1
1349739,COVID_1,1
1976769,COVID_1,1
1574616,COVID_1,1
2039587,COVID_1,1
122947,COVID_1,1
2647021,COVID_1,1
958907,COVID_1,1
4187581,COVID_1,1
1775825,COVID_1,1
3077523,COVID_1,1
372460,COVID_1,1
2220197,COVID_1,1
4369501,COVID_1,1
2173165,COVID_1,1
1878721,COVID_1,1
1788501,COVID_1,1
3100517,COVID_1,1
149475,COVID_1,1
1939840,COVID_1,1
1579493,COVID_1,1
2187840,COVID_1,1
463821,COVID_1,1
1857295,COVID_1,1
2047440,COVID_1,1
148369,COVID_1,1
753285,COVID_1,1
1132848,COVID_1,1
372998,COVID_1,1
251673,COVID_1,1
1912009,COVID_1,1
1862362,COVID_1,1
716420,COVID_1,1
2218000,COVID_1,1
1256225,COVID_1,1
296989,COVID_1,1
199410,COVID_1,1
2507034,COVID_1,1
1237628,COVID_1,1
1647106,COVID_1,1
3391532,COVID_1,1
735614,COVID_1,1
2172683,COVID_1,1
1025329,COVID_1,1
2105294,COVID_1,1
1724838,COVID_1,1
1158042,COVID_1,1
3289701,COVID_1,1
3659031,COVID_1,1
2160937,COVID_1,1
1704108,COVID_1,1
1819945,COVID_1,1
81425,COVID_1,1
992832,COVID_1,1
1432122,COVID_1,1
2129753,COVID_1,1
372469,COVID_1,1
3849699,COVID_1,1
2232489,COVID_1,1
1450604,COVID_1,1
1587498,COVID_1,1
4439763,COVID_1,1
1947231,COVID_1,1
547299,COVID_1,1
1508994,COVID_1,1
2217591,COVID_1,1
1762754,COVID_1,1
1801675,COVID_1,1
2044567,COVID_1,1
4069514,COVID_1,1
2135479,COVID_1,1
1442646,COVID_1,1
1055317,COVID_1,1
1447528,COVID_1,1
78990,COVID_1,1
3973012,COVID_1,1
3494032,COVID_1,1
1479864,COVID_1,1
4007006,COVID_1,1
1619224,COVID_1,1
2047433,COVID_1,1
2061529,COVID_1,1
126619,COVID_1,1
3971004,COVID_1,1
1021621,COVID_1,1
3249594,COVID_1,1
1968485,COVID_1,1
2239322,COVID_1,1
677550,COVID_1,1
1597120,COVID_1,1
275380,COVID_1,1
2048033,COVID_1,1
2053692,COVID_1,1
2055736,COVID_1,1
170347,COVID_1,1
1689256,COVID_1,1
2015871,COVID_1,1
2047435,COVID_1,1
2269342,COVID_1,1
284410,COVID_1,1
613994,COVID_1,1
2084720,COVID_1,1
474848,COVID_1,1
3264039,COVID_1,1
534442,COVID_1,1
2129407,COVID_1,1
1807140,COVID_1,1
499588,COVID_1,1
3108514,COVID_1,1
1752305,COVID_1,1
2988541,COVID_1,1
1838410,COVID_1,1
1530602,COVID_1,1
1969652,COVID_1,1
116460,COVID_1,1
127092,COVID_1,1
762396,COVID_1,1
2138898,COVID_1,1
2822015,COVID_1,1
1923075,COVID_1,1
1854945,COVID_1,1
1967334,COVID_1,1
1431787,COVID_1,1
2130249,COVID_1,1
2044169,COVID_1,1
1766429,COVID_1,1
2821530,COVID_1,1
3969028,COVID_1,1
2242013,COVID_1,1
3587601,COVID_1,1
1853572,COVID_1,1
1202928,COVID_1,1
3107051,COVID_1,1
1689252,COVID_1,1
2084762,COVID_1,1
1531091,COVID_1,1
1579673,COVID_1,1
1290181,COVID_1,1
779102,COVID_1,1
1604822,COVID_1,1
149480,COVID_1,1
1555899,COVID_1,1
2086446,COVID_1,1
2068851,COVID_1,1
2473004,COVID_1,1
2084726,COVID_1,1
1739253,COVID_1,1
1568101,COVID_1,1
1838002,COVID_1,1
2028027,COVID_1,1
1456397,COVID_1,1
126450,COVID_1,1
1431786,COVID_1,1
2139127,COVID_1,1
1061841,COVID_1,1
1264920,COVID_1,1
2129286,COVID_1,1
1964758,COVID_1,1
1972840,COVID_1,1
1899969,COVID_1,1
1809047,COVID_1,1
1905012,COVID_1,1
1049777,COVID_1,1
1976782,COVID_1,1
3586154,COVID_1,1
2984596,COVID_1,1
1902928,COVID_1,1
2843116,COVID_1,1
1956924,COVID_1,1
1779842,COVID_1,1
2294015,COVID_1,1
2168175,COVID_1,1
1491629,COVID_1,1
2135484,COVID_1,1
3561001,COVID_1,1
4007515,COVID_1,1
2171990,COVID_1,1
2179795,COVID_1,1
4508525,COVID_1,1
2158250,COVID_1,1
374310,COVID_1,1
2140796,COVID_1,1
1580735,COVID_1,1
151650,COVID_1,1
4330660,COVID_1,1
708860,COVID_1,1
2225535,COVID_1,1
558977,COVID_1,1
1095594,COVID_1,1
1019790,COVID_1,1
1826063,COVID_1,1
2949512,COVID_1,1
1963723,COVID_1,1
1420098,COVID_1,1
499289,COVID_1,1
2230093,COVID_1,1
1200263,COVID_1,1
1737016,COVID_1,1
4502025,COVID_1,1
2105293,COVID_1,1
596124,COVID_1,1
1849101,COVID_1,1
1640324,COVID_1,1
374,COVID_1,1
1042831,COVID_1,1
81422,COVID_1,1
2185358,COVID_1,1
1921790,COVID_1,1
1349015,COVID_1,1
780955,COVID_1,1
2864042,COVID_1,1
1706604,COVID_1,1
556781,COVID_1,1
2129300,COVID_1,1
2086473,COVID_1,1
1907987,COVID_1,1
1878972,COVID_1,1
1773843,COVID_1,1
2220829,COVID_1,1
2217610,COVID_1,1
1878720,COVID_1,1
1918641,COVID_1,1
1905658,COVID_1,1
1474140,COVID_1,1
2125064,COVID_1,1
1948516,COVID_1,1
2713033,COVID_1,1
1202813,COVID_1,1
1741582,COVID_1,1
1963743,COVID_1,1
585008,COVID_1,1
1967161,COVID_1,1
1969653,COVID_1,1
127083,COVID_1,1
1457191,COVID_1,1
4438117,COVID_1,1
2047411,COVID_1,1
514719,COVID_1,1
375,COVID_1,1
1670562,COVID_1,1
1510699,COVID_1,1
3107046,COVID_1,1
2045384,COVID_1,1
1379864,COVID_1,1
2172070,COVID_1,1
1976761,COVID_1,1
1627460,COVID_1,1
3391561,COVID_1,1
3561002,COVID_1,1
4421515,COVID_1,1
1122421,COVID_1,1
1707691,COVID_1,1
1447527,COVID_1,1
2475561,COVID_1,1
1849549,COVID_1,1
1826060,COVID_1,1
1290183,COVID_1,1
1522817,COVID_1,1
381,COVID_1,1
2138900,COVID_1,1
246890,COVID_1,1
3550009,COVID_1,1
1482939,COVID_1,1
2220173,COVID_1,1
2022263,COVID_1,1
2962040,COVID_1,1
1898497,COVID_1,1
2984598,COVID_1,1
1953906,COVID_1,1
1423437,COVID_1,1
1140586,COVID_1,1
586499,COVID_1,1
1259932,COVID_1,1
1660276,COVID_1,1
1976772,COVID_1,1
1260656,COVID_1,1
2239904,COVID_1,1
372468,COVID_1,1
482686,COVID_1,1
1497468,COVID_1,1
2713032,COVID_1,1
3759014,COVID_1,1
1916492,COVID_1,1
2113996,COVID_1,1
2117762,COVID_1,1
542540,COVID_1,1
1788708,COVID_1,1
3317010,COVID_1,1
735613,COVID_1,1
1853571,COVID_1,1
83084,COVID_1,1
1850809,COVID_1,1
1722123,COVID_1,1
754412,COVID_1,1
1602002,COVID_1,1
3849658,COVID_1,1
3811025,COVID_1,1
1489104,COVID_1,1
1955613,COVID_1,1
2160932,COVID_1,1
2448591,COVID_1,1
1776889,COVID_1,1
1398499,COVID_1,1
2996521,COVID_1,1
1704232,COVID_1,1
3267536,COVID_1,1
170365,COVID_1,1
1620503,COVID_1,1
3412526,COVID_1,1
1200264,COVID_1,1
1584751,COVID_1,1
1743126,COVID_1,1
1923077,COVID_1,1
306471,COVID_1,1
2473006,COVID_1,1
1864065,COVID_1,1
1582777,COVID_1,1
2964645,COVID_1,1
2127313,COVID_1,1
2115723,COVID_1,1
1932493,COVID_1,1
126623,COVID_1,1
1193206,COVID_1,1
1286082,COVID_1,1
3270511,COVID_1,1
2045140,COVID_1,1
127958,COVID_1,1
1848094,COVID_1,1
2174915,COVID_1,1
2044354,COVID_1,1
1431213,COVID_1,1
2171933,COVID_1,1
1082647,COVID_1,1
3391558,COVID_1,1
1956909,COVID_1,1
2964550,COVID_1,1
1976764,COVID_1,1
95037,COVID_1,1
1926539,COVID_1,1
1775852,COVID_1,1
1375853,COVID_1,1
1493803,COVID_1,1
1103915,COVID_1,1
3950789,COVID_1,1
1646632,COVID_1,1
2139996,COVID_1,1
1577811,COVID_1,1
1383303,COVID_1,1
1744357,COVID_1,1
1425421,COVID_1,1
1657979,COVID_1,1
2822040,COVID_1,1
130285,COVID_1,1
4330688,COVID_1,1
545933,COVID_1,1
2048074,COVID_1,1
939780,COVID_1,1
2173962,COVID_1,1
719783,COVID_1,1
1454097,COVID_1,1
1849108,COVID_1,1
122945,COVID_1,1
228101,COVID_1,1
1049904,COVID_1,1
87994,COVID_1,1
3974009,COVID_1,1
372471,COVID_1,1
1639566,COVID_1,1
1965355,COVID_1,1
170359,COVID_1,1
545418,COVID_1,1
1145124,COVID_1,1
3994532,COVID_1,1
1899001,COVID_1,1
1893056,COVID_1,1
1687893,COVID_1,1
1687828,COVID_1,1
482692,COVID_1,1
661318,COVID_1,1
1467883,COVID_1,1
1755131,COVID_1,1
2408538,COVID_1,1
374311,COVID_1,1
939049,COVID_1,1
1812426,COVID_1,1
2107188,COVID_1,1
2161330,COVID_1,1
490370,COVID_1,1
1837410,COVID_1,1
2047424,COVID_1,1
2175641,COVID_1,1
1216732,COVID_1,1
2220826,COVID_1,1
984135,COVID_1,1
607058,COVID_1,1
775714,COVID_1,1
1743124,COVID_1,1
1224866,COVID_1,1
1192934,COVID_1,1
1157967,COVID_1,1
1099181,COVID_1,1
2222373,COVID_1,1
2226865,COVID_1,1
544741,COVID_1,1
1777871,COVID_1,1
4315003,COVID_1,1
1601998,COVID_1,1
1960782,COVID_1,1
2193162,COVID_1,1
1975830,COVID_1,1
3587059,COVID_1,1
2449509,COVID_1,1
1021201,COVID_1,1
2083290,COVID_1,1
938840,COVID_1,1
1389838,COVID_1,1
1787136,COVID_1,1
2182040,COVID_1,1
1217273,COVID_1,1
3729010,COVID_1,1
890765,COVID_1,1
1265062,COVID_1,1
727868,COVID_1,1
1833847,COVID_1,1
1906396,COVID_1,1
82458,COVID_1,1
3654511,COVID_1,1
1956899,COVID_1,1
2707531,COVID_1,1
964356,COVID_1,1
140816,COVID_1,1
125656,COVID_1,1
372401,COVID_1,1
984136,COVID_1,1
84446,COVID_1,1
2172074,COVID_1,1
481063,COVID_1,1
1090592,COVID_1,1
2068528,COVID_1,1
1442675,COVID_1,1
1947276,COVID_1,1
1923161,COVID_1,1
1967159,COVID_1,1
1848097,COVID_1,1
1947332,COVID_1,1
2066981,COVID_1,1
1737518,COVID_1,1
3660009,COVID_1,1
2000340,COVID_1,1
586413,COVID_1,1
2223607,COVID_1,1
4699046,COVID_1,1
1657892,COVID_1,1
2962036,COVID_1,1
1956914,COVID_1,1
2129694,COVID_1,1
1825300,COVID_1,1
1535778,COVID_1,1
2173966,COVID_1,1
958909,COVID_1,1
3809003,COVID_1,1
2242021,COVID_1,1
1583112,COVID_1,1
277007,COVID_1,1
2473073,COVID_1,1
2227680,COVID_1,1
1095596,COVID_1,1
1706590,COVID_1,1
2139935,COVID_1,1
1688164,COVID_1,1
2054853,COVID_1,1
1976778,COVID_1,1
151675,COVID_1,1
735620,COVID_1,1
3112534,COVID_1,1
1145127,COVID_1,1
2721071,COVID_1,1
3559116,COVID_1,1
677549,COVID_1,1
1024319,COVID_1,1
173897,COVID_1,1
3263020,COVID_1,1
582880,COVID_1,1
3950801,COVID_1,1
1162888,COVID_1,1
1997734,COVID_1,1
1706612,COVID_1,1
3891053,COVID_1,1
1893065,COVID_1,1
1232050,COVID_1,1
1655559,COVID_1,1
1064861,COVID_1,1
1604713,COVID_1,1
2528626,COVID_1,1
2519528,COVID_1,1
4736038,COVID_1,1
1491486,COVID_1,1
2091066,COVID_1,1
1967154,COVID_1,1
507307,COVID_1,1
1632196,COVID_1,1
1431889,COVID_1,1
1272112,COVID_1,1
2127695,COVID_1,1
2047437,COVID_1,1
1485999,COVID_1,1
30071,COVID_1,1
3489144,COVID_1,1
585076,COVID_1,1
1670604,COVID_1,1
861285,COVID_1,1
1458531,COVID_1,1
2128070,COVID_1,1
1944347,COVID_1,1
4736033,COVID_1,1
1751713,COVID_1,1
125976,COVID_1,1
127180,COVID_1,1
249446,COVID_1,1
2180960,COVID_1,1
1232700,COVID_1,1
2117835,COVID_1,1
1926976,COVID_1,1
1452191,COVID_1,1
848572,COVID_1,1
1660891,COVID_1,1
540256,COVID_1,1
3090024,COVID_1,1
1769826,COVID_1,1
1347290,COVID_1,1
2125461,COVID_1,1
220456,COVID_1,1
1816558,COVID_1,1
2131971,COVID_1,1
2184346,COVID_1,1
1487947,COVID_1,1
1660272,COVID_1,1
246888,COVID_1,1
1955060,COVID_1,1
1752352,COVID_1,1
957280,COVID_1,1
2707505,COVID_1,1
1802750,COVID_1,1
3750691,COVID_1,1
2959513,COVID_1,1
1282023,COVID_1,1
3974533,COVID_1,1
1849100,COVID_1,1
2172499,COVID_1,1
1655276,COVID_1,1
2088304,COVID_1,1
3014571,COVID_1,1
3438533,COVID_1,1
1450602,COVID_1,1
1735750,COVID_1,1
939078,COVID_1,1
2105282,COVID_1,1
2018769,COVID_1,1
630538,COVID_1,1
1549667,COVID_1,1
1026071,COVID_1,1
780888,COVID_1,1
1800668,COVID_1,1
2821534,COVID_1,1
781077,COVID_1,1
1413327,COVID_1,1
2144988,COVID_1,1
1428842,COVID_1,1
2180079,COVID_1,1
1641250,COVID_1,1
1847513,COVID_1,1
3081521,COVID_1,1
81517,COVID_1,1
545931,COVID_1,1
1719784,COVID_1,1
1577769,COVID_1,1
3557505,COVID_1,1
889177,COVID_1,1
1947229,COVID_1,1
836323,COVID_1,1
2043618,COVID_1,1
1392210,COVID_1,1
313301,COVID_1,1
116026,COVID_1,1
1497019,COVID_1,1
2022269,COVID_1,1
122940,COVID_1,1
1884680,COVID_1,1
1431730,COVID_1,1
400269,COVID_1,1
581048,COVID_1,1
1769127,COVID_1,1
2175643,COVID_1,1
84546,COVID_1,1
1493805,COVID_1,1
374312,COVID_1,1
1345878,COVID_1,1
1877244,COVID_1,1
2031391,COVID_1,1
374306,COVID_1,1
1597130,COVID_1,1
1641082,COVID_1,1
1947321,COVID_1,1
2969047,COVID_1,1
2124049,COVID_1,1
1587724,COVID_1,1
1726518,COVID_1,1
1692555,COVID_1,1
1609659,COVID_1,1
2351503,COVID_1,1
1355312,COVID_1,1
1707151,COVID_1,1
3903568,COVID_1,1
4043068,COVID_1,1
3226504,COVID_1,1
1744359,COVID_1,1
84442,COVID_1,1
1172713,COVID_1,1
2031634,COVID_1,1
2037490,COVID_1,1
2269330,COVID_1,1
1267782,COVID_1,1
3203003,COVID_1,1
1725479,COVID_1,1
2450059,COVID_1,1
1401983,COVID_1,1
4699050,COVID_1,1
1994664,COVID_1,1
1491342,COVID_1,1
3337532,COVID_1,1
988294,COVID_1,1
3973004,COVID_1,1
1915895,COVID_1,1
1781840,COVID_1,1
1788502,COVID_1,1
2050740,COVID_1,1
3135006,COVID_1,1
1099182,COVID_1,1
4699042,COVID_1,1
1787146,COVID_1,1
1947306,COVID_1,1
3735558,COVID_1,1
1800700,COVID_1,1
1486002,COVID_1,1
1735826,COVID_1,1
1919350,COVID_1,1
3391541,COVID_1,1
1853083,COVID_1,1
2218007,COVID_1,1
681882,COVID_1,1
1869632,COVID_1,1
1919049,COVID_1,1
1514767,COVID_1,1
1694700,COVID_1,1
1687064,COVID_1,1
1956905,COVID_1,1
549970,COVID_1,1
1646485,COVID_1,1
170366,COVID_1,1
1436849,COVID_1,1
83601,COVID_1,1
4069513,COVID_1,1
4143502,COVID_1,1
1624189,COVID_1,1
3055507,COVID_1,1
1698303,COVID_1,1
374304,COVID_1,1
1779377,COVID_1,1
2180714,COVID_1,1
3690093,COVID_1,1
1046463,COVID_1,1
1192596,COVID_1,1
1814394,COVID_1,1
1687688,COVID_1,1
1369138,COVID_1,1
143413,COVID_1,1
1288868,COVID_1,1
3894549,COVID_1,1
4130010,COVID_1,1
4330658,COVID_1,1
2483508,COVID_1,1
125414,COVID_1,1
1132847,COVID_1,1
1584841,COVID_1,1
1369136,COVID_1,1
2864028,COVID_1,1
3949008,COVID_1,1
1627484,COVID_1,1
1875948,COVID_1,1
713790,COVID_1,1
1641475,COVID_1,1
2434083,COVID_1,1
1917791,COVID_1,1
3088009,COVID_1,1
1422788,COVID_1,1
2048209,COVID_1,1
1095593,COVID_1,1
1725711,COVID_1,1
251728,COVID_1,1
374308,COVID_1,1
3107059,COVID_1,1
1947207,COVID_1,1
1240392,COVID_1,1
2485543,COVID_1,1
1632361,COVID_1,1
1999331,COVID_1,1
2767044,COVID_1,1
1947317,COVID_1,1
1967751,COVID_1,1
2178347,COVID_1,1
1486072,COVID_1,1
1049781,COVID_1,1
1857427,COVID_1,1
2022435,COVID_1,1
3900008,COVID_1,1
1213527,COVID_1,1
1898480,COVID_1,1
2601023,COVID_1,1
372990,COVID_1,1
138348,COVID_1,1
1458447,COVID_1,1
1687693,COVID_1,1
2300032,COVID_1,1
3857087,COVID_1,1
3916051,COVID_1,1
2935511,COVID_1,1
738778,COVID_1,1
1857838,COVID_1,1
1135292,COVID_1,1
2047542,COVID_1,1
2020752,COVID_1,1
157054,COVID_1,1
4503504,COVID_1,1
454035,COVID_1,1
1782530,COVID_1,1
1660288,COVID_1,1
3460078,COVID_1,1
3588504,COVID_1,1
780957,COVID_1,1
2047391,COVID_1,1
1217268,COVID_1,1
2039287,COVID_1,1
1698027,COVID_1,1
1857294,COVID_1,1
2127281,COVID_1,1
521177,COVID_1,1
2085198,COVID_1,1
1454094,COVID_1,1
1202517,COVID_1,1
1099178,COVID_1,1
2039424,COVID_1,1
1159304,COVID_1,1
635183,COVID_1,1
1725655,COVID_1,1
1928377,COVID_1,1
2120425,COVID_1,1
1508858,COVID_1,1
2258024,COVID_1,1
4412551,COVID_1,1
1905234,COVID_1,1
756445,COVID_1,1
2118171,COVID_1,1
185809,COVID_1,1
2134428,COVID_1,1
3022517,COVID_1,1
1265414,COVID_1,1
1006872,COVID_1,1
3531110,COVID_1,1
1956900,COVID_1,1
490572,COVID_1,1
1078035,COVID_1,1
2083351,COVID_1,1
1412784,COVID_1,1
1952149,COVID_1,1
2118174,COVID_1,1
1947351,COVID_1,1
1800679,COVID_1,1
2031439,COVID_1,1
1265065,COVID_1,1
4069509,COVID_1,1
1337225,COVID_1,1
590063,COVID_1,1
2147684,COVID_1,1
1507750,COVID_1,1
1970244,COVID_1,1
2048071,COVID_1,1
127957,COVID_1,1
1921943,COVID_1,1
2130290,COVID_1,1
3557511,COVID_1,1
946185,COVID_1,1
1802041,COVID_1,1
2969040,COVID_1,1
2040013,COVID_1,1
2128342,COVID_1,1
1653150,COVID_1,1
1687834,COVID_1,1
3596503,COVID_1,1
2055744,COVID_1,1
1382934,COVID_1,1
780835,COVID_1,1
1999384,COVID_1,1
1510705,COVID_1,1
1390312,COVID_1,1
1414951,COVID_1,1
1283984,COVID_1,1
4736035,COVID_1,1
1178574,COVID_1,1
2209511,COVID_1,1
1809275,COVID_1,1
2129283,COVID_1,1
1632372,COVID_1,1
1853143,COVID_1,1
1726521,COVID_1,1
582700,COVID_1,1
529924,COVID_1,1
565632,COVID_1,1
2377063,COVID_1,1
2129289,COVID_1,1
934850,COVID_1,1
703365,COVID_1,1
31016,COVID_1,1
374276,COVID_1,1
2160721,COVID_1,1
2084713,COVID_1,1
125664,COVID_1,1
958484,COVID_1,1
1048294,COVID_1,1
2117115,COVID_1,1
1265063,COVID_1,1
2045311,COVID_1,1
2605585,COVID_1,1
1899929,COVID_1,1
1670555,COVID_1,1
2136031,COVID_1,1
1655253,COVID_1,1
4300568,COVID_1,1
3344092,COVID_1,1
1657339,COVID_1,1
2345585,COVID_1,1
1140812,COVID_1,1
3659012,COVID_1,1
1694467,COVID_1,1
4502577,COVID_1,1
2078316,COVID_1,1
1689322,COVID_1,1
1289107,COVID_1,1
2172495,COVID_1,1
1977922,COVID_1,1
626164,COVID_1,1
2020738,COVID_1,1
1853732,COVID_1,1
1875183,COVID_1,1
909359,COVID_1,1
1549684,COVID_1,1
1591356,COVID_1,1
2139260,COVID_1,1
1249330,COVID_1,1
1796066,COVID_1,1
756731,COVID_1,1
1853095,COVID_1,1
2698587,COVID_1,1
372467,COVID_1,1
3077518,COVID_1,1
4574087,COVID_1,1
1903081,COVID_1,1
1006878,COVID_1,1
2483507,COVID_1,1
1959940,COVID_1,1
2371517,COVID_1,1
1776564,COVID_1,1
1857270,COVID_1,1
2221241,COVID_1,1
1486005,COVID_1,1
313300,COVID_1,1
673524,COVID_1,1
3100521,COVID_1,1
2167764,COVID_1,1
3107062,COVID_1,1
1688168,COVID_1,1
2039284,COVID_1,1
1855935,COVID_1,1
78963,COVID_1,1
1026070,COVID_1,1
388359,COVID_1,1
2371510,COVID_1,1
3097535,COVID_1,1
4449575,COVID_1,1
1994667,COVID_1,1
1857229,COVID_1,1
3849717,COVID_1,1
1560962,COVID_1,1
1847472,COVID_1,1
374300,COVID_1,1
2024946,COVID_1,1
1602682,COVID_1,1
465320,COVID_1,1
1849102,COVID_1,1
1697174,COVID_1,1
635025,COVID_1,1
1947293,COVID_1,1
3112575,COVID_1,1
2089370,COVID_1,1
115998,COVID_1,1
2170461,COVID_1,1
1795353,COVID_1,1
2047412,COVID_1,1
1956902,COVID_1,1
127072,COVID_1,1
1700776,COVID_1,1
3900009,COVID_1,1
2044556,COVID_1,1
1361784,COVID_1,1
2044356,COVID_1,1
1531090,COVID_1,1
3104027,COVID_1,1
1172714,COVID_1,1
272437,COVID_1,1
3081531,COVID_1,1
2228232,COVID_1,1
986320,COVID_1,1
1049776,COVID_1,1
2086488,COVID_1,1
4487018,COVID_1,1
2217360,COVID_1,1
3104010,COVID_1,1
1660283,COVID_1,1
626163,COVID_1,1
1443187,COVID_1,1
1814403,COVID_1,1
1968487,COVID_1,1
2218577,COVID_1,1
1627796,COVID_1,1
695754,COVID_1,1
889179,COVID_1,1
1850306,COVID_1,1
1804527,COVID_1,1
1202833,COVID_1,1
2243300,COVID_1,1
301950,COVID_1,1
1814405,COVID_1,1
2044204,COVID_1,1
490890,COVID_1,1
2112223,COVID_1,1
122946,COVID_1,1
3800532,COVID_1,1
2417071,COVID_1,1
1923567,COVID_1,1
301954,COVID_1,1
2158236,COVID_1,1
648620,COVID_1,1
1425432,COVID_1,1
890766,COVID_1,1
1414205,COVID_1,1
690043,COVID_1,1
3572311,COVID_1,1
1857839,COVID_1,1
3542033,COVID_1,1
2084773,COVID_1,1
2469748,COVID_1,1
3857090,COVID_1,1
2616642,COVID_1,1
2101622,COVID_1,1
2022267,COVID_1,1
2296006,COVID_1,1
1526343,COVID_1,1
2235803,COVID_1,1
2125190,COVID_1,1
1807139,COVID_1,1
1335738,COVID_1,1
3587553,COVID_1,1
2378501,COVID_1,1
3903574,COVID_1,1
4154034,COVID_1,1
1775855,COVID_1,1
1428578,COVID_1,1
1122424,COVID_1,1
580886,COVID_1,1
1200258,COVID_1,1
1447524,COVID_1,1
1567423,COVID_1,1
2061555,COVID_1,1
129156,COVID_1,1
3857088,COVID_1,1
2160147,COVID_1,1
2117099,COVID_1,1
4008503,COVID_1,1
1856658,COVID_1,1
1971617,COVID_1,1
2131629,COVID_1,1
3264043,COVID_1,1
1186790,COVID_1,1
1583171,COVID_1,1
1752314,COVID_1,1
2128362,COVID_1,1
596125,COVID_1,1
275379,COVID_1,1
2127286,COVID_1,1
1141907,COVID_1,1
914153,COVID_1,1
1584532,COVID_1,1
374281,COVID_1,1
2789505,COVID_1,1
318629,COVID_1,1
2173938,COVID_1,1
2094686,COVID_1,1
1732352,COVID_1,1
1591351,COVID_1,1
1660284,COVID_1,1
1855920,COVID_1,1
1666474,COVID_1,1
1753315,COVID_1,1
1634216,COVID_1,1
1152162,COVID_1,1
1634350,COVID_1,1
374298,COVID_1,1
2052273,COVID_1,1
1642094,COVID_1,1
130296,COVID_1,1
3317004,COVID_1,1
638868,COVID_1,1
1619573,COVID_1,1
2144508,COVID_1,1
2630520,COVID_1,1
3997008,COVID_1,1
1177982,COVID_1,1
1216840,COVID_1,1
2047387,COVID_1,1
1209739,COVID_1,1
3945019,COVID_1,1
1739406,COVID_1,1
1526615,COVID_1,1
125056,COVID_1,1
1689328,COVID_1,1
1735831,COVID_1,1
1456653,COVID_1,1
372982,COVID_1,1
3596502,COVID_1,1
2217417,COVID_1,1
2864041,COVID_1,1
1795103,COVID_1,1
1809270,COVID_1,1
2130285,COVID_1,1
3891054,COVID_1,1
1735769,COVID_1,1
1634142,COVID_1,1
2091064,COVID_1,1
1583169,COVID_1,1
4412557,COVID_1,1
1640410,COVID_1,1
1552077,COVID_1,1
1492808,COVID_1,1
1944732,COVID_1,1
4421511,COVID_1,1
2182046,COVID_1,1
535570,COVID_1,1
731778,COVID_1,1
2039356,COVID_1,1
1776576,COVID_1,1
2044577,COVID_1,1
1046462,COVID_1,1
3018002,COVID_1,1
1793167,COVID_1,1
2090591,COVID_1,1
300696,COVID_1,1
2227681,COVID_1,1
1692423,COVID_1,1
3100547,COVID_1,1
3529008,COVID_1,1
1520695,COVID_1,1
3412518,COVID_1,1
2672568,COVID_1,1
2210853,COVID_1,1
1976779,COVID_1,1
1838000,COVID_1,1
1567316,COVID_1,1
2166621,COVID_1,1
148450,COVID_1,1
1963745,COVID_1,1
2179796,COVID_1,1
2187219,COVID_1,1
2090694,COVID_1,1
2090573,COVID_1,1
3104030,COVID_1,1
303817,COVID_1,1
394960,COVID_1,1
1476378,COVID_1,1
2193544,COVID_1,1
1776023,COVID_1,1
1943451,COVID_1,1
3205004,COVID_1,1
1915906,COVID_1,1
2125735,COVID_1,1
376,COVID_1,1
1226407,COVID_1,1
4288040,COVID_1,1
630554,COVID_1,1
1947319,COVID_1,1
1793624,COVID_1,1
2935509,COVID_1,1
1786779,COVID_1,1
3026512,COVID_1,1
3893562,COVID_1,1
566587,COVID_1,1
1277346,COVID_1,1
2044364,COVID_1,1
1869623,COVID_1,1
2107173,COVID_1,1
1801671,COVID_1,1
938526,COVID_1,1
3857085,COVID_1,1
2275548,COVID_1,1
934851,COVID_1,1
2713034,COVID_1,1
1058943,COVID_1,1
1653216,COVID_1,1
1706607,COVID_1,1
1826064,COVID_1,1
1640954,COVID_1,1
2047432,COVID_1,1
1583108,COVID_1,1
992833,COVID_1,1
1947320,COVID_1,1
173898,COVID_1,1
2239323,COVID_1,1
2166028,COVID_1,1
3022513,COVID_1,1
3317006,COVID_1,1
939079,COVID_1,1
2230411,COVID_1,1
2077688,COVID_1,1
1732351,COVID_1,1
2319506,COVID_1,1
1662043,COVID_1,1
1433209,COVID_1,1
372917,COVID_1,1
3163601,COVID_1,1
2028028,COVID_1,1
3391540,COVID_1,1
2162179,COVID_1,1
1778984,COVID_1,1
693641,COVID_1,1
2064963,COVID_1,1
2242925,COVID_1,1
1890524,COVID_1,1
835479,COVID_1,1
374288,COVID_1,1
2053130,COVID_1,1
1779841,COVID_1,1
1947208,COVID_1,1
1653655,COVID_1,1
372462,COVID_1,1
3559115,COVID_1,1
2230095,COVID_1,1
2528617,COVID_1,1
1703212,COVID_1,1
1604828,COVID_1,1
2047546,COVID_1,1
1232735,COVID_1,1
2601045,COVID_1,1
2160084,COVID_1,1
4069512,COVID_1,1
2868067,COVID_1,1
979816,COVID_1,1
372334,COVID_1,1
957279,COVID_1,1
1135750,COVID_1,1
1271122,COVID_1,1
251742,COVID_1,1
903978,COVID_1,1
1825966,COVID_1,1
126639,COVID_1,1
1776022,COVID_1,1
1919052,COVID_1,1
2196220,COVID_1,1
741161,COVID_1,1
1857262,COVID_1,1
1782428,COVID_1,1
1668157,COVID_1,1
1754783,COVID_1,1
184252,COVID_1,1
2058777,COVID_1,1
1058622,COVID_1,1
1638562,COVID_1,1
2101253,COVID_1,1
633004,COVID_1,1
1596984,COVID_1,1
1456547,COVID_1,1
2129075,COVID_1,1
1967425,COVID_1,1
2173108,COVID_1,1
1947203,COVID_1,1
1936674,COVID_1,1
2136028,COVID_1,1
1538523,COVID_1,1
166103,COVID_1,1
1868680,COVID_1,1
2048031,COVID_1,1
648619,COVID_1,1
1713981,COVID_1,1
1765377,COVID_1,1
1853075,COVID_1,1
1976771,COVID_1,1
2072479,COVID_1,1
1397636,COVID_1,1
1817961,COVID_1,1
3730583,COVID_1,1
1486007,COVID_1,1
1826089,COVID_1,1
474849,COVID_1,1
4278004,COVID_1,1
2184347,COVID_1,1
2969043,COVID_1,1
2084710,COVID_1,1
2127283,COVID_1,1
228118,COVID_1,1
1832213,COVID_1,1
4506542,COVID_1,1
1855908,COVID_1,1
2242923,COVID_1,1
2040011,COVID_1,1
3576043,COVID_1,1
2084811,COVID_1,1
1282024,COVID_1,1
3949011,COVID_1,1
3819615,COVID_1,1
2218006,COVID_1,1
2230092,COVID_1,1
3894548,COVID_1,1
372333,COVID_1,1
633003,COVID_1,1
3559112,COVID_1,1
2269322,COVID_1,1
1621873,COVID_1,1
1793623,COVID_1,1
2053709,COVID_1,1
3391551,COVID_1,1
125827,COVID_1,1
1692431,COVID_1,1
1337224,COVID_1,1
2227678,COVID_1,1
1626076,COVID_1,1
4716001,COVID_1,1
1781851,COVID_1,1
125885,COVID_1,1
2027647,COVID_1,1
1510912,COVID_1,1
2128063,COVID_1,1
170380,COVID_1,1
1749937,COVID_1,1
4191008,COVID_1,1
3014575,COVID_1,1
2048177,COVID_1,1
302576,COVID_1,1
3104016,COVID_1,1
2089373,COVID_1,1
1657744,COVID_1,1
1857366,COVID_1,1
1811160,COVID_1,1
369668,COVID_1,1
1249331,COVID_1,1
975010,COVID_1,1
1755333,COVID_1,1
3698004,COVID_1,1
2940020,COVID_1,1
849343,COVID_1,1
83078,COVID_1,1
905322,COVID_1,1
254110,COVID_1,1
149481,COVID_1,1
1627434,COVID_1,1
1692426,COVID_1,1
2040511,COVID_1,1
1508855,COVID_1,1
2220800,COVID_1,1
2094556,COVID_1,1
1828435,COVID_1,1
3857086,COVID_1,1
1855013,COVID_1,1
2865098,COVID_1,1
1947287,COVID_1,1
3190543,COVID_1,1
1774112,COVID_1,1
28130,COVID_1,1
374278,COVID_1,1
1856665,COVID_1,1
1951435,COVID_1,1
696421,COVID_1,1
2865099,COVID_1,1
157053,COVID_1,1
2507036,COVID_1,1
1400788,COVID_1,1
2209520,COVID_1,1
2208007,COVID_1,1
1620500,COVID_1,1
1972640,COVID_1,1
2047447,COVID_1,1
1431767,COVID_1,1
2052042,COVID_1,1
1905654,COVID_1,1
2351506,COVID_1,1
170350,COVID_1,1
958486,COVID_1,1
1632186,COVID_1,1
1697079,COVID_1,1
510628,COVID_1,1
2083332,COVID_1,1
3107045,COVID_1,1
306472,COVID_1,1
4191007,COVID_1,1
549969,COVID_1,1
1449759,COVID_1,1
1781822,COVID_1,1
665522,COVID_1,1
2055722,COVID_1,1
1923078,COVID_1,1
4448884,COVID_1,1
81512,COVID_1,1
607526,COVID_1,1
3289710,COVID_1,1
2841534,COVID_1,1
1266681,COVID_1,1
2117834,COVID_1,1
2127691,COVID_1,1
1137506,COVID_1,1
1671018,COVID_1,1
1828431,COVID_1,1
1769615,COVID_1,1
1619568,COVID_1,1
852371,COVID_1,1
1036169,COVID_1,1
82462,COVID_1,1
3112571,COVID_1,1
1025327,COVID_1,1
1459060,COVID_1,1
1837412,COVID_1,1
2052272,COVID_1,1
3197504,COVID_1,1
1812448,COVID_1,1
1392225,COVID_1,1
2210786,COVID_1,1
1656687,COVID_1,1
2217590,COVID_1,1
1142400,COVID_1,1
1549683,COVID_1,1
1717740,COVID_1,1
2182044,COVID_1,1
81423,COVID_1,1
3994525,COVID_1,1
1838402,COVID_1,1
1856742,COVID_1,1
3391543,COVID_1,1
3189014,COVID_1,1
534440,COVID_1,1
1603345,COVID_1,1
2911504,COVID_1,1
1427671,COVID_1,1
2068298,COVID_1,1
1190958,COVID_1,1
1905374,COVID_1,1
2849034,COVID_1,1
1234720,COVID_1,1
1064866,COVID_1,1
1671023,COVID_1,1
499591,COVID_1,1
1884996,COVID_1,1
1017080,COVID_1,1
126766,COVID_1,1
482694,COVID_1,1
1660277,COVID_1,1
2128754,COVID_1,1
1137505,COVID_1,1
545415,COVID_1,1
521180,COVID_1,1
301952,COVID_1,1
1070179,COVID_1,1
1956904,COVID_1,1
2243297,COVID_1,1
4069515,COVID_1,1
1963050,COVID_1,1
3317009,COVID_1,1
2432001,COVID_1,1
4252501,COVID_1,1
1136448,COVID_1,1
486460,COVID_1,1
622147,COVID_1,1
2614525,COVID_1,1
1999344,COVID_1,1
889178,COVID_1,1
1811657,COVID_1,1
630539,COVID_1,1
4216505,COVID_1,1
1582512,COVID_1,1
138353,COVID_1,1
2233670,COVID_1,1
1584825,COVID_1,1
1817957,COVID_1,1
1049775,COVID_1,1
2047436,COVID_1,1
2022627,COVID_1,1
3751170,COVID_1,1
1541171,COVID_1,1
374283,COVID_1,1
1557117,COVID_1,1
4392557,COVID_1,1
4384509,COVID_1,1
1594199,COVID_1,1
3284007,COVID_1,1
1417031,COVID_1,1
2601033,COVID_1,1
2047549,COVID_1,1
1046520,COVID_1,1
490374,COVID_1,1
1812459,COVID_1,1
2128492,COVID_1,1
2175625,COVID_1,1
1755458,COVID_1,1
1768673,COVID_1,1
2058781,COVID_1,1
2031394,COVID_1,1
1999347,COVID_1,1
80376,COVID_1,1
1609657,COVID_1,1
2450513,COVID_1,1
1289006,COVID_1,1
4412558,COVID_1,1
1489059,COVID_1,1
2028011,COVID_1,1
3015604,COVID_1,1
1970460,COVID_1,1
2055721,COVID_1,1
1522815,COVID_1,1
126127,COVID_1,1
1474137,COVID_1,1
3894044,COVID_1,1
1568095,COVID_1,1
2047407,COVID_1,1
534441,COVID_1,1
4487019,COVID_1,1
1260637,COVID_1,1
374291,COVID_1,1
2907529,COVID_1,1
1637428,COVID_1,1
4699043,COVID_1,1
1006873,COVID_1,1
1907597,COVID_1,1
1685624,COVID_1,1
2051711,COVID_1,1
2033664,COVID_1,1
126626,COVID_1,1
1389911,COVID_1,1
1853073,COVID_1,1
3112540,COVID_1,1
2631006,COVID_1,1
4381024,COVID_1,1
1855928,COVID_1,1
1455542,COVID_1,1
2616648,COVID_1,1
2223308,COVID_1,1
1233224,COVID_1,1
3572039,COVID_1,1
1626221,COVID_1,1
126632,COVID_1,1
1657504,COVID_1,1
939763,COVID_1,1
4252507,COVID_1,1
151677,COVID_1,1
3107064,COVID_1,1
1185986,COVID_1,1
126640,COVID_1,1
1190556,COVID_1,1
1692428,COVID_1,1
1657740,COVID_1,1
1443197,COVID_1,1
1137507,COVID_1,1
83074,COVID_1,1
1655275,COVID_1,1
2180986,COVID_1,1
3811023,COVID_1,1
2047413,COVID_1,1
2027930,COVID_1,1
1753216,COVID_1,1
374272,COVID_1,1
2908563,COVID_1,1
2039421,COVID_1,1
1655551,COVID_1,1
3122041,COVID_1,1
1748364,COVID_1,1
3704015,COVID_1,1
3107026,COVID_1,1
1358250,COVID_1,1
1963048,COVID_1,1
1049779,COVID_1,1
635026,COVID_1,1
1963824,COVID_1,1
1601999,COVID_1,1
95105,COVID_1,1
1862370,COVID_1,1
1955057,COVID_1,1
1594216,COVID_1,1
2228018,COVID_1,1
454145,COVID_1,1
1629758,COVID_1,1
2048151,COVID_1,1
1546673,COVID_1,1
986385,COVID_1,1
4381014,COVID_1,1
590846,COVID_1,1
960470,COVID_1,1
1739402,COVID_1,1
1638926,COVID_1,1
1884998,COVID_1,1
1705165,COVID_1,1
2129073,COVID_1,1
4736039,COVID_1,1
771887,COVID_1,1
1955750,COVID_1,1
1956303,COVID_1,1
4252508,COVID_1,1
2634043,COVID_1,1
1647374,COVID_1,1
1670928,COVID_1,1
1804501,COVID_1,1
1774114,COVID_1,1
1580113,COVID_1,1
779721,COVID_1,1
1776014,COVID_1,1
228116,COVID_1,1
188680,COVID_1,1
78486,COVID_1,1
2047373,COVID_1,1
1660287,COVID_1,1
1550160,COVID_1,1
3100590,COVID_1,1
661322,COVID_1,1
125149,COVID_1,1
1405528,COVID_1,1
1969912,COVID_1,1
1583172,COVID_1,1
125437,COVID_1,1
151642,COVID_1,1
910676,COVID_1,1
2166623,COVID_1,1
1452192,COVID_1,1
2434076,COVID_1,1
1853101,COVID_1,1
1811168,COVID_1,1
4469505,COVID_1,1
2269347,COVID_1,1
1665085,COVID_1,1
2251571,COVID_1,1
2052252,COVID_1,1
1805922,COVID_1,1
1580707,COVID_1,1
2232471,COVID_1,1
3564541,COVID_1,1
1063493,COVID_1,1
1420099,COVID_1,1
2055723,COVID_1,1
1890527,COVID_1,1
1640406,COVID_1,1
1704278,COVID_1,1
459566,COVID_1,1
2469731,COVID_1,1
596119,COVID_1,1
735622,COVID_1,1
2041512,COVID_1,1
2193779,COVID_1,1
973287,COVID_1,1
1260612,COVID_1,1
1769151,COVID_1,1
521186,COVID_1,1
1947180,COVID_1,1
156416,COVID_1,1
2067005,COVID_1,1
1025302,COVID_1,1
122948,COVID_1,1
708856,COVID_1,1
1349014,COVID_1,1
95107,COVID_1,1
1883855,COVID_1,1
2128323,COVID_1,1
2935505,COVID_1,1
2601035,COVID_1,1
1868921,COVID_1,1
2127315,COVID_1,1
1428984,COVID_1,1
2220240,COVID_1,1
1567319,COVID_1,1
2083269,COVID_1,1
1190784,COVID_1,1
1591344,COVID_1,1
1057188,COVID_1,1
125173,COVID_1,1
2601028,COVID_1,1
2054845,COVID_1,1
1749944,COVID_1,1
1862371,COVID_1,1
1849105,COVID_1,1
1046531,COVID_1,1
2849031,COVID_1,1
1604829,COVID_1,1
2034188,COVID_1,1
1779397,COVID_1,1
3847030,COVID_1,1
3857621,COVID_1,1
1751710,COVID_1,1
4381013,COVID_1,1
902097,COVID_1,1
1746394,COVID_1,1
2221025,COVID_1,1
2112241,COVID_1,1
1629698,COVID_1,1
1482941,COVID_1,1
1825291,COVID_1,1
1414725,COVID_1,1
2243277,COVID_1,1
2230066,COVID_1,1
1869629,COVID_1,1
3101501,COVID_1,1
374286,COVID_1,1
3270507,COVID_1,1
2131852,COVID_1,1
3101041,COVID_1,1
2886012,COVID_1,1
2047295,COVID_1,1
272021,COVID_1,1
454529,COVID_1,1
115996,COVID_1,1
372327,COVID_1,1
2047390,COVID_1,1
2020732,COVID_1,1
374293,COVID_1,1
2058785,COVID_1,1
4502023,COVID_1,1
1685954,COVID_1,1
2173956,COVID_1,1
2033663,COVID_1,1
1577816,COVID_1,1
1057195,COVID_1,1
1747917,COVID_1,1
1286648,COVID_1,1
2225537,COVID_1,1
1040007,COVID_1,1
3048549,COVID_1,1
1455314,COVID_1,1
1815325,COVID_1,1
1892527,COVID_1,1
1623146,COVID_1,1
499904,COVID_1,1
497126,COVID_1,1
1884671,COVID_1,1
2031623,COVID_1,1
1952162,COVID_1,1
126618,COVID_1,1
1178575,COVID_1,1
475188,COVID_1,1
1412658,COVID_1,1
910678,COVID_1,1
2836048,COVID_1,1
2872020,COVID_1,1
599908,COVID_1,1
1458451,COVID_1,1
1143478,COVID_1,1
1463452,COVID_1,1
1917795,COVID_1,1
1588001,COVID_1,1
2218581,COVID_1,1
2047389,COVID_1,1
1786919,COVID_1,1
83077,COVID_1,1
1549592,COVID_1,1
936468,COVID_1,1
126513,COVID_1,1
1486691,COVID_1,1
1779302,COVID_1,1
1837414,COVID_1,1
630985,COVID_1,1
1488412,COVID_1,1
674691,COVID_1,1
887238,COVID_1,1
1170867,COVID_1,1
938525,COVID_1,1
251751,COVID_1,1
1956922,COVID_1,1
2821536,COVID_1,1
2051793,COVID_1,1
754609,COVID_1,1
1947280,COVID_1,1
1704231,COVID_1,1
2865096,COVID_1,1
160826,COVID_1,1
1832342,COVID_1,1
921483,COVID_1,1
525588,COVID_1,1
2220248,COVID_1,1
2053708,COVID_1,1
1172051,COVID_1,1
1627471,COVID_1,1
455071,COVID_1,1
3660005,COVID_1,1
4156016,COVID_1,1
1656882,COVID_1,1
1944428,COVID_1,1
1232699,COVID_1,1
3107048,COVID_1,1
4330672,COVID_1,1
1146870,COVID_1,1
374317,COVID_1,1
4416593,COVID_1,1
2210026,COVID_1,1
3857079,COVID_1,1
421945,COVID_1,1
4252505,COVID_1,1
2242926,COVID_1,1
2434089,COVID_1,1
1689253,COVID_1,1
1226242,COVID_1,1
1855907,COVID_1,1
850913,COVID_1,1
2058783,COVID_1,1
2230064,COVID_1,1
1690767,COVID_1,1
1787527,COVID_1,1
1646547,COVID_1,1
2160077,COVID_1,1
586415,COVID_1,1
1926543,COVID_1,1
1482309,COVID_1,1
160825,COVID_1,1
465323,COVID_1,1
28154,COVID_1,1
1190778,COVID_1,1
2044560,COVID_1,1
2131881,COVID_1,1
1653133,COVID_1,1
1669571,COVID_1,1
3270506,COVID_1,1
2127284,COVID_1,1
4096516,COVID_1,1
1272778,COVID_1,1
474851,COVID_1,1
713795,COVID_1,1
374307,COVID_1,1
2139246,COVID_1,1
1287382,COVID_1,1
1787016,COVID_1,1
1192867,COVID_1,1
2053712,COVID_1,1
2084729,COVID_1,1
464570,COVID_1,1
123907,COVID_1,1
1026072,COVID_1,1
754414,COVID_1,1
719531,COVID_1,1
1602843,COVID_1,1
1973770,COVID_1,1
4574090,COVID_1,1
3112574,COVID_1,1
126150,COVID_1,1
1921859,COVID_1,1
1361793,COVID_1,1
1856649,COVID_1,1
1202927,COVID_1,1
2128072,COVID_1,1
4252506,COVID_1,1
1266677,COVID_1,1
1110201,COVID_1,1
843231,COVID_1,1
1458445,COVID_1,1
2296010,COVID_1,1
3084052,COVID_1,1
2223601,COVID_1,1
127260,COVID_1,1
735615,COVID_1,1
1290645,COVID_1,1
1570019,COVID_1,1
2177037,COVID_1,1
999572,COVID_1,1
1687675,COVID_1,1
1855933,COVID_1,1
2136043,COVID_1,1
549965,COVID_1,1
1884629,COVID_1,1
4412555,COVID_1,1
1361801,COVID_1,1
978130,COVID_1,1
148436,COVID_1,1
1099180,COVID_1,1
1734110,COVID_1,1
1905376,COVID_1,1
1457188,COVID_1,1
681879,COVID_1,1
1186791,COVID_1,1
975011,COVID_1,1
1786419,COVID_1,1
2091069,COVID_1,1
2324078,COVID_1,1
2450048,COVID_1,1
2821532,COVID_1,1
4439757,COVID_1,1
245957,COVID_1,1
2959055,COVID_1,1
989200,COVID_1,1
1657114,COVID_1,1
2047434,COVID_1,1
2028019,COVID_1,1
3139028,COVID_1,1
1805919,COVID_1,1
1057183,COVID_1,1
1849103,COVID_1,1
382,COVID_1,1
3021781,COVID_1,1
1200262,COVID_1,1
3735559,COVID_1,1
3849711,COVID_1,1
1975826,COVID_1,1
2184227,COVID_1,1
3997011,COVID_1,1
1431738,COVID_1,1
2020723,COVID_1,1
1793149,COVID_1,1
3317005,COVID_1,1
2127686,COVID_1,1
3938503,COVID_1,1
1762750,COVID_1,1
1884666,COVID_1,1
1976788,COVID_1,1
2020749,COVID_1,1
2616643,COVID_1,1
1788125,COVID_1,1
2962033,COVID_1,1
1951440,COVID_1,1
2251082,COVID_1,1
3757021,COVID_1,1
1265041,COVID_1,1
2220246,COVID_1,1
1266319,COVID_1,1
2078320,COVID_1,1
1936671,COVID_1,1
1049782,COVID_1,1
1011217,COVID_1,1
1893064,COVID_1,1
116031,COVID_1,1
475132,COVID_1,1
1832214,COVID_1,1
3944055,COVID_1,1
1906504,COVID_1,1
2161178,COVID_1,1
3596504,COVID_1,1
2030919,COVID_1,1
4136017,COVID_1,1
3012581,COVID_1,1
3853002,COVID_1,1
1647103,COVID_1,1
596126,COVID_1,1
1899837,COVID_1,1
699314,COVID_1,1
3021777,COVID_1,1
170377,COVID_1,1
1901960,COVID_1,1
2911515,COVID_1,1
1338781,COVID_1,1
191629,COVID_1,1
1338228,COVID_1,1
1684384,COVID_1,1
4439769,COVID_1,1
2129299,COVID_1,1
3015597,COVID_1,1
1749571,COVID_1,1
1076608,COVID_1,1
939779,COVID_1,1
596120,COVID_1,1
587567,COVID_1,1
1776039,COVID_1,1
1771677,COVID_1,1
1749722,COVID_1,1
1584860,COVID_1,1
2616637,COVID_1,1
374282,COVID_1,1
1414726,COVID_1,1
2482578,COVID_1,1
3368008,COVID_1,1
2175908,COVID_1,1
169769,COVID_1,1
3090022,COVID_1,1
1811100,COVID_1,1
1932524,COVID_1,1
1021202,COVID_1,1
3849698,COVID_1,1
2120475,COVID_1,1
160276,COVID_1,1
1640968,COVID_1,1
4352511,COVID_1,1
1868724,COVID_1,1
1432979,COVID_1,1
3048544,COVID_1,1
372730,COVID_1,1
3163578,COVID_1,1
482688,COVID_1,1
2022265,COVID_1,1
2053668,COVID_1,1
3658541,COVID_1,1
1776880,COVID_1,1
1213525,COVID_1,1
1857382,COVID_1,1
374280,COVID_1,1
559254,COVID_1,1
1955616,COVID_1,1
2230073,COVID_1,1
1787141,COVID_1,1
2047246,COVID_1,1
256820,COVID_1,1
663919,COVID_1,1
958483,COVID_1,1
1660281,COVID_1,1
1774554,COVID_1,1
3690097,COVID_1,1
2084709,COVID_1,1
1454098,COVID_1,1
1881899,COVID_1,1
1685949,COVID_1,1
2134489,COVID_1,1
2789506,COVID_1,1
1583136,COVID_1,1
1621532,COVID_1,1
459389,COVID_1,1
2168196,COVID_1,1
2131741,COVID_1,1
2107930,COVID_1,1
1704111,COVID_1,1
1640450,COVID_1,1
1776886,COVID_1,1
1567429,COVID_1,1
624286,COVID_1,1
596105,COVID_1,1
2251085,COVID_1,1
1597052,COVID_1,1
3391554,COVID_1,1
2051353,COVID_1,1
1921788,COVID_1,1
3391524,COVID_1,1
2052086,COVID_1,1
3893537,COVID_1,1
1582316,COVID_1,1
2066979,COVID_1,1
1778997,COVID_1,1
377,COVID_1,1
1448954,COVID_1,1
2058779,COVID_1,1
2020442,COVID_1,1
3659015,COVID_1,1
2091067,COVID_1,1
2047368,COVID_1,1
1963049,COVID_1,1
2128475,COVID_1,1
1409322,COVID_1,1
1428958,COVID_1,1
2047486,COVID_1,1
2212381,COVID_1,1
372976,COVID_1,1
735623,COVID_1,1
2162831,COVID_1,1
1509788,COVID_1,1
2144538,COVID_1,1
1217280,COVID_1,1
1529435,COVID_1,1
1641252,COVID_1,1
1335735,COVID_1,1
1533203,COVID_1,1
581010,COVID_1,1
1976760,COVID_1,1
272015,COVID_1,1
1158865,COVID_1,1
218984,COVID_1,1
2672569,COVID_1,1
4105518,COVID_1,1
1527080,COVID_1,1
2495118,COVID_1,1
459567,COVID_1,1
2173138,COVID_1,1
1904050,COVID_1,1
2158239,COVID_1,1
2047548,COVID_1,1
3234505,COVID_1,1
1802132,COVID_1,1
138350,COVID_1,1
1670946,COVID_1,1
2018774,COVID_1,1
2233661,COVID_1,1
1271123,COVID_1,1
2209295,COVID_1,1
1499233,COVID_1,1
1976786,COVID_1,1
435169,COVID_1,1
2127282,COVID_1,1
1443190,COVID_1,1
1769829,COVID_1,1
244452,COVID_1,1
4201008,COVID_1,1
1412929,COVID_1,1
2091218,COVID_1,1
1947250,COVID_1,1
3905033,COVID_1,1
1629942,COVID_1,1
185886,COVID_1,1
4352509,COVID_1,1
735123,COVID_1,1
2996522,COVID_1,1
1755334,COVID_1,1
2127278,COVID_1,1
3398609,COVID_1,1
1379078,COVID_1,1
2171934,COVID_1,1
1826061,COVID_1,1
3021769,COVID_1,1
2605594,COVID_1,1
836322,COVID_1,1
3189589,COVID_1,1
536141,COVID_1,1
2127369,COVID_1,1
1801453,COVID_1,1
170354,COVID_1,1
1349087,COVID_1,1
1638603,COVID_1,1
2175631,COVID_1,1
1582730,COVID_1,1
2044209,COVID_1,1
587233,COVID_1,1
768738,COVID_1,1
1835990,COVID_1,1
1963742,COVID_1,1
1587499,COVID_1,1
1888150,COVID_1,1
1826067,COVID_1,1
565417,COVID_1,1
1720948,COVID_1,1
3088005,COVID_1,1
1747912,COVID_1,1
1382939,COVID_1,1
3104025,COVID_1,1
2856537,COVID_1,1
1939813,COVID_1,1
1898397,COVID_1,1
1389850,COVID_1,1
1832347,COVID_1,1
635477,COVID_1,1
1764975,COVID_1,1
3264051,COVID_1,1
596414,COVID_1,1
2235440,COVID_1,1
960468,COVID_1,1
2040590,COVID_1,1
374290,COVID_1,1
1876017,COVID_1,1
83591,COVID_1,1
1358070,COVID_1,1
2083639,COVID_1,1
1735762,COVID_1,1
2053695,COVID_1,1
2058603,COVID_1,1
1486692,COVID_1,1
2029826,COVID_1,1
958892,COVID_1,1
1632377,COVID_1,1
1916493,COVID_1,1
2074046,COVID_1,1
596110,COVID_1,1
2034177,COVID_1,1
298530,COVID_1,1
1441549,COVID_1,1
1670597,COVID_1,1
2047556,COVID_1,1
2217422,COVID_1,1
1515116,COVID_1,1
130651,COVID_1,1
1647380,COVID_1,1
1688158,COVID_1,1
1807138,COVID_1,1
2031632,COVID_1,1
2112231,COVID_1,1
1400792,COVID_1,1
2483522,COVID_1,1
3273546,COVID_1,1
490363,COVID_1,1
2136032,COVID_1,1
3422506,COVID_1,1
2031625,COVID_1,1
1584272,COVID_1,1
3950798,COVID_1,1
4469504,COVID_1,1
2243291,COVID_1,1
4518033,COVID_1,1
1559508,COVID_1,1
1641204,COVID_1,1
1638927,COVID_1,1
2020437,COVID_1,1
4330678,COVID_1,1
1969646,COVID_1,1
2196325,COVID_1,1
1923102,COVID_1,1
3659013,COVID_1,1
1527448,COVID_1,1
2631008,COVID_1,1
1582364,COVID_1,1
4736037,COVID_1,1
1624274,COVID_1,1
2243361,COVID_1,1
1776581,COVID_1,1
1199914,COVID_1,1
1355311,COVID_1,1
125864,COVID_1,1
130286,COVID_1,1
2044214,COVID_1,1
2449011,COVID_1,1
1704282,COVID_1,1
1582225,COVID_1,1
586414,COVID_1,1
3093120,COVID_1,1
1741779,COVID_1,1
1297661,COVID_1,1
2240099,COVID_1,1
2054687,COVID_1,1
3900006,COVID_1,1
1122423,COVID_1,1
2482575,COVID_1,1
771886,COVID_1,1
2473003,COVID_1,1
778891,COVID_1,1
3097540,COVID_1,1
1779299,COVID_1,1
1586606,COVID_1,1
1814306,COVID_1,1
2210019,COVID_1,1
1971985,COVID_1,1
927752,COVID_1,1
2039416,COVID_1,1
2239989,COVID_1,1
1755344,COVID_1,1
1787026,COVID_1,1
3480551,COVID_1,1
2131744,COVID_1,1
1888145,COVID_1,1
2187844,COVID_1,1
1977927,COVID_1,1
1948858,COVID_1,1
3107065,COVID_1,1
1850278,COVID_1,1
2020717,COVID_1,1
2068357,COVID_1,1
1195357,COVID_1,1
940316,COVID_1,1
1665093,COVID_1,1
1685952,COVID_1,1
185800,COVID_1,1
1266680,COVID_1,1
2047551,COVID_1,1
1795116,COVID_1,1
1143313,COVID_1,1
778879,COVID_1,1
1807613,COVID_1,1
1781878,COVID_1,1
893295,COVID_1,1
958222,COVID_1,1
1634203,COVID_1,1
2611526,COVID_1,1
2180980,COVID_1,1
252344,COVID_1,1
1796258,COVID_1,1
1577861,COVID_1,1
3264047,COVID_1,1
2450526,COVID_1,1
1961677,COVID_1,1
1862372,COVID_1,1
695264,COVID_1,1
1389842,COVID_1,1
3344093,COVID_1,1
149477,COVID_1,1
1943435,COVID_1,1
256853,COVID_1,1
374292,COVID_1,1
2166622,COVID_1,1
1763525,COVID_1,1
2125736,COVID_1,1
1216735,COVID_1,1
2168185,COVID_1,1
3104006,COVID_1,1
3809005,COVID_1,1
1731517,COVID_1,1
1122422,COVID_1,1
2120491,COVID_1,1
1776043,COVID_1,1
1655557,COVID_1,1
1967336,COVID_1,1
2175651,COVID_1,1
2222860,COVID_1,1
2159709,COVID_1,1
272006,COVID_1,1
2371525,COVID_1,1
1619577,COVID_1,1
1584668,COVID_1,1
2238567,COVID_1,1
942505,COVID_1,1
3038076,COVID_1,1
246893,COVID_1,1
1408844,COVID_1,1
1456395,COVID_1,1
1947281,COVID_1,1
130298,COVID_1,1
1859000,COVID_1,1
2047422,COVID_1,1
888873,COVID_1,1
3819516,COVID_1,1
545929,COVID_1,1
1948429,COVID_1,1
1877077,COVID_1,1
2171983,COVID_1,1
3187506,COVID_1,1
4518035,COVID_1,1
1634144,COVID_1,1
2193399,COVID_1,1
2129278,COVID_1,1
3112656,COVID_1,1
794136,COVID_1,1
843230,COVID_1,1
1190779,COVID_1,1
1467819,COVID_1,1
1856398,COVID_1,1
2908517,COVID_1,1
1753404,COVID_1,1
433945,COVID_1,1
3588505,COVID_1,1
1915882,COVID_1,1
1905016,COVID_1,1
1097720,COVID_1,1
1355315,COVID_1,1
3264052,COVID_1,1
1629944,COVID_1,1
1618640,COVID_1,1
1731521,COVID_1,1
475442,COVID_1,1
2726602,COVID_1,1
2193147,COVID_1,1
1368573,COVID_1,1
2193393,COVID_1,1
1737534,COVID_1,1
1021203,COVID_1,1
4502024,COVID_1,1
1786930,COVID_1,1
1811167,COVID_1,1
151643,COVID_1,1
1099183,COVID_1,1
1399348,COVID_1,1
2044197,COVID_1,1
547286,COVID_1,1
2836042,COVID_1,1
1610009,COVID_1,1
2047554,COVID_1,1
2168178,COVID_1,1
2162184,COVID_1,1
1456362,COVID_1,1
3542040,COVID_1,1
2167763,COVID_1,1
1687065,COVID_1,1
1563428,COVID_1,1
1994410,COVID_1,1
3894036,COVID_1,1
1952158,COVID_1,1
1890522,COVID_1,1
1597113,COVID_1,1
2217569,COVID_1,1
514071,COVID_1,1
2134483,COVID_1,1
1646484,COVID_1,1
1762752,COVID_1,1
1833025,COVID_1,1
1008596,COVID_1,1
2031440,COVID_1,1
3006518,COVID_1,1
1549597,COVID_1,1
1704227,COVID_1,1
2047386,COVID_1,1
2135294,COVID_1,1
374297,COVID_1,1
2615534,COVID_1,1
2047245,COVID_1,1
3097523,COVID_1,1
1800693,COVID_1,1
2450056,COVID_1,1
1773839,COVID_1,1
3112549,COVID_1,1
1555909,COVID_1,1
127759,COVID_1,1
1270255,COVID_1,1
727869,COVID_1,1
780834,COVID_1,1
2091217,COVID_1,1
1634128,COVID_1,1
1688882,COVID_1,1
2988540,COVID_1,1
1226398,COVID_1,1
1495024,COVID_1,1
2094433,COVID_1,1
2601030,COVID_1,1
1967329,COVID_1,1
1854947,COVID_1,1
3529009,COVID_1,1
2078319,COVID_1,1
4240503,COVID_1,1
173899,COVID_1,1
960466,COVID_1,1
1718327,COVID_1,1
582672,COVID_1,1
2112229,COVID_1,1
1685953,COVID_1,1
3022510,COVID_1,1
2599529,COVID_1,1
2449016,COVID_1,1
2128347,COVID_1,1
1256224,COVID_1,1
3698005,COVID_1,1
395905,COVID_1,1
1977335,COVID_1,1
2174913,COVID_1,1
2044187,COVID_1,1
3809007,COVID_1,1
28149,COVID_1,1
1833883,COVID_1,1
1853719,COVID_1,1
3653005,COVID_1,1
2090695,COVID_1,1
2089426,COVID_1,1
1670938,COVID_1,1
1456383,COVID_1,1
80384,COVID_1,1
1956912,COVID_1,1
374275,COVID_1,1
1178576,COVID_1,1
2047445,COVID_1,1
1486079,COVID_1,1
1912959,COVID_1,1
2135485,COVID_1,1
2886011,COVID_1,1
988608,COVID_1,1
1282025,COVID_1,1
140122,COVID_1,1
1779395,COVID_1,1
2223305,COVID_1,1
122942,COVID_1,1
2230077,COVID_1,1
633005,COVID_1,1
4096519,COVID_1,1
1903082,COVID_1,1
455072,COVID_1,1
1457182,COVID_1,1
1146060,COVID_1,1
2047450,COVID_1,1
1855927,COVID_1,1
1739401,COVID_1,1
894443,COVID_1,1
4216503,COVID_1,1
1911918,COVID_1,1
3101512,COVID_1,1
2822029,COVID_1,1
988393,COVID_1,1
2193782,COVID_1,1
1433212,COVID_1,1
1548405,COVID_1,1
1920058,COVID_1,1
1653119,COVID_1,1
374277,COVID_1,1
1486021,COVID_1,1
284413,COVID_1,1
1976780,COVID_1,1
81535,COVID_1,1
1141911,COVID_1,1
1887902,COVID_1,1
1259931,COVID_1,1
1639563,COVID_1,1
3183024,COVID_1,1
2651019,COVID_1,1
609495,COVID_1,1
1428005,COVID_1,1
3197502,COVID_1,1
1968377,COVID_1,1
291086,COVID_1,1
1792616,COVID_1,1
3871554,COVID_1,1
533904,COVID_1,1
2083340,COVID_1,1
256854,COVID_1,1
938524,COVID_1,1
1692430,COVID_1,1
189145,COVID_1,1
3587556,COVID_1,1
3082002,COVID_1,1
1531089,COVID_1,1
4283501,COVID_1,1
635478,COVID_1,1
1877096,COVID_1,1
256848,COVID_1,1
284415,COVID_1,1
2940018,COVID_1,1
960474,COVID_1,1
1995152,COVID_1,1
2713031,COVID_1,1
3967534,COVID_1,1
578629,COVID_1,1
1855014,COVID_1,1
524182,COVID_1,1
1857355,COVID_1,1
2061126,COVID_1,1
1495841,COVID_1,1
1662173,COVID_1,1
2166481,COVID_1,1
3601031,COVID_1,1
3586521,COVID_1,1
2146721,COVID_1,1
1038100,COVID_1,1
1604825,COVID_1,1
81514,COVID_1,1
764550,COVID_1,1
3088012,COVID_1,1
394958,COVID_1,1
691258,COVID_1,1
465321,COVID_1,1
2177374,COVID_1,1
2126324,COVID_1,1
1916990,COVID_1,1
2231840,COVID_1,1
2115725,COVID_1,1
1634136,COVID_1,1
1427675,COVID_1,1
83080,COVID_1,1
2614547,COVID_1,1
1200260,COVID_1,1
2208010,COVID_1,1
116034,COVID_1,1
2040229,COVID_1,1
3588506,COVID_1,1
4096517,COVID_1,1
1826583,COVID_1,1
1887124,COVID_1,1
1637127,COVID_1,1
1947255,COVID_1,1
3815015,COVID_1,1
1634138,COVID_1,1
420512,COVID_1,1
4604524,COVID_1,1
2172690,COVID_1,1
126559,COVID_1,1
869015,COVID_1,1
1653124,COVID_1,1
1596980,COVID_1,1
1533077,COVID_1,1
1634143,COVID_1,1
1804578,COVID_1,1
2234895,COVID_1,1
1582342,COVID_1,1
2707528,COVID_1,1
2028020,COVID_1,1
3391563,COVID_1,1
250593,COVID_1,1
2124287,COVID_1,1
160279,COVID_1,1
1582536,COVID_1,1
586412,COVID_1,1
2138248,COVID_1,1
509405,COVID_1,1
1778986,COVID_1,1
1788720,COVID_1,1
1795358,COVID_1,1
721104,COVID_1,1
3857084,COVID_1,1
2020720,COVID_1,1
3659024,COVID_1,1
2495115,COVID_1,1
1764212,COVID_1,1
125712,COVID_1,1
1250999,COVID_1,1
3391557,COVID_1,1
497670,COVID_1,1
152939,COVID_1,1
1598327,COVID_1,1
1868320,COVID_1,1
2028015,COVID_1,1
1856741,COVID_1,1
1932500,COVID_1,1
3107060,COVID_1,1
1969659,COVID_1,1
958908,COVID_1,1
2125733,COVID_1,1
1951433,COVID_1,1
170346,COVID_1,1
1436986,COVID_1,1
616282,COVID_1,1
188682,COVID_1,1
1123106,COVID_1,1
1151384,COVID_1,1
93645,COVID_1,1
2217362,COVID_1,1
1752312,COVID_1,1
1669557,COVID_1,1
609496,COVID_1,1
2040509,COVID_1,1
1152164,COVID_1,1
2066995,COVID_1,1
1640448,COVID_1,1
2474080,COVID_1,1
2136024,COVID_1,1
2243338,COVID_1,1
2234674,COVID_1,1
2047438,COVID_1,1
2431565,COVID_1,1
1263027,COVID_1,1
2173915,COVID_1,1
2235243,COVID_1,1
1776236,COVID_1,1
703363,COVID_1,1
2209880,COVID_1,1
1825961,COVID_1,1
1582326,COVID_1,1
1838413,COVID_1,1
125444,COVID_1,1
1657822,COVID_1,1
1177980,COVID_1,1
991167,COVID_1,1
1151385,COVID_1,1
252343,COVID_1,1
275378,COVID_1,1
3311049,COVID_1,1
586416,COVID_1,1
1157968,COVID_1,1
3471059,COVID_1,1
582670,COVID_1,1
81524,COVID_1,1
2185132,COVID_1,1
296991,COVID_1,1
1969657,COVID_1,1
1355307,COVID_1,1
2221027,COVID_1,1
3012583,COVID_1,1
1119061,COVID_1,1
1851585,COVID_1,1
2182043,COVID_1,1
28126,COVID_1,1
1761475,COVID_1,1
2726681,COVID_1,1
1766425,COVID_1,1
1147197,COVID_1,1
903979,COVID_1,1
1793614,COVID_1,1
2243341,COVID_1,1
1776240,COVID_1,1
2240088,COVID_1,1
2048575,COVID_1,1
170378,COVID_1,1
2001146,COVID_1,1
1376805,COVID_1,1
275874,COVID_1,1
3101022,COVID_1,1
1640407,COVID_1,1
3587060,COVID_1,1
1225103,COVID_1,1
2448514,COVID_1,1
1977339,COVID_1,1
2172546,COVID_1,1
3894088,COVID_1,1
3367068,COVID_1,1
2223606,COVID_1,1
2091242,COVID_1,1
779719,COVID_1,1
3949015,COVID_1,1
939080,COVID_1,1
2173111,COVID_1,1
4335525,COVID_1,1
4381022,COVID_1,1
2049845,COVID_1,1
474850,COVID_1,1
1905408,COVID_1,1
2864043,COVID_1,1
1797591,COVID_1,1
2053678,COVID_1,1
2989072,COVID_1,1
3498017,COVID_1,1
2068850,COVID_1,1
1289001,COVID_1,1
2868055,COVID_1,1
4396021,COVID_1,1
1881992,COVID_1,1
1431214,COVID_1,1
2166034,COVID_1,1
933287,COVID_1,1
2196154,COVID_1,1
1853098,COVID_1,1
1787008,COVID_1,1
1423958,COVID_1,1
2133640,COVID_1,1
251671,COVID_1,1
170379,COVID_1,1
1634126,COVID_1,1
2935512,COVID_1,1
1452190,COVID_1,1
2047380,COVID_1,1
2167753,COVID_1,1
1936669,COVID_1,1
3391546,COVID_1,1
3081536,COVID_1,1
1747921,COVID_1,1
1393795,COVID_1,1
1600889,COVID_1,1
1723781,COVID_1,1
2996562,COVID_1,1
372459,COVID_1,1
1786409,COVID_1,1
185811,COVID_1,1
3391564,COVID_1,1
1972666,COVID_1,1
1039340,COVID_1,1
2996523,COVID_1,1
699313,COVID_1,1
151674,COVID_1,1
635476,COVID_1,1
3078667,COVID_1,1
1276582,COVID_1,1
129157,COVID_1,1
2094425,COVID_1,1
2110164,COVID_1,1
1853080,COVID_1,1
2125228,COVID_1,1
2084723,COVID_1,1
3086025,COVID_1,1
1428981,COVID_1,1
185885,COVID_1,1
3998047,COVID_1,1
2020736,COVID_1,1
1664112,COVID_1,1
3904513,COVID_1,1
2233671,COVID_1,1
2175674,COVID_1,1
2599021,COVID_1,1
1721162,COVID_1,1
3494041,COVID_1,1
682705,COVID_1,1
87979,COVID_1,1
1658284,COVID_1,1
1141906,COVID_1,1
1965445,COVID_1,1
1808071,COVID_1,1
1969022,COVID_1,1
1583165,COVID_1,1
590845,COVID_1,1
2069649,COVID_1,1
2049215,COVID_1,1
3945003,COVID_1,1
1636574,COVID_1,1
125384,COVID_1,1
1948262,COVID_1,1
1752317,COVID_1,1
2327059,COVID_1,1
1180674,COVID_1,1
1687822,COVID_1,1
1905387,COVID_1,1
1923087,COVID_1,1
4503507,COVID_1,1
3101506,COVID_1,1
1036960,COVID_1,1
1734121,COVID_1,1
2117754,COVID_1,1
1853081,COVID_1,1
1417039,COVID_1,1
188368,COVID_1,1
1735763,COVID_1,1
1213528,COVID_1,1
596095,COVID_1,1
1277347,COVID_1,1
2220072,COVID_1,1
2483527,COVID_1,1
3391562,COVID_1,1
4183533,COVID_1,1
482690,COVID_1,1
2045312,COVID_1,1
3849696,COVID_1,1
4183519,COVID_1,1
1853225,COVID_1,1
1915879,COVID_1,1
2232507,COVID_1,1
2127367,COVID_1,1
1579500,COVID_1,1
1977342,COVID_1,1
647010,COVID_1,1
1943806,COVID_1,1
2836044,COVID_1,1
374305,COVID_1,1
3498018,COVID_1,1
28138,COVID_1,1
1593319,COVID_1,1
1272118,COVID_1,1
2086713,COVID_1,1
2094430,COVID_1,1
1357815,COVID_1,1
2223309,COVID_1,1
2233667,COVID_1,1
1338636,COVID_1,1
3391548,COVID_1,1
1369678,COVID_1,1
474916,COVID_1,1
1754627,COVID_1,1
83076,COVID_1,1
374303,COVID_1,1
228119,COVID_1,1
1948290,COVID_1,1
1969018,COVID_1,1
2139265,COVID_1,1
1428986,COVID_1,1
2028166,COVID_1,1
2425522,COVID_1,1
497684,COVID_1,1
2031413,COVID_1,1
475135,COVID_1,1
883889,COVID_1,1
2125047,COVID_1,1
301951,COVID_1,1
4604526,COVID_1,1
4183555,COVID_1,1
1897816,COVID_1,1
2988539,COVID_1,1
1413045,COVID_1,1
949896,COVID_1,1
4604525,COVID_1,1
1630174,COVID_1,1
2031629,COVID_1,1
2107934,COVID_1,1
3055503,COVID_1,1
3572053,COVID_1,1
1833667,COVID_1,1
3391560,COVID_1,1
84445,COVID_1,1
367926,COVID_1,1
1951438,COVID_1,1
2601040,COVID_1,1
528731,COVID_1,1
1389847,COVID_1,1
2180988,COVID_1,1
1997277,COVID_1,1
4381020,COVID_1,1
1492870,COVID_1,1
515827,COVID_1,1
1737542,COVID_1,1
764549,COVID_1,1
1523949,COVID_1,1
2053687,COVID_1,1
670862,COVID_1,1
2052062,COVID_1,1
1782415,COVID_1,1
938841,COVID_1,1
2984038,COVID_1,1
495006,COVID_1,1
1655582,COVID_1,1
2055701,COVID_1,1
1586624,COVID_1,1
1629687,COVID_1,1
1568100,COVID_1,1
2167765,COVID_1,1
2047543,COVID_1,1
1195293,COVID_1,1
4699047,COVID_1,1
1152163,COVID_1,1
1847861,COVID_1,1
1604720,COVID_1,1
482693,COVID_1,1
2135492,COVID_1,1
1235852,COVID_1,1
2127316,COVID_1,1
2631009,COVID_1,1
2083286,COVID_1,1
3391536,COVID_1,1
1290646,COVID_1,1
1724275,COVID_1,1
1245430,COVID_1,1
3784099,COVID_1,1
151651,COVID_1,1
122941,COVID_1,1
2128307,COVID_1,1
1939809,COVID_1,1
2031627,COVID_1,1
1969647,COVID_1,1
2128479,COVID_1,1
3849662,COVID_1,1
1172715,COVID_1,1
2223306,COVID_1,1
125566,COVID_1,1
1217281,COVID_1,1
3950797,COVID_1,1
528880,COVID_1,1
2238641,COVID_1,1
658588,COVID_1,1
3438532,COVID_1,1
2015543,COVID_1,1
2345579,COVID_1,1
2048079,COVID_1,1
1828413,COVID_1,1
1976762,COVID_1,1
760440,COVID_1,1
507310,COVID_1,1
4134016,COVID_1,1
2243275,COVID_1,1
1535366,COVID_1,1
2020744,COVID_1,1
2086484,COVID_1,1
2434080,COVID_1,1
2205093,COVID_1,1
3950794,COVID_1,1
126625,COVID_1,1
1400778,COVID_1,1
1264522,COVID_1,1
1217278,COVID_1,1
1274277,COVID_1,1
1666480,COVID_1,1
2161182,COVID_1,1
4303643,COVID_1,1
79203,COVID_1,1
1883365,COVID_1,1
1237666,COVID_1,1
374285,COVID_1,1
301953,COVID_1,1
1524526,COVID_1,1
1761057,COVID_1,1
1064863,COVID_1,1
1884668,COVID_1,1
2296013,COVID_1,1
1195283,COVID_1,1
126622,COVID_1,1
1203990,COVID_1,1
2055821,COVID_1,1
1582637,COVID_1,1
1901962,COVID_1,1
2218005,COVID_1,1
1068424,COVID_1,1
3101514,COVID_1,1
2128340,COVID_1,1
1141908,COVID_1,1
1064865,COVID_1,1
1217256,COVID_1,1
1535364,COVID_1,1
2172682,COVID_1,1
2251572,COVID_1,1
1688878,COVID_1,1
4096520,COVID_1,1
1761060,COVID_1,1
126210,COVID_1,1
148452,COVID_1,1
1855599,COVID_1,1
3891058,COVID_1,1
2022262,COVID_1,1
590847,COVID_1,1
463817,COVID_1,1
573150,COVID_1,1
1399354,COVID_1,1
2022625,COVID_1,1
1968486,COVID_1,1
1078938,COVID_1,1
185802,COVID_1,1
256847,COVID_1,1
537758,COVID_1,1
1967330,COVID_1,1
3894543,COVID_1,1
1291718,COVID_1,1
1956908,COVID_1,1
2087665,COVID_1,1
2230394,COVID_1,1
1969914,COVID_1,1
4699053,COVID_1,1
1749871,COVID_1,1
1687687,COVID_1,1
1006789,COVID_1,1
524181,COVID_1,1
1749596,COVID_1,1
2120473,COVID_1,1
1928376,COVID_1,1
482687,COVID_1,1
1847868,COVID_1,1
1349663,COVID_1,1
1663855,COVID_1,1
29067,COVID_1,1
644769,COVID_1,1
3444541,COVID_1,1
2222287,COVID_1,1
2047449,COVID_1,1
1947278,COVID_1,1
2450052,COVID_1,1
1422536,COVID_1,1
2083268,COVID_1,1
3936003,COVID_1,1
1486070,COVID_1,1
199412,COVID_1,1
1501401,COVID_1,1
1268265,COVID_1,1
2448630,COVID_1,1
1801378,COVID_1,1
1687043,COVID_1,1
1956920,COVID_1,1
115993,COVID_1,1
1335732,COVID_1,1
2160075,COVID_1,1
1011214,COVID_1,1
2127540,COVID_1,1
545932,COVID_1,1
906537,COVID_1,1
2601032,COVID_1,1
3916563,COVID_1,1
1833020,COVID_1,1
675468,COVID_1,1
1725716,COVID_1,1
2137056,COVID_1,1
1168571,COVID_1,1
1721844,COVID_1,1
633063,COVID_1,1
1577835,COVID_1,1
3556091,COVID_1,1
1686265,COVID_1,1
665524,COVID_1,1
2084761,COVID_1,1
2251575,COVID_1,1
2051956,COVID_1,1
2218002,COVID_1,1
116033,COVID_1,1
1713972,COVID_1,1
1833845,COVID_1,1
938527,COVID_1,1
1948409,COVID_1,1
1400793,COVID_1,1
2043577,COVID_1,1
1969817,COVID_1,1
2083277,COVID_1,1
2039418,COVID_1,1
1417794,COVID_1,1
1802760,COVID_1,1
2139244,COVID_1,1
934853,COVID_1,1
1355316,COVID_1,1
2091792,COVID_1,1
1812481,COVID_1,1
1237176,COVID_1,1
143387,COVID_1,1
1875950,COVID_1,1
2216269,COVID_1,1
1095592,COVID_1,1
3188001,COVID_1,1
294781,COVID_1,1
3893552,COVID_1,1
1808068,COVID_1,1
3194551,COVID_1,1
3730565,COVID_1,1
1584268,COVID_1,1
1887884,COVID_1,1
890503,COVID_1,1
3556086,COVID_1,1
473358,COVID_1,1
189141,COVID_1,1
1408853,COVID_1,1
2630522,COVID_1,1
2235241,COVID_1,1
3894048,COVID_1,1
2230061,COVID_1,1
3135007,COVID_1,1
318622,COVID_1,1
1596987,COVID_1,1
1025326,COVID_1,1
163617,COVID_1,1
123971,COVID_1,1
2047540,COVID_1,1
1021204,COVID_1,1
927753,COVID_1,1
852373,COVID_1,1
246892,COVID_1,1
1099676,COVID_1,1
1274283,COVID_1,1
3112552,COVID_1,1
124786,COVID_1,1
1535754,COVID_1,1
1969651,COVID_1,1
2448631,COVID_1,1
2048027,COVID_1,1
1178577,COVID_1,1
1549661,COVID_1,1
1857375,COVID_1,1
150139,COVID_1,1
3325049,COVID_1,1
1947211,COVID_1,1
847119,COVID_1,1
1737960,COVID_1,1
1771684,COVID_1,1
4008001,COVID_1,1
596100,COVID_1,1
2243340,COVID_1,1
1920057,COVID_1,1
4067012,COVID_1,1
1689318,COVID_1,1
1690991,COVID_1,1
2040595,COVID_1,1
2128559,COVID_1,1
771882,COVID_1,1
1146872,COVID_1,1
520845,COVID_1,1
1583116,COVID_1,1
958481,COVID_1,1
1190957,COVID_1,1
1942062,COVID_1,1
1800670,COVID_1,1
126636,COVID_1,1
1904583,COVID_1,1
3026510,COVID_1,1
1588006,COVID_1,1
124830,COVID_1,1
2047448,COVID_1,1
661323,COVID_1,1
1259739,COVID_1,1
1617879,COVID_1,1
676636,COVID_1,1
781074,COVID_1,1
1813937,COVID_1,1
1245426,COVID_1,1
1937922,COVID_1,1
1911358,COVID_1,1
3471068,COVID_1,1
1485991,COVID_1,1
1640404,COVID_1,1
2110160,COVID_1,1
1583129,COVID_1,1
2230068,COVID_1,1
2131742,COVID_1,1
2613557,COVID_1,1
1529390,COVID_1,1
3690100,COVID_1,1
1017079,COVID_1,1
1232733,COVID_1,1
1761770,COVID_1,1
1192687,COVID_1,1
115990,COVID_1,1
2083272,COVID_1,1
1978392,COVID_1,1
1972661,COVID_1,1
1808365,COVID_1,1
1642129,COVID_1,1
1688152,COVID_1,1
1623149,COVID_1,1
1722181,COVID_1,1
1565340,COVID_1,1
2171981,COVID_1,1
2217449,COVID_1,1
2053129,COVID_1,1
4459533,COVID_1,1
4503502,COVID_1,1
1200252,COVID_1,1
585077,COVID_1,1
1694470,COVID_1,1
1932538,COVID_1,1
1923074,COVID_1,1
1848091,COVID_1,1
2128337,COVID_1,1
665525,COVID_1,1
1671021,COVID_1,1
1956910,COVID_1,1
1911356,COVID_1,1
1170639,COVID_1,1
1541170,COVID_1,1
1951425,COVID_1,1
939762,COVID_1,1
1646548,COVID_1,1
459390,COVID_1,1
2969041,COVID_1,1
1280983,COVID_1,1
1579502,COVID_1,1
2031435,COVID_1,1
665211,COVID_1,1
2240090,COVID_1,1
3596501,COVID_1,1
3971501,COVID_1,1
2047408,COVID_1,1
170363,COVID_1,1
115984,COVID_1,1
708156,COVID_1,1
2057158,COVID_1,1
1869627,COVID_1,1
2178346,COVID_1,1
3391545,COVID_1,1
596123,COVID_1,1
2020546,COVID_1,1
1425522,COVID_1,1
3311047,COVID_1,1
2128368,COVID_1,1
1061842,COVID_1,1
1705161,COVID_1,1
3587058,COVID_1,1
3135009,COVID_1,1
1289007,COVID_1,1
2130280,COVID_1,1
79646,COVID_1,1
2698591,COVID_1,1
3311046,COVID_1,1
188371,COVID_1,1
1732350,COVID_1,1
1763935,COVID_1,1
1609183,COVID_1,1
3438534,COVID_1,1
185887,COVID_1,1
1855008,COVID_1,1
2135489,COVID_1,1
1209746,COVID_1,1
1510889,COVID_1,1
2217566,COVID_1,1
2078315,COVID_1,1
3757012,COVID_1,1
2020733,COVID_1,1
1838408,COVID_1,1
3112548,COVID_1,1
374299,COVID_1,1
3606095,COVID_1,1
1644497,COVID_1,1
2047370,COVID_1,1
3022515,COVID_1,1
665210,COVID_1,1
1524654,COVID_1,1
272018,COVID_1,1
2044192,COVID_1,1
3084042,COVID_1,1
3910039,COVID_1,1
1916496,COVID_1,1
1234721,COVID_1,1
1057189,COVID_1,1
2449504,COVID_1,1
163371,COVID_1,1
3498019,COVID_1,1
1486069,COVID_1,1
372907,COVID_1,1
2031388,COVID_1,1
1522816,COVID_1,1
2031618,COVID_1,1
2048015,COVID_1,1
1498309,COVID_1,1
2233669,COVID_1,1
170362,COVID_1,1
1826010,COVID_1,1
2051712,COVID_1,1
4138501,COVID_1,1
1884653,COVID_1,1
4252502,COVID_1,1
2218580,COVID_1,1
2022628,COVID_1,1
1808364,COVID_1,1
2055700,COVID_1,1
2042597,COVID_1,1
2136026,COVID_1,1
1833839,COVID_1,1
2136025,COVID_1,1
1976763,COVID_1,1
3015603,COVID_1,1
1604823,COVID_1,1
2173901,COVID_1,1
1947217,COVID_1,1
2042775,COVID_1,1
1694485,COVID_1,1
2220823,COVID_1,1
1192923,COVID_1,1
2102022,COVID_1,1
1655579,COVID_1,1
2134692,COVID_1,1
958897,COVID_1,1
2114002,COVID_1,1
1857425,COVID_1,1
515826,COVID_1,1
1832338,COVID_1,1
1068422,COVID_1,1
440856,COVID_1,1
157056,COVID_1,1
2169095,COVID_1,1
1373595,COVID_1,1
2351505,COVID_1,1
2144263,COVID_1,1
1591354,COVID_1,1
2031438,COVID_1,1
2210022,COVID_1,1
4050017,COVID_1,1
1853122,COVID_1,1
228104,COVID_1,1
974539,COVID_1,1
1700777,COVID_1,1
2047439,COVID_1,1
1245012,COVID_1,1
1413732,COVID_1,1
1970348,COVID_1,1
1687790,COVID_1,1
4412561,COVID_1,1
958225,COVID_1,1
2049213,COVID_1,1
1928476,COVID_1,1
2053690,COVID_1,1
1524617,COVID_1,1
2196328,COVID_1,1
2031433,COVID_1,1
3987507,COVID_1,1
1068423,COVID_1,1
126276,COVID_1,1
596090,COVID_1,1
246887,COVID_1,1
2959060,COVID_1,1
1969019,COVID_1,1
2045403,COVID_1,1
1235850,COVID_1,1
1928475,COVID_1,1
4385054,COVID_1,1
1482281,COVID_1,1
1158046,COVID_1,1
1620126,COVID_1,1
1898859,COVID_1,1
4252504,COVID_1,1
3104017,COVID_1,1
1688879,COVID_1,1
794245,COVID_1,1
1858998,COVID_1,1
1972663,COVID_1,1
597734,COVID_1,1
3270508,COVID_1,1
1509196,COVID_1,1
1664107,COVID_1,1
2180983,COVID_1,1
1808207,COVID_1,1
1137504,COVID_1,1
3514135,COVID_1,1
1347537,COVID_1,1
1548409,COVID_1,1
3559137,COVID_1,1
1748363,COVID_1,1
2101609,COVID_1,1
1956898,COVID_1,1
2112239,COVID_1,1
127986,COVID_1,1
1800676,COVID_1,1
3608468,COVID_1,1
1820241,COVID_1,1
170357,COVID_1,1
1167939,COVID_1,1
3195539,COVID_1,1
433946,COVID_1,1
1507718,COVID_1,1
960469,COVID_1,1
1687788,COVID_1,1
2047421,COVID_1,1
1425430,COVID_1,1
1626193,COVID_1,1
3550014,COVID_1,1
28136,COVID_1,1
2051346,COVID_1,1
1033223,COVID_1,1
1724280,COVID_1,1
2217355,COVID_1,1
716419,COVID_1,1
4384512,COVID_1,1
1853124,COVID_1,1
3587603,COVID_1,1
2473007,COVID_1,1
2053706,COVID_1,1
1884663,COVID_1,1
1612145,COVID_1,1
540311,COVID_1,1
1781550,COVID_1,1
2128467,COVID_1,1
4699044,COVID_1,1
79201,COVID_1,1
2647022,COVID_1,1
1743587,COVID_1,1
1647377,COVID_1,1
1594189,COVID_1,1
1670943,COVID_1,1
2317013,COVID_1,1
2184228,COVID_1,1
2482572,COVID_1,1
199413,COVID_1,1
1805929,COVID_1,1
1779374,COVID_1,1
2794523,COVID_1,1
374413,COVID_1,1
1793169,COVID_1,1
126871,COVID_1,1
3018001,COVID_1,1
3391539,COVID_1,1
3982029,COVID_1,1
374274,COVID_1,1
1787022,COVID_1,1
1927530,COVID_1,1
2217364,COVID_1,1
1252012,COVID_1,1
1943445,COVID_1,1
1997275,COVID_1,1
713792,COVID_1,1
1127294,COVID_1,1
1412657,COVID_1,1
1515774,COVID_1,1
2039299,COVID_1,1
3810527,COVID_1,1
83079,COVID_1,1
3550544,COVID_1,1
2173957,COVID_1,1
1389436,COVID_1,1
1877065,COVID_1,1
1918405,COVID_1,1
157055,COVID_1,1
1341119,COVID_1,1
3498020,COVID_1,1
1533080,COVID_1,1
1621872,COVID_1,1
2090571,COVID_1,1
2485571,COVID_1,1
3871552,COVID_1,1
2474079,COVID_1,1
1642100,COVID_1,1
2051954,COVID_1,1
2169093,COVID_1,1
228096,COVID_1,1
2236056,COVID_1,1
272005,COVID_1,1
1579514,COVID_1,1
1706606,COVID_1,1
188678,COVID_1,1
1025290,COVID_1,1
1653121,COVID_1,1
966560,COVID_1,1
984137,COVID_1,1
1413329,COVID_1,1
1135753,COVID_1,1
463816,COVID_1,1
1655308,COVID_1,1
1535011,COVID_1,1
2235809,COVID_1,1
1947307,COVID_1,1
2031360,COVID_1,1
1272119,COVID_1,1
1836883,COVID_1,1
2052274,COVID_1,1
3893536,COVID_1,1
2222354,COVID_1,1
1805672,COVID_1,1
3945541,COVID_1,1
2151826,COVID_1,1
691257,COVID_1,1
2044573,COVID_1,1
1061843,COVID_1,1
2161177,COVID_1,1
1613098,COVID_1,1
2089461,COVID_1,1
1753213,COVID_1,1
2053421,COVID_1,1
2020722,COVID_1,1
4110514,COVID_1,1
4412556,COVID_1,1
1179397,COVID_1,1
1920270,COVID_1,1
1157206,COVID_1,1
1141910,COVID_1,1
1918406,COVID_1,1
960471,COVID_1,1
1641269,COVID_1,1
2230056,COVID_1,1
374279,COVID_1,1
2184244,COVID_1,1
3021770,COVID_1,1
1017078,COVID_1,1
1963051,COVID_1,1
2048176,COVID_1,1
1771686,COVID_1,1
1976781,COVID_1,1
2117114,COVID_1,1
78998,COVID_1,1
2175664,COVID_1,1
2179261,COVID_1,1
1753205,COVID_1,1
4385040,COVID_1,1
115994,COVID_1,1
1639571,COVID_1,1
185808,COVID_1,1
126379,COVID_1,1
1389925,COVID_1,1
2058780,COVID_1,1
2107933,COVID_1,1
4330659,COVID_1,1
1947289,COVID_1,1
1049784,COVID_1,1
616283,COVID_1,1
125373,COVID_1,1
4392559,COVID_1,1
1826005,COVID_1,1
250585,COVID_1,1
1492875,COVID_1,1
2220243,COVID_1,1
2483517,COVID_1,1
1752308,COVID_1,1
2052247,COVID_1,1
2161174,COVID_1,1
1638564,COVID_1,1
1373545,COVID_1,1
1749869,COVID_1,1
778890,COVID_1,1
1251000,COVID_1,1
2448583,COVID_1,1
1718330,COVID_1,1
1884689,COVID_1,1
1959711,COVID_1,1
1905415,COVID_1,1
1626541,COVID_1,1
3567033,COVID_1,1
1153412,COVID_1,1
459986,COVID_1,1
1922624,COVID_1,1
2053701,COVID_1,1
2193403,COVID_1,1
958906,COVID_1,1
1838409,COVID_1,1
2077347,COVID_1,1
81522,COVID_1,1
374289,COVID_1,1
1583103,COVID_1,1
1279627,COVID_1,1
997928,COVID_1,1
753284,COVID_1,1
1342059,COVID_1,1
1587497,COVID_1,1
1878719,COVID_1,1
1408839,COVID_1,1
1858025,COVID_1,1
82460,COVID_1,1
4007501,COVID_1,1
2105313,COVID_1,1
188677,COVID_1,1
2160079,COVID_1,1
1828436,COVID_1,1
2047409,COVID_1,1
613989,COVID_1,1
1555928,COVID_1,1
1656699,COVID_1,1
1195309,COVID_1,1
1976783,COVID_1,1
3849702,COVID_1,1
1687068,COVID_1,1
1761766,COVID_1,1
1245433,COVID_1,1
1688167,COVID_1,1
2091791,COVID_1,1
251672,COVID_1,1
116025,COVID_1,1
1538233,COVID_1,1
2184247,COVID_1,1
3082017,COVID_1,1
1082648,COVID_1,1
2020444,COVID_1,1
1036168,COVID_1,1
4524056,COVID_1,1
188681,COVID_1,1
4736032,COVID_1,1
4699051,COVID_1,1
1690654,COVID_1,1
1763934,COVID_1,1
256831,COVID_1,1
1636576,COVID_1,1
1627476,COVID_1,1
1969650,COVID_1,1
2220831,COVID_1,1
2019922,COVID_1,1
1795393,COVID_1,1
1369135,COVID_1,1
1765535,COVID_1,1
647012,COVID_1,1
1971978,COVID_1,1
125556,COVID_1,1
374271,COVID_1,1
497683,COVID_1,1
2223605,COVID_1,1
201812,COVID_1,1
2044975,COVID_1,1
630555,COVID_1,1
2230402,COVID_1,1
1628922,COVID_1,1
2179236,COVID_1,1
1195292,COVID_1,1
4252509,COVID_1,1
374669,COVID_1,1
1646546,COVID_1,1
2162182,COVID_1,1
3086502,COVID_1,1
3320077,COVID_1,1
78897,COVID_1,1
2022434,COVID_1,1
2083320,COVID_1,1
756729,COVID_1,1
1043052,COVID_1,1
1235853,COVID_1,1
1772907,COVID_1,1
3022511,COVID_1,1
1430007,COVID_1,1
1460331,COVID_1,1
2601038,COVID_1,1
378,COVID_1,1
1428579,COVID_1,1
1440523,COVID_1,1
1809274,COVID_1,1
1064862,COVID_1,1
2128332,COVID_1,1
3112543,COVID_1,1
1594208,COVID_1,1
2047393,COVID_1,1
1887891,COVID_1,1
2160087,COVID_1,1
3044531,COVID_1,1
630714,COVID_1,1
1143357,COVID_1,1
2217564,COVID_1,1
2179230,COVID_1,1
459984,COVID_1,1
449846,COVID_1,1
1958692,COVID_1,1
2047379,COVID_1,1
1634135,COVID_1,1
2184345,COVID_1,1
2020440,COVID_1,1
2047372,COVID_1,1
2160259,COVID_1,1
2707507,COVID_1,1
2090589,COVID_1,1
540310,COVID_1,1
2220824,COVID_1,1
2193396,COVID_1,1
2233664,COVID_1,1
272019,COVID_1,1
612080,COVID_1,1
4506549,COVID_1,1
771884,COVID_1,1
3698006,COVID_1,1
956880,COVID_1,1
3163586,COVID_1,1
2042776,COVID_1,1
1064864,COVID_1,1
1956376,COVID_1,1
2020443,COVID_1,1
1731516,COVID_1,1
2042917,COVID_1,1
2047392,COVID_1,1
2031425,COVID_1,1
125626,COVID_1,1
2184249,COVID_1,1
1901655,COVID_1,1
1752319,COVID_1,1
1795299,COVID_1,1
1523948,COVID_1,1
2296011,COVID_1,1
1769153,COVID_1,1
119852,COVID_1,1
3860552,COVID_1,1
374324,COVID_1,1
1283985,COVID_1,1
1826890,COVID_1,1
1753199,COVID_1,1
2234672,COVID_1,1
2047234,COVID_1,1
3894046,COVID_1,1
2434085,COVID_1,1
3015601,COVID_1,1
2093141,COVID_1,1
1755132,COVID_1,1
1647381,COVID_1,1
301992,COVID_1,1
244449,COVID_1,1
1542867,COVID_1,1
4156018,COVID_1,1
1289105,COVID_1,1
719670,COVID_1,1
3317014,COVID_1,1
1939854,COVID_1,1
1540864,COVID_1,1
2196331,COVID_1,1
1412928,COVID_1,1
2193781,COVID_1,1
2594650,COVID_1,1
1267783,COVID_1,1
2482571,COVID_1,1
1853383,COVID_1,1
1355313,COVID_1,1
2242924,COVID_1,1
633573,COVID_1,1
633170,COVID_1,1
794732,COVID_1,1
1349033,COVID_1,1
544742,COVID_1,1
2235443,COVID_1,1
2049046,COVID_1,1
2083309,COVID_1,1
1653122,COVID_1,1
719537,COVID_1,1
2047388,COVID_1,1
2173918,COVID_1,1
1443176,COVID_1,1
1540315,COVID_1,1
1958897,COVID_1,1
2128431,COVID_1,1
78959,COVID_1,1
115989,COVID_1,1
603379,COVID_1,1
220455,COVID_1,1
1787526,COVID_1,1
2173959,COVID_1,1
2047394,COVID_1,1
1450605,COVID_1,1
116030,COVID_1,1
1687820,COVID_1,1
1609660,COVID_1,1
3104040,COVID_1,1
3766575,COVID_1,1
1976766,COVID_1,1
3190542,COVID_1,1
972449,COVID_1,1
284406,COVID_1,1
1763527,COVID_1,1
2251087,COVID_1,1
2483502,COVID_1,1
648617,COVID_1,1
2039282,COVID_1,1
1535352,COVID_1,1
1949492,COVID_1,1
3412524,COVID_1,1
1237664,COVID_1,1
3905029,COVID_1,1
719669,COVID_1,1
863766,COVID_1,1
189143,COVID_1,1
2041505,COVID_1,1
1976765,COVID_1,1
1669238,COVID_1,1
1018755,COVID_1,1
1591347,COVID_1,1
1805917,COVID_1,1
1718328,COVID_1,1
2102166,COVID_1,1
1969910,COVID_1,1
1832097,COVID_1,1
1664129,COVID_1,1
4134015,COVID_1,1
1297890,COVID_1,1
266278,COVID_1,1
148451,COVID_1,1
1956903,COVID_1,1
3252004,COVID_1,1
1202811,COVID_1,1
2234675,COVID_1,1
2107142,COVID_1,1
1834511,COVID_1,1
2047420,COVID_1,1
2040502,COVID_1,1
1338782,COVID_1,1
1780291,COVID_1,1
2235435,COVID_1,1
1955800,COVID_1,1
1445944,COVID_1,1
1942057,COVID_1,1
27527,COVID_1,1
115657,COVID_1,1
1011219,COVID_1,1
3012580,COVID_1,1
1976757,COVID_1,1
1793620,COVID_1,1
1232736,COVID_1,1
4384510,COVID_1,1
2730542,COVID_1,1
1119795,COVID_1,1
1902934,COVID_1,1
2227816,COVID_1,1
3900010,COVID_1,1
2727504,COVID_1,1
2239990,COVID_1,1
2132073,COVID_1,1
596127,COVID_1,1
1105649,COVID_1,1
586417,COVID_1,1
2217367,COVID_1,1
1638601,COVID_1,1
1875944,COVID_1,1
1884682,COVID_1,1
1762348,COVID_1,1
1956923,COVID_1,1
3559028,COVID_1,1
1493802,COVID_1,1
1368572,COVID_1,1
2174084,COVID_1,1
188679,COVID_1,1
157052,COVID_1,1
1955058,COVID_1,1
1932792,COVID_1,1
2125463,COVID_1,1
1349649,COVID_1,1
2052045,COVID_1,1
2031436,COVID_1,1
127098,COVID_1,1
2615531,COVID_1,1
3088035,COVID_1,1
4008505,COVID_1,1
1773841,COVID_1,1
681880,COVID_1,1
711921,COVID_1,1
1141903,COVID_1,1
956881,COVID_1,1
3320083,COVID_1,1
83090,COVID_1,1
1579671,COVID_1,1
1075959,COVID_1,1
601246,COVID_1,1
2047304,COVID_1,1
2047414,COVID_1,1
1832089,COVID_1,1
2160934,COVID_1,1
3108526,COVID_1,1
1345095,COVID_1,1
715722,COVID_1,1
1653902,COVID_1,1
753283,COVID_1,1
1011221,COVID_1,1
1169639,COVID_1,1
3189017,COVID_1,1
1486008,COVID_1,1
2127317,COVID_1,1
1853087,COVID_1,1
2196324,COVID_1,1
1853126,COVID_1,1
1687475,COVID_1,1
31017,COVID_1,1
1500459,COVID_1,1
3748709,COVID_1,1
3857619,COVID_1,1
1850294,COVID_1,1
1855911,COVID_1,1
2172497,COVID_1,1
1646533,COVID_1,1
1347522,COVID_1,1
1390350,COVID_1,1
4396020,COVID_1,1
946865,COVID_1,1
1869608,COVID_1,1
3641507,COVID_1,1
2048013,COVID_1,1
1619575,COVID_1,1
1969913,COVID_1,1
1929478,COVID_1,1
2185356,COVID_1,1
1751294,COVID_1,1
497929,COVID_1,1
1883860,COVID_1,1
4381023,COVID_1,1
1809269,COVID_1,1
2472539,COVID_1,1
4330681,COVID_1,1
1195282,COVID_1,1
126177,COVID_1,1
3022516,COVID_1,1
1967738,COVID_1,1
778880,COVID_1,1
1507737,COVID_1,1
909592,COVID_1,1
459934,COVID_1,1
1911357,COVID_1,1
4381016,COVID_1,1
82464,COVID_1,1
890767,COVID_1,1
2045399,COVID_1,1
294217,COVID_1,1
2172545,COVID_1,1
28157,COVID_1,1
2319511,COVID_1,1
708154,COVID_1,1
3658538,COVID_1,1
1355308,COVID_1,1
1036167,COVID_1,1
3938504,COVID_1,1
3391518,COVID_1,1
1398980,COVID_1,1
771877,COVID_1,1
1413386,COVID_1,1
2135483,COVID_1,1
2180977,COVID_1,1
1721227,COVID_1,1
1450600,COVID_1,1
1853135,COVID_1,1
1902921,COVID_1,1
1967438,COVID_1,1
768739,COVID_1,1
3974531,COVID_1,1
2131663,COVID_1,1
1170640,COVID_1,1
934854,COVID_1,1
3593539,COVID_1,1
4384513,COVID_1,1
250588,COVID_1,1
1033527,COVID_1,1
1194893,COVID_1,1
2472510,COVID_1,1
1631157,COVID_1,1
2146718,COVID_1,1
1793964,COVID_1,1
143422,COVID_1,1
798987,COVID_1,1
1107193,COVID_1,1
1290647,COVID_1,1
2089379,COVID_1,1
1651597,COVID_1,1
3890049,COVID_1,1
149476,COVID_1,1
1582734,COVID_1,1
1779394,COVID_1,1
2964646,COVID_1,1
3107047,COVID_1,1
1869170,COVID_1,1
2984509,COVID_1,1
199257,COVID_1,1
1634124,COVID_1,1
2024945,COVID_1,1
2091793,COVID_1,1
921977,COVID_1,1
1577905,COVID_1,1
2120959,COVID_1,1
