partition_id|partition_dsc
1|ANALGESICS
2|APPLES
3|APPLIANCES
4|HUNTING & WILDLIFE MANAGEMENT
5|MM EARRINGS
6|MM NECKLACES
7|MM BRACELETS
8|FIREWOOD/FIRELOGS
9|LAMB
10|AVOCADOS
11|BABY WELLNESS
13|FORMULA FEEDING
14|BABY BATH TIME
15|HEADPHONES/EARBUDS
16|BABY NATURAL FEEDING
17|BACON
18|BAKERY BAGELS
19|BAKERY BREADS
20|MM SMALL GOODS
21|BAKERY COFFEE CAKE
22|BAKERY COOKIES
23|BAKERY CROISSANTS
24|BAKERY DONUTS
25|BAKERY MEXICAN PASTRIES
26|BAKERY MUFFINS
27|BAKERY PASTRIES
28|PIES
29|BAKERY ROLLS
30|BAKERY TORTILLAS
31|BAKEWARE
32|VEAL
33|BAKING INGREDIENTS
34|BAKING MIXES
35|ROADSHOW
36|BANANAS
37|MM HEADWEAR
38|MM SHOES
39|BATH TISSUE
40|INSTORE SEASONED & MARINATED PORK
43|READY TO EAT SEAFOOD
44|BERRIES
45|CANDY FRONT-END
46|BIRD SEED
47|BLEACHES
48|MM TREND APPAREL
49|BREADS
50|BREAKFAST PRODUCTS
51|SMOKED PORK
52|CANDY SPECIALTY
53|BULK FOODS
55|CAKES
56|CUPCAKES
57|MM RINGS
58|CANNED DRY SOAK BEANS
59|CANNED FRUITS
60|CANNED MEAT
61|CANDY BULK
63|CANNED PASTA
64|CANNED SEAFOOD
65|CANNED TOMATO PRODUCTS
66|CANNED VEGETABLES
67|MM WATCHES
68|MM HANDBAGS
69|MM SPECIALTY ACCESS
70|CAT FOOD
71|COMMODITY PORK
72|BOILHOUSE RESTAURANT
73|DELI FLAMING BIRD
74|DELI ROTISSERIE CASE
75|DELI MEAL SIMPLE HEAT
76|HEB PRIME ONE PORK
77|DELI PREP FOODS SELF SERV
78|COCKTAIL MIXES
79|COCOA
80|HOME HEALTH CARE RX
81|COFFEE
82|COFFEE/TEA ACCESSORIES
83|COFFEE CREAMERS
84|FROZEN VARIETY POULTRY
85|COLD/ALLERGY/SINUS
86|CONDIMENTS
87|MEAL COMBOS
88|COOKIES
89|COOKWARE
91|COSMETIC ACCESSORIES
92|CRACKERS
93|ASIAN GRILL
94|GROCERY PIZZA
95|DELI BEVERAGES
96|FRESH TURKEY WHOLE
97|FRESH HEB CHICKEN
98|FRESH NATURAL CHICKEN
99|FRESH ENHANCED CHICKEN
100|FRESH ORGANIC CHICKEN
101|ORGANIC CHEESE
102|LATINO CHEESE
103|CONNECTED HOME
105|PROCESSED CHEESE
106|IMITATION CHEESE
107|YUMAI GRILL
108|RECIPE CHEESE
109|FRESH KOSHER/HAL AL CHICKEN
110|FRESH NATURAL TURKEY
111|FRESH BAGGED CHICKEN
112|FRESH TURKEY PARTS
113|FRESH HCF CHICKEN
114|SUSHI INGREDIENTS-FRESH
115|CLEANING SPONGES
116|FROZEN SMOKED SEAFOOD
117|DEODORANT
118|DEODORIZERS
119|SUSHI/NOODLE RESTAURANT
120|DETERGENTS
121|DIAPERS
123|DIET FOODS
124|TRUE TEXAS BBQ
125|DISH DETERGENT
127|KODI OUTDOORS
128|DOG FOOD
129|HOT BREAKFAST
131|DRIED BEANS
132|DRIED BEANS (PRODUCE)
133|DRIED FRUITS
134|BARBACOA
135|PROMO PLANT DISPLAY
136|DRY PASTA
137|MODERN PLANT DISPLAY
138|DRY RICE
139|SNACK NUTS/TRAIL MIXES/SEEDS
140|EGGS
141|ELECTRICAL
143|EYE/EAR CARE
144|HAND AND BODY LOTIONS
145|FACIAL TISSUE
146|WAGYU BEEF
147|FRESH TURKEY GROUND
148|FROZEN TURKEY PARTS
149|CM GROUND BEEF
150|FIRST AID
151|FLOOR/FURNISH POLISH
153|FOOD CONTACT
157|HOT DOGS
158|SHELF STABLE FROZEN TREATS
159|FRESH CARROTS
160|FRESH CITRUS
162|FRESH DRY ONIONS
163|FRESH GARLIC
164|FRESH GRAPES
165|FRESH HERBS
166|FRESH JUICES
167|FRESH MELONS
168|FRESH MUSHROOMS
171|FRESH PEARS
173|FRESH POTATOES
174|FRESH PUMPKINS
176|FRESH SOFT FRUIT
177|DELI SVC CHEESE-FRESH SLICE
178|DELI SVC MEAT-FRESH SLICE
180|FRESH TOMATOES
181|FRESH TROPICAL FRUIT
183|FRESH VALUE ADDED FRUIT
184|FRESH VALUE ADDED VEGETABLES
185|FROZEN BREAKFAST PRODUCTS
186|AUXILIARY PLANT DISPLAY
187|FROZEN DESSERTS
188|HAND SOAP
189|BAKERY CONFECTIONS
190|FROZEN JUICES/DRINKS
191|FROZEN PIZZA
192|FROZEN POTATOES
193|FLOWERS-ARRANGEMENTS RTL READY
194|FLOWERS-BOUQUET RTL READY
195|FROZEN SNACKS
196|FLORAL CONTAINERS
197|CENTRAL MARKET FLORAL
198|FROZEN VEGETABLES
199|FRUIT & SPECIALTY SPREADS
200|GASOLINE
201|GELATINS/PUDDING
202|SPECIALTY DESIGN ITEMS
203|GRAVY/SAUCE MIX
206|MEAT ALTERNATIVES
209|HAIR ACCESSORIES
211|HAIR COLOR/PERMS
213|HEALTH FOODS
214|FROZEN CHICKEN
215|FROZEN TURKEY GROUND
216|FROZEN TURKEY WHOLE
217|HONEY
218|HOT CEREAL
220|HOT SAUCES
221|HOUSEHOLD CHEMICALS
223|HOUSEHOLD SUPPLIES
224|ICE
225|ICE CREAM TOPPING/CONES
227|INCONTINENT PRODUCTS
228|PEPPERS
229|WINE ACCESSORIES (TX)
230|ALTERNATIVE CARE
231|ISOTONICS
233|KITCHEN GADGETS
234|KOSHER FOODS
236|DIGESTIVE HEALTH
237|LEAFY VEGETABLES
238|DRY TABLE VEGETABLES
239|LETTUCE
240|PLANT BASED ALTERNATIVES
242|MEAL SIMPLE SEAFOOD
245|NATURAL CHEESE
247|HUNTING/FISHING APPAREL
248|CAMPING
249|LATINO FOODS
251|NATURAL FOODS
253|NUT SPREADS
254|GRAB AND GO
256|ORAL CARE
258|PACKAGED LUNCHMEATS
259|PANCAKE MIX
261|PAPER TOWELS
263|PERMANENT BOTANICALS
264|PASTA SAUCE
265|PASTRIES
266|PERSONAL CARE APPLIANCES
267|PET CARE
268|PET LITTER
271|PICKLES
272|SEASONAL THEME DECOR
273|CANDY LATINO
277|POPCORN
278|POWDERED DRINK MIX
280|PRE-WASH
281|PREPARED BOX DINNERS
282|PRODUCE MIXES AND TOPPINGS
283|PRODUCE NUTS
284|PRODUCE SALAD DRESSINGS/DIPS
286|PRODUCE SPICES
290|REFRIGERATED CHEESE
293|RICE/POPCORN CAKES
294|RTE CANDY
295|RTE CEREAL
297|SALAD TOPPINGS/CROUTONS
298|SALTY SNACKS
299|FEMININE CARE
304|APPAREL PRO FOOTBALL
308|FACE CARE
309|APPAREL PRO BASKETBALL
311|SOFTENERS
315|APPAREL COLLEGIATE
317|APPAREL HIGH SCHOOL
318|STARCH
319|APPAREL PRO BASEBALL
321|SUN CARE
322|SYRUP
323|TEA
324|APPAREL PRO SOCCER
325|TOASTER PASTRY
326|TOBACCO
327|TORTILLAS
337|APPAREL MENS
339|UNASSIGNED
340|WOMENS APPAREL
341|VALUE ADDED MILK PRODUCTS
342|VIDEO
343|VINEGAR/COOKING WINES
344|VITAMINS
345|WATER
346|WATER SOFTENERS SALTS
347|WHOLESOME SNACKS
351|WOMENS APPAREL ACCESSORIES
352|APPAREL VALUE BASICS & IN/OUT
359|BAKERY INGREDIENTS
360|BAKERY PARTY TRAYS
369|CANNED PEPPERS
372|HAM & TURKEY ITEMS
373|SEASONINGS & CASINGS
380|BRANDED PHARMACY
381|DIAGNOSTIC AIDS
382|GENERIC PHARMACY
399|FROZEN BREAD
400|FROZEN FRUIT
401|FROZEN HAND HELD
404|BUTTER/MARGARINE
405|CHILLED JUICE
406|COTTAGE CHEESE/SOUR CREAMS/DIPS
408|HOMOGENIZED MILK
410|REFRIGERATED DOUGH
411|CHOICE BEEF
412|BISON
414|GROUND BEEF
415|KOSHER & HALAL BEEF
416|NATURAL BEEF
417|PRIME BEEF
418|SELECT BEEF
419|VARIETY MEATS
420|VALUE ADDED MEATS
421|VALUE BEEF
422|TRAY PACK SFD
423|SAFETY SUPPLIES
424|FUEL SUPPLIES
425|BLOOMS DESIGN STUDIO
427|FRESH RTE CHICKEN
434|HEB NATURAL PORK
441|FRESH FROZEN SAUSAGE
447|FRESH MEXICAN FOODS
453|CM BEER AND WINE
455|CM BULK BAR
456|CM CAFE
457|CM CATERING
458|CM CHEF CASE
459|CM COFFEE BAR
460|CM COOKING SCHOOL
462|CM FS COOKED SEAFOOD
463|CM HOLIDAY
464|CM JUICE
465|CM PRE-PACK FOOD
466|CM PREP-LESS PRODUCE
467|CM PREPLESS
468|CM ROTI
469|CM SMOOTHIE BAR
470|CM STATIONS
472|GROCERY SALVAGE
474|REFRIGERATED SEAFOOD
475|SUPPLIES-LABELS
476|UNSALABLE GOODS
479|SUPPLIES-MISCELLANEOUS
495|CORN
497|SUPPLIES-WRAP PAPER
498|SUPPLIES-CONTAINERS
500|SUPPLIES-SERVICE
502|SUPPLIES-WRAP PLASTIC
503|SUPPLIES-OFFICE
506|UNIFORMS
510|ICE CREAM
511|NOVELTIES
516|COOKED MEAT
517|FROZEN COOKED MEATS
523|BATTERIES
525|CHARCOAL/FUEL/GRILLING ACC
530|COOLERS
534|EYEWEAR
535|FAMILY PLANNING/FEM HYGIENE
536|FANS AND HEATERS
539|FOOT CARE
540|GRILLS/OUTDOOR COOKERS
541|HOME HEALTH CARE
543|HG PATIO FURNITURE
544|LIGHTBULBS
546|NUTRITION
549|HG PLANTERS/POTS
552|HG SOIL/MULCH & ACCS
559|AUTOMOTIVE
561|HARDWARE
566|CHRISTMAS SEASONAL MDSE
567|EASTER SEASONAL MDSE
568|MULTICULTURAL HEALTH & BEAUTY
569|LATINO HEALTH & BEAUTY
570|FALL/WINTER SEASONAL MDSE
571|FATHER'S DAY SEASONAL MDSE
572|GRADUATION SEASONAL MDSE
573|HALLOWEEN SEASONAL MDSE
576|MAKE UP
577|MOTHER'S DAY SEASONAL MDSE
578|SPRING/SUMMER SEASONAL MDSE
579|FALL HARVEST SEASONAL MDSE
580|VALENTINE SEASONAL MDSE
582|KEY CUTTING SERVICE
583|PHOTO PROCESSING
584|SHAVING/GROOMING
585|ATHLETIC EQUIPMENT
587|CANNING SUPPLIES/ACCESSORIES
591|FISHING/HUNTING EQUIPMENT
597|HG WATERING EQUIPMENT
598|WINE/BAR ACCESSORIES
599|BABY GEAR/FURNITURE
605|WEATHER RELATED APPAREL/ACCESS
608|LICENSED NOVELTY
617|CRAFT SUPPLIES
620|OFFICE SUPPLIES
621|SCHOOL SUPPLIES
630|CLEANING SUPPLIES
633|DOMESTICS
635|HG TOOLS
650|LG BEDDING
653|HEALTHY LIVING BODY CARE
656|HL - NATURAL HOUSEHOLD
657|HL - VITAMINS & MINERALS
662|LG SEASONAL PLANTS
664|WRITING INSTRUMENTS
665|LG FOLIAGE
667|HG INDOOR PEST & PERSONAL REPE
668|SHOE POLISH/SEWING
669|LG SHRUBS
670|LG TREES
673|HEALTHY LIVING MEDIA
675|HL - SPORTS NUTRITION
676|CALENDARS
685|TOYS - ACTIVITY
686|TOYS - BOYS
687|TOYS - GAMES/PUZZLES
688|TOYS - GIRLS
689|TOYS - INFANT/PRESCHOOL
690|TOYS - OUTDOOR
691|TOYS - PLUSH
693|BAKING CHIPS/NUTS
694|FLOUR/MEAL/CORN HUSKS
695|PIE FILLINGS/CRUSTS/MARSHMALLOWS
696|FRESH FLOWERS - BALLOONS
699|PLANTS - HARDLINES
701|FLORAL SUPPLIES
702|FRESH FLOWERS - ARRANGEMENTS
703|FRESH FLOWERS - BOUQUETS
704|FRESH FLOWERS - BUNCHES
705|FRESH FLOWERS - GIFTABLES
706|FRESH FLOWERS - HARDLINES
707|FRESH FLOWERS - PRODUCTION
711|SILK FLOWERS AND PINATAS
712|CENTRAL MARKET LAWN & GARDEN
713|PLANTS - SEASONAL
715|HOLIDAY TRANSFERS
716|BLOOMS SEASONAL DECOR
717|CENTRAL MARKET GIFT BASKETS
718|SELF MANUFACTURED BEEF
722|SELF MAN FRESH COMMODITY PORK
723|SELF MANUFACTURED VALUE ADDED MEATS
725|GAMING
728|CONSIGNMENT/SERVICES
731|LOTTERY
732|BUSINESS CENTER SERVICES
734|WEIGHT MANAGEMENT
735|HEALTH FOODS-CANNED FRUITS
736|COMPUTER & ELECTRONIC ACC
737|COOKING OIL/SHORTENING/LARD
738|DISPOSABLE BAGS
739|DISPOSABLE TABLEWARE
740|SHELF STABLE MILK
742|NAPKINS/TABLECOVERS
743|OLIVE OIL
745|SHELF STABLE POTATOES/STUFFING
747|YOGURTS, SMOOTHIES & DESSERTS
748|AUDIO ELECTRONICS
751|MUSIC
752|PHONE ACCESSORIES
754|DAIRY CREAM & CREAMER
758|INTERNATIONAL FOODS - ASIAN
760|THIRD PARTY GIFT CARDS
761|PUBLIC AFFAIRS
762|FRESH SALAD
763|BEAUTY SETS
765|SOUPS - DRY
766|SOUPS - WET
767|ECO FRIENDLY PRODUCTS
768|CM REFRIGERATED SEAFOOD
769|AS SEEN ON TV
770|FRESH CATFISH
771|FRESH FISH OTHER
772|FRESH/LIVE SHELLFISH
773|FROZEN BAGGED FISH
775|FROZEN BULK FISH
776|FROZEN SEAFOOD DOOR
777|FROZEN VALUE ADDED SEAFOOD
779|SEAFOOD CONDIMENTS
780|CM FRESH SEAFOOD
781|FRESH SALMON
782|FRESH TILAPIA
783|FRESH VALUE ADDED SEAFOOD
786|FROZEN CATFISH
787|FROZEN CRAB
788|FROZEN SALMON
789|FROZEN SHELLFISH
790|FROZEN TILAPIA
791|SUSHI
792|SUSHI INGREDIENTS - FROZEN
793|FROZEN SHRIMP
794|NON-GRADED FRESH BEEF
796|GIFT AND STATIONERY
798|DELI DRY GOODS
800|DELI PREP FOODS FULL SERV
801|DELI PICKLES/OLIVES/ANTIPASTO
802|DELI PREPACKAGED MEATS
804|DELI SERVICE MEATS
805|SAUSAGE
806|FRESH FRZN VARIETY BEEF & MEATS
809|FROZEN COMMODITY PORK
810|FRESH SAUSAGE
811|MAGAZINES
812|SALAD DRESSINGS-POURABLE
813|SALAD DRESSINGS-SPOONABLE/VISCOUS
814|PERSONAL CLEANSING
815|FINANCIAL SERVICES-AP
817|LUGGAGE
819|BABY APPAREL & SOFTLINE ACC
822|FRAMES & ALBUMS
823|OTC HEALTH AIDS
825|SMOKING CESSATION
826|STORAGE ORGANIZATION
827|BROWNIES
828|CENTRAL MARKET BEEF
829|CENTRAL MARKET EXOTIC MEAT
830|CENTRAL MARKET POULTRY
831|CENTRAL MARKET VALUE ADDED
832|INSTORE VALUE ADDED
836|SPIRITS
837|HG BAGGED/PORTABLE CHAIRS
839|OLIVES & PEPPERS
840|PREPAID WIRELESS CARDS
841|ALL PURPOSE GIFT CARDS
842|HEB GIFT CARDS
843|LONG DISTANCE CALLING CARDS
844|RELOADABLE DEBIT CARDS
846|MEAT SNACKS
848|NON-CATALINA TICKET SALES
849|POSTAGE STAMPS
850|GOVERNMENT/MUNICIPAL-REVENUE
851|GOVERNMENT/MUNICIPAL-AP
852|FINANCIAL SERVICES-REVENUE
853|CM MOBILE TRUCK
854|CLEANING RENTALS
856|CATALINA TICKET SALES
857|CLOSET ORGANIZATION
858|CM BAKERY
860|MARKET GUACAMOLE
862|POTTY TIME
863|PARTY SNACKS
864|BABY NURSERY
867|DELI CARRY OUT CATERING
868|DELI PREPACKAGED MISC
869|DELI AMERICAN FULL SERVICE
870|DELI ASIAN FULL SERVICE
871|DELI MEXICAN FULL SERVICE
872|DELI GREEN SALADS
873|DELI HOLIDAY MEALS
874|DELI PIZZA
876|DELI MISC CONCEPTS
878|DELI PREPACKAGED DESSERTS
879|DELI PREPACKAGED
880|DELI PREPACKAGED PASTA/SAUCES
882|DELI PROTEIN SALADS
884|DELI FOODSERVICE-CUSTOM SNDWCH
885|DELI SOUPS
886|DELI TAMALES
887|DELI CHEESE - FRESH CUT
888|DELI CHEESE - ONE TOUCH
889|PROPANE EXCHANGE
890|CM PASSPORT-DRY GROCERY
891|CM PASSPORT-GM
892|CATALINA PROMO FAILSAFE
893|PUBLIC AFFAIRS - GROCERY
894|SCHOOL LOYALTY PROGRAM
895|MM SEASONAL JEWELRY
896|SUGAR CANE
897|FLAVORED DRINKS
899|STOMACH REMEDIES
900|DELI SERVICE CHEESE
901|DELI PREPACK DIP/SALSA/SPREADS
902|DELI SBT
903|BABY WIPES
905|MM SCARVES
906|MM EYEWEAR
907|MM GIFTS
909|DIPPED ITEMS
911|WINE ACCESSORIES
912|DELI-MADE TO ORDER
913|TRIAL & TRAVEL
914|FRESH FLOWERS - ROSES
915|FLOWERS - EVENTS
916|TV STREAMING AND ACCESSORIES
917|FRESH SHRIMP
918|GROUND BEEF PATTIES
919|GRASS FED BEEF
920|ORGANIC BEEF
922|CUSTOMER RECOVERY
923|MEAT MERCHANDISE-OVEN READY
924|HL PRE-PACK CANDY
927|RX SERVICES
928|ORGANIC PORK
929|OPTICAL SALES & REVENUE
930|DELI LOFT CAFES
931|RTD TEA
932|RTD COFFEE
933|ENERGY DRINKS
934|DELI LEGACY PROGRAMS
935|SPARKLING BEVERAGES
936|SOFLO PIZZA
1210|BABY/TODDLER FEEDING10
1211|BABY/TODDLER FEEDING11
1212|BABY/TODDLER FEEDING12
1540|FOOD STORAGE0
1541|FOOD STORAGE1
2080|GREETING CARDS0
2081|GREETING CARDS1
2100|HAIR CARE0
2101|HAIR CARE1
2102|HAIR CARE2
2320|J-HOOK0
2321|J-HOOK1
2500|BEAUTY NAIL0
2501|BEAUTY NAIL1
2620|PARTY GOODS0
2621|PARTY GOODS1
2980|SALTY SNACKS0
2981|SALTY SNACKS1
2982|SALTY SNACKS2
3050|SHELF STABLE JUICES0
3051|SHELF STABLE JUICES1
3100|SOFT DRINKS0
3101|SOFT DRINKS1
3130|SPICES/EXTRACTS/SALTS0
3131|SPICES/EXTRACTS/SALTS1
3200|SUBS/SPECIALTY SUGARS0
3201|SUBS/SPECIALTY SUGARS1
3480|WINE0
3481|WINE1
4020|FROZEN MEALS0
4021|FROZEN MEALS1
4110|BEER10
4111|BEER11
5410|CANDY BASIC10
5411|CANDY BASIC11
5570|HG OUTDOOR DECOR0
5571|HG OUTDOOR DECOR1
5760|MAKE UP0
5761|MAKE UP1
5762|MAKE UP2
5763|MAKE UP3
5764|MAKE UP4
5960|TABLETOP0
5961|TABLETOP1
5962|TABLETOP2
5963|TABLETOP3
6210|CANDY SEASONAL10
6211|CANDY SEASONAL11
6520|GIFT WRAP0
6521|GIFT WRAP1
7410|CAKE/DESSERT MIXES/FROSTING0
7411|CAKE/DESSERT MIXES/FROSTING1
7412|CAKE/DESSERT MIXES/FROSTING2
7590|INTERNATIONAL FOODS - NON ASIAN0
7591|INTERNATIONAL FOODS - NON ASIAN1
8080|BOOKS0
8081|BOOKS1
8082|BOOKS2
8200|CANDLES0
8201|CANDLES1
