priority,title,url
0, Click here to email PDS support, mailto:pds_support@heb.com
1, Click here to visit PDS Help Desk, https://hebecom.atlassian.net/servicedesk/customer/portal/34
2, Merchant HQ, https://pn.heb.com/merchanthq
3, Trial & Repeat Dashboard, https://insights.heb.com/#/workbooks/4/views
4, ADAPT Customer Insights Portal, https://insights.heb.com/#/workbooks/38/views
5, Match Panel Report - Category, https://heb.my.salesforce.com/lightning/cmp/c__heb_FilePreview?c__contentDocumentId=0694P00000BYr9RQAT&c__showPreview=true&0.Merchant%20HQ%2FOwn%20Brand%2Fid-07H4P000000QTsrUAG%2FFY21%20Promotion%20Expense%20Submission
6, Match Panel Report - Commodity, https://heb.my.salesforce.com/lightning/cmp/c__heb_FilePreview?c__contentDocumentId=0694P00000BYrAFQA1&c__showPreview=true&0.Merchant%20HQ%2FOwn%20Brand%2Fid-07H4P000000QTsrUAG%2FFY21%20Promotion%20Expense%20Submission
7, New Customer Report, https://heb.my.salesforce.com/lightning/cmp/c__heb_FilePreview?c__contentDocumentId=0694P00000BYrAVQA1&c__showPreview=true&0.Merchant%20HQ%2FOwn%20Brand%2Fid-07H4P000000QTsrUAG%2FFY21%20Promotion%20Expense%20Submission
8, BI Coupon Redemption Report, https://bi.heb.com/BI/asp/Main.aspx?evt=4001&src=Main.aspx.4001&visMode=0&reportViewMode=1&reportID=E72633B244E83F453C53B3987A796D74&Server=ARPAPW0021921&Project=Business%20Intelligence&Port=0&share=1
9, BI Coupon Dashboard, https://bi.heb.com/BI/asp/Main.aspx?evt=3140&src=Main.aspx.3140&documentID=B6C9BB9242E7D9E2D7D288A57D0741CC&Server=ARPAPW0021921&Project=Business%20Intelligence&Port=0&share=1
10, BI EOM Event Display Performance Report, https://bi.heb.com/BI/asp/Main.aspx?evt=4001&src=Main.aspx.4001&visMode=0&reportViewMode=1&reportID=504DEDEC4D74BFCEA9164392F4C8359B&Server=ARPAPW0021921&Project=Business%20Intelligence&Port=0&share=1
11, BI EOM Offers in Time Frame Report, https://bi.heb.com/BI/asp/Main.aspx?evt=4001&src=Main.aspx.4001&visMode=0&reportViewMode=1&reportID=CC0F981745511CB8AC7896A6FFA723DF&Server=ARPAPW0021921&Project=Business%20Intelligence&Port=0&share=1
12, BI EOM Sales by Day Report, https://bi.heb.com/BI/asp/Main.aspx?evt=4001&src=Main.aspx.4001&visMode=0&reportViewMode=1&reportID=FD45B48D45092AB409998BACE1A14B8E&Server=ARPAPW0021921&Project=Business%20Intelligence&Port=0&share=1
13, Coupon Management System (CMS), https://cms2.heb.com/CMS2/
14, Cost & Deals (DCM), https://dcm.heb.com/DCM_UI/
15, Event Order Management (EOM), https://srsng.heb.com/onlineOrdering/jsp/loginAction.srs
16, JDA Ad Planner, https://manup.heb.com/jda/shell/
17, Offer Management System (OMS), https://logix.heb.com/logix/login.aspx
18, Selling Event Scheduling System (SESS), https://sess.heb.com/
19, Strategy Management and Analytics Reporting Tool (SMART), https://smart2.heb.com/SMART2/

