{
  "cluster_source": {
    "type": "whitelist",
    "values": [
      "JOB",
      "UI"
    ]
  },
  "autotermination_minutes": {
    "type": "range",
    "minValue": 10,
    "maxValue": 45,
    "defaultValue": 20
  },
  "node_type_id": {
    "type": "fixed",
    "value": "i3.2xlarge"
  },
  "driver_node_type_id": {
    "type": "fixed",
    "value": "i3.8xlarge"
  },
  "autoscale.min_workers": {
    "type": "range",
    "minValue": 8,
    "defaultValue": 8
  },
  "autoscale.max_workers": {
    "type": "range",
    "maxValue": 16,
    "defaultValue": 16
  },
  "aws_attributes.instance_profile_arn": {
    "type": "fixed",
    "value": "arn:aws:iam::345257644559:instance-profile/heb-spme-far-promo-prd-data-access",
    "hidden": false
  },
  "custom_tags.ResourceOwner": {
    "type": "fixed",
    "value": "dchylinski"
  },
  "custom_tags.BusinessUnit": {
    "type": "fixed",
    "value": "ent_eng"
  },
  "custom_tags.CodeMaturity": {
    "type": "fixed",
    "value": "prd"
  },
  "custom_tags.CostCenter": {
    "type": "fixed",
    "value": "spme"
  },
  "custom_tags.CreatedBy": {
    "type": "fixed",
    "value": "manual"
  },
  "custom_tags.Function": {
    "type": "fixed",
    "value": "pythoncluster"
  },
  "custom_tags.ManagedBy": {
    "type": "fixed",
    "value": "far"
  },
  "custom_tags.ServiceTier": {
    "type": "fixed",
    "value": "2"
  },
  "custom_tags.Sprocket": {
    "type": "fixed",
    "value": "pfp"
  },
  "custom_tags.Customer": {
    "type": "fixed",
    "value": "far"
  },
  "custom_tags.ManagingTeamEmail": {
    "type": "fixed",
    "value": "ML.FAR.AWS.ALERTS@HEB.COM"
  },
  "cluster_log_conf.region": {
    "type": "fixed",
    "value": "us-east-1"
  },
  "cluster_log_conf.type": {
    "type": "fixed",
    "value": "S3"
  },
  "cluster_log_conf.path": {
    "type": "fixed",
    "value": "s3://heb-prd-cluster-logs/id=1007121290526109"
  }
}
