cat_id,dsc_cat
747,"YOGURTS, SMOOTHIES & DESSERTS"
272,"SEASONAL THEME DECOR"
54,"CANDY BASIC"
232,"J-HOOK"
154,"FOOD STORAGE"
11,"BABY WELLNESS"
308,"FACE CARE"
348,"WINE"
652,"GIFT WRAP"
250,"BEAUTY NAIL"
310,"SOFT DRINKS"
808,"BOOKS"
298,"SALTY SNACKS"
267,"PET CARE"
320,"SUGAR SUBSTITUTES"
596,"TABLETOP"
549,"HG PLANTERS/POTS"
621,"SCHOOL SUPPLIES"
256,"ORAL CARE"
344,"VITAMINS"
657,"HL - VITAMINS & MINERALS"
347,"WHOLESOME SNACKS"
41,"BEER"
128,"DOG FOOD"
819,"BABY APPAREL & SOFTLINE ACC"
233,"KITCHEN GADGETS"
92,"CRACKERS"
576,"MAKE UP"
58,"CANNED DRY SOAK BEANS"
741,"CAKE/DESSERT MIXES/FROSTING"
916,"INTERACTIVE ENTERTAINMENT"
759,"INTERNATIONAL FOODS - NON ASIAN"
402,"FROZEN MEALS"
313,"SPICES/EXTRACTS/SALTS"
405,"CHILLED JUICE"
237,"LEAFY VEGETABLES"
305,"SHELF STABLE JUICES"
763,"BEAUTY SETS"
210,"HAIR CARE"
510,"ICE CREAM"
62,"CANDY SEASONAL"
12,"BABY/TODDLER FEEDING"
557,"HG OUTDOOR DECOR"
91,"COSMETIC ACCESSORIES"
262,"PARTY GOODS"
340,"WOMENS APPAREL"
814,"PERSONAL CLEANSING"
820,"CANDLES"
886,"DELI TAMALES"
94,"GROCERY PIZZA"
193,"FLOWERS-ARRANGEMENTS RTL READY"
20,"MM SMALL GOODS"
171,"FRESH PEARS"
46,"BIRD SEED"
