{
        "userpath": "s3://heb-spme-far-promo-prd-serve/PHAS1/pfp/all_data/",
        "database": "",
        "zone": "",
        "clean": "false",
        "overwrite": "false",
        "steps": "",
        "stage":"EomExports",
        "global_static":"s3://heb-spme-far-promo-prd-serve/PHAS1/pfp/global_static/",
        "forecast_domain":"s3://heb-spme-far-promo-prd-serve/PHAS1/pfp/conf/forecast_domain.csv",
        "approvalsCurrentDate":"",
        "approvalsPrevDate":"",
        "slackUrl":"https://hooks.slack.com/services/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",
        "log4jPath":"/dbfs/PHAS1/pfp/log/batch/log4j-approvals.properties"
} 

