Code,Label,Description
DR,DRAFT,Vendor is creating the coupon but has not submitted it to HEB yet
PE,PENDING,Coupon has been submitted by the vendor and is pending BDM approval
PR,PROCESSING,Coupon Team is proofing and verifying the coupon
CO,COMPLETE,Coupon is approved by the Coupon Team
FN,FINAL,Coupon is staged to go live
PU,PUBLISHED,Coupon is live
EX,EXPIRED,Coupon was not approved by its start date
RE,REJECTED,Coupon sent back to vendor for re-work
CA,CANCELLED,Published coupon was cancelled
DE,DELETED,Coupon cancelled prior to reaching Published status