{
  "instance_pool_name": "AWS-PRD-EST-1A-FAR-PFP-PRD-POOL-001",
  "min_idle_instances": 5,
  "aws_attributes": {
    "availability": "ON_DEMAND",
    "zone_id": "us-east-1a",
    "spot_bid_price_percent": 100
  },
  "node_type_id": "r4.4xlarge",
  "custom_tags": {
    "ResourceOwner": "dchylinski",
    "BusinessUnit": "ent_eng",
    "CodeMaturity": "prd",
    "CreatedBy": "manual",
    "Function": "databrickspool",
    "ManagedBy": "FAR",
    "ServiceTier": "0",
    "Sprocket": "pfp",
    "Customer": "FAR",
    "ManagingTeamEmail": "ML.FAR.AWS.ALERTS@HEB.COM"
  },
  "idle_instance_autotermination_minutes": 20,
  "enable_elastic_disk": false,
  "disk_spec": {
    "disk_type": {
      "ebs_volume_type": "GENERAL_PURPOSE_SSD"
    },
    "disk_count": 2,
    "disk_size": 100
  },
  "instance_pool_id": "0222-145439-bore254-pool-mve0ac5s",
  "default_tags": {
    "Vendor": "Databricks",
    "DatabricksInstancePoolCreatorId": "1326095063861164",
    "DatabricksInstancePoolId": "0222-145439-bore254-pool-mve0ac5s",
    "DatabricksInstanceGroupId": "-4924862792963573749"
  },
  "state": "ACTIVE",
  "stats": {
    "used_count": 0,
    "idle_count": 5,
    "pending_used_count": 0,
    "pending_idle_count": 0
  },
  "status": {}
}

