RWRD_ID,COUP_COND_ID,ITM_LIM_AMT,DOL_LIM_AMT,UNT_TYP_CD,RWRD_VAL
77370,91520,1,0,,40
90363,106464,1,0,,25
90837,106996,1,0,,25
83831,98999,2,0,,0.5
81101,95797,4,0,,0.25
85043,100401,2,0,,0.5
82536,97486,4,0,,0.25
83501,98595,1,0,,1
87237,102910,2,0,,0.5
87231,102904,10,0,,0.3
87087,102725,1,0,,25
79393,93830,2,0,,0.5
85069,100430,1,0,,1
80482,95112,2,0,,0.5
81925,96766,2,0,,1.5
83115,98171,2,0,,1
84229,99466,2,0,,0.5
