{
    "settings": {
        "new_cluster": {
            "cluster_name": "",
            "spark_version": "9.1.x-scala2.12",
            "aws_attributes": {
                "ebs_volume_count": 0,
                "availability": "SPOT_WITH_FALLBACK",
                "first_on_demand": 1,
                "zone_id": "us-east-1d"
            },
            "node_type_id": "i3.xlarge",
            "spark_env_vars": {
                "PYSPARK_PYTHON": "/databricks/python3/bin/python3"
            },
            "autoscale": {
                "min_workers": 2,
                "max_workers": 10
            }
        },
        "notebook_task": {
            "notebook_path": "/PHAS1/pfp/notebook_setup",
            "base_parameters": {
                "ENV": "/PHAS1",
                "BUCKET": "s3://heb-spme-far-promo-prd-serve",
                "NOTEBOOK": "daily"
            }
        },
        "timeout_seconds": 0,
        "email_notifications": {},
        "name": "run_notebook_setup",
        "max_concurrent_runs": 1
    }
}
