ExceptionType,ExceptionReason,Parameter,Threshold_Value
Model Fit,Discount Range,Low,0
Model Fit,Extreme Forecast,Low,0
Model Fit,First Promotion,Low,0
Model Fit,New Attribute,Low,0
Model Fit,New Discount Type,Low,0
Model Fit,Discount Range,Medium,1
Model Fit,Extreme Forecast,Medium,1
Model Fit,First Promotion,Medium,1
Model Fit,New Attribute,Medium,1
Model Fit,New Discount Type,Medium,1
Model Fit,Discount Range,High,2
Model Fit,Extreme Forecast,High,2
Model Fit,First Promotion,High,2
Model Fit,New Attribute,High,2
Model Fit,New Discount Type,High,2
Forecast Change,Promo Change,Skus,2
Model Fit,Brand New Product,Threshold,10
Model Fit,New Product,Threshold,20
Forecast Change,Forecast Change,Percentage,25
Forecast Change,Deleted Promo,Stores,50
Forecast Change,Promo Change,Stores,50
Model Fit,Extreme Forecast,Threshold,50
Model Fit,Discount Range,Threshold,100
Model Fit,First Promotion,Threshold,100
Model Fit,New Attribute,Threshold,100
Model Fit,New Discount Type,Threshold,100
Forecast Change,Forecast Change,Dollars,0
Forecast Change,Forecast Change,Units,100
