{
    "settings": {
        "new_cluster": {
            "cluster_name": "",
            "spark_version": "9.1.x-scala2.12",
            "aws_attributes": {
                "ebs_volume_count": 0,
                "availability": "SPOT_WITH_FALLBACK",
                "instance_profile_arn": "arn:aws:iam::345257644559:instance-profile/heb-spme-far-promo-prd-data-access",
                "first_on_demand": 1,
                "zone_id": "us-east-1d"
            },
            "node_type_id": "i3.xlarge",
            "custom_tags": {
                "CodeMaturity": "PHAS1",
                "Sprocket": "pfp",
                "ManagingTeamEmail": "ML.FAR.AWS.ALERTS@HEB.COM",
                "CostCenter": "spme",
                "Customer": "far",
                "BusinessUnit": "ent_eng",
                "ManagedBy": "far",
                "ServiceTier": "2",
                "ResourceOwner": "dchylinski",
                "CreatedBy": "manual",
                "Function": "sparkcluster"
            },
            "spark_env_vars": {
                "PYSPARK_PYTHON": "/databricks/python3/bin/python3"
            },
            "autoscale": {
                "min_workers": 2,
                "max_workers": 8
            }
        },
        "notebook_task": {
            "notebook_path": "/PHAS1/pfp/run_forecast_domain"
        },
        "timeout_seconds": 0,
        "email_notifications": {},
        "name": "run_forecast_domain",
        "max_concurrent_runs": 1
    }
}
