{
    "settings": {
        "name": "run_weekly_medium",
        "new_cluster": {
            "cluster_name": "",
            "spark_version": "7.3.x-scala2.12",
            "spark_conf": {
                "spark.databricks.delta.preview.enabled": "true",
                "spark.executor.cores": "1",
                "spark.memory.offHeap.enabled": "false",
                "spark.executor.memory": "190GB"
            },
            "aws_attributes": {
                "zone_id": "us-east-1c",
                "first_on_demand": 1,
                "availability": "SPOT_WITH_FALLBACK",
                "instance_profile_arn": "arn:aws:iam::345257644559:instance-profile/heb-spme-far-promo-prd-data-access",
                "spot_bid_price_percent": 100,
                "ebs_volume_type": "GENERAL_PURPOSE_SSD",
                "ebs_volume_count": 1,
                "ebs_volume_size": 200
            },
            "node_type_id": "r5d.8xlarge",
            "driver_node_type_id": "r5.2xlarge",
            "custom_tags": {
                "Function": "pythoncluster",
                "CreatedBy": "Manual",
                "RunName": "run_weekly_medium",
                "ResourceOwner": "dchylinski",
                "ServiceTier": "2",
                "ManagedBy": "far",
                "Customer": "far",
                "ManagingTeamEmail": "ML.FAR.AWS.ALERTS@HEB.COM",
                "Sprocket": "pfp",
                "CodeMaturity": "PHAS1"
            },
            "enable_elastic_disk": false,
            "init_scripts": [
                {
                    "dbfs": {
                        "destination": "dbfs:/databricks/init/AWS_PFP_Auto_Cluster/PHAS1/pfp_r_lib.sh"
                    }
                }
            ],
            "autoscale": {
                "min_workers": 3,
                "max_workers": 20
            }
        },
        "email_notifications": {
            "no_alert_for_skipped_runs": false
        },
        "timeout_seconds": 0,
        "notebook_task": {
            "notebook_path": "/PHAS1/pfp/run_weekly_medium"
        },
        "max_concurrent_runs": 1,
        "format": "SINGLE_TASK"
    }
}
