{
    "name": "Product",
    "fields": [
        {
            "fieldName": "name",
            "fieldType": "String",
            "fieldValidateRules": [
                "required"
            ]
        },
        {
            "fieldName": "description",
            "fieldType": "String"
        },
        {
            "fieldName": "price",
            "fieldType": "BigDecimal",
            "fieldValidateRules": [
                "required",
                "min"
            ],
            "fieldValidateRulesMin": 0
        }
    ],
    "relationships": [
        {
            "relationshipType": "many-to-many",
            "otherEntityRelationshipName": "product",
            "relationshipName": "ingredients",
            "otherEntityName": "ingredients",
            "otherEntityField": "id",
            "ownerSide": true
        },
        {
            "relationshipType": "many-to-one",
            "relationshipName": "productCategory",
            "otherEntityName": "productCategory",
            "otherEntityField": "name",
            "otherEntityRelationshipName": "product"
        }
    ],
    "changelogDate": "20190210105813",
    "javadoc": "Product sold by the Online store",
    "entityTableName": "product",
    "dto": "no",
    "pagination": "pagination",
    "service": "serviceClass",
    "jpaMetamodelFiltering": false,
    "fluentMethods": true,
    "clientRootFolder": "",
    "applications": "*"
}