-------------------------------------------------------------------------------
Test set: fr.ensg.sinTh.fibonacci.core.TestFibonacciCore
-------------------------------------------------------------------------------
Tests run: 5, Failures: 0, Errors: 0, Skipped: 0, Time elapsed: 0.029 sec
