{
    "infoPanelContainer": "#container",
    "mediaList": ".media-body span",
    "searchBox": ".searchBox",
    "searchResult": ".media-list div.media-item",
    "firstSearchResult": ".media-list div:nth-child(1)",
    "assignButton": ".taskFooter button:nth-child(1)",
    "removeTaskLink": ".removeTask",
    "closeCurrentTab": ".page-element-header i",
    "confirmButton": ".comfirm-message .primary",
    "assigneeButton": ".media-body .select2",
    "assigneeSearchBox": ".list-group-item .select2-search input",
    "storyDesc": ".media-body textarea",
    "searchStoryLink": ".assignStory span a:nth-child(2)",
    "updateButton": ".taskFooter button:nth-child(1)",
    "copyFitList": ".page-element-item-validation .list-group div:nth-child(2) .page-element-detail",
    "copyFitLeft": "i.pull-left",
    "copyFitRight": "span.page-element-validation",
    "downloadPdfButton": "div.fa-title i.fa-download",
    "notificationCloseButton": "button.notification-close-button"

}

