{
  "status": {},
  "data": [
    {
      "id": 1,
      "name": "Bitcoin",
      "cmc_rank": 1,
      "quote": {
        "USD": {
          "volume_24h": 100000,
          "percent_change_24h": 5,
          "market_cap": 200000,
          "price": 10000.50
        }
      }
    },
    {
      "id": 2,
      "name": "Ethereum",
      "cmc_rank": 2,
      "quote": {
        "USD": {
          "volume_24h": 50000,
          "percent_change_24h": 1,
          "market_cap": 100000,
          "price": 10000.50
        }
      }
    },
    {
      "id": 3,
      "name": "Litecoin",
      "cmc_rank": 3,
      "quote": {
        "USD": {
          "volume_24h": 30000,
          "percent_change_24h": -2,
          "market_cap": 50000,
          "price": 10000.50
        }
      }
    }
  ]
}
