[
  {
    "id": "1",
    "title": "شیر کم چرب پگاه",
    "description": "توضیحات شیر کم چرب پگاه",
    "image": "Tba.png",
    "price":"2000",
    "parent":7,
    "bg":"#7a4796"
  },
  {
    "id": "2",
    "title": "شیر پر چرب پگاه",
    "description": "توضیحات شیر پر چرب پگاه",
    "image": "Tba.png",
    "price":"2000",
    "parent":7,
    "bg":"#7a4796"
  },
  {
    "id": "3",
    "title": "شیر کم چرب دامداران",
    "description": "توضیحات شیر کم چرب دامداران",
    "image": "330-ccB.png",
    "price":"2000",
    "parent":7,
    "bg":"#7a4796"
  },
  {
    "id": "4",
    "title": "پفک چی توز",
    "description": "توضیحات پفک چی توز",
    "image": "037.png",
    "price":"1000",
    "parent":7,
    "bg":"#00b520"
  },
  {
    "id": "5",
    "title": "ماست کم چرب پگاه",
    "description": "توضیحات ماست کم چرب پگاه",
    "image": "ممتاز.png",
    "price":"1500",
    "parent":7,
    "bg":"#7a4796"
  },
  {
    "id": "6",
    "title": "ماست پر چرب پگاه",
    "description": "توضیحات ماست پر چرب پگاه",
    "image": "Tba.png",
    "price":"1500",
    "parent":8,
    "bg":"#7a4796"
  },
  {
    "id": "7",
    "title": "ماست کم چرب دامداران",
    "description": "توضیحات ماست کم چرب پگاه",
    "image": "Tba.png",
    "price":"1500",
    "parent":8,
    "bg":"#7a4796"
  },
  {
    "id": "8",
    "title": "ماست پر چرب دامداران",
    "description": "توضیحات ماست پر چرب پگاه",
    "image": "Tba.png",
    "price":"1500",
    "parent":9,
    "bg":"#7a4796"
  },
  {
    "id": "9",
    "title": "تست",
    "description": "تست",
    "image": "Tba.png",
    "price":"10",
    "parent":3,
    "bg":"#e9ad00"
  }
]