C:\Users\Sina\IdeaProjects\AuctionProject\src\main\java\com\sina\auctionProject\model\Item.java
C:\Users\Sina\IdeaProjects\AuctionProject\src\main\java\com\sina\auctionProject\repository\UserRepository.java
C:\Users\Sina\IdeaProjects\AuctionProject\src\main\java\com\sina\auctionProject\controller\ItemController.java
C:\Users\Sina\IdeaProjects\AuctionProject\src\main\java\com\sina\auctionProject\SwaggerConfig.java
C:\Users\Sina\IdeaProjects\AuctionProject\src\main\java\com\sina\auctionProject\Application.java
C:\Users\Sina\IdeaProjects\AuctionProject\src\main\java\com\sina\auctionProject\repository\AuctionRepository.java
C:\Users\Sina\IdeaProjects\AuctionProject\src\main\java\com\sina\auctionProject\repository\User_AuctionRepository.java
C:\Users\Sina\IdeaProjects\AuctionProject\src\main\java\com\sina\auctionProject\model\Auction.java
C:\Users\Sina\IdeaProjects\AuctionProject\src\main\java\com\sina\auctionProject\controller\AuctionController.java
C:\Users\Sina\IdeaProjects\AuctionProject\src\main\java\com\sina\auctionProject\controller\UserController.java
C:\Users\Sina\IdeaProjects\AuctionProject\src\main\java\com\sina\auctionProject\model\User.java
C:\Users\Sina\IdeaProjects\AuctionProject\src\main\java\com\sina\auctionProject\model\User_Auction.java
C:\Users\Sina\IdeaProjects\AuctionProject\src\main\java\com\sina\auctionProject\repository\ItemRepository.java
