<svg id="Group_50587" data-name="Group 50587" xmlns="http://www.w3.org/2000/svg" xmlns:xlink="http://www.w3.org/1999/xlink" width="291.224" height="67.322" viewBox="0 0 291.224 67.322">
  <defs>
    <clipPath id="clip-path">
      <path id="path" d="M0-65.352H85.17V1.97H0Z" transform="translate(0 65.352)" fill="none"/>
    </clipPath>
  </defs>
  <g id="group" transform="translate(206.054)">
    <g id="group-2" data-name="group" clip-path="url(#clip-path)">
      <path id="path-2" data-name="path" d="M3.115-1.011h.9V.172h-.9Zm-1.424,0h.914V.172H1.692ZM5.311-5.774c-.032-.583-.376-.618-.657-.618h-.3c.081.339.206.8.97,3.789a11.222,11.222,0,0,1-2.789.332A2.195,2.195,0,0,1,.029-4.777v-1.56L1.063-7.418v2.537c0,1.106.435,1.618,1.515,1.618a10.16,10.16,0,0,0,1.6-.1c-.151-.539-.506-1.744-.757-2.755a1.376,1.376,0,0,1-.042-.391.744.744,0,0,1,.807-.831h.65c.532,0,.726.074.726.3,0,.035-.024.161-.032.2Z" transform="translate(0.001 67.098)" fill="#211e20"/>
      <g id="group-3" data-name="group" transform="translate(6.062 60.898)">
        <path id="path-3" data-name="path" d="M0,.149c.118,0,.6.035.71.035,1.059,0,1.515-.512,1.515-1.615V-4.788L3.247-4.95v2.643A2.572,2.572,0,0,0,4.471-2h.26l.091.992H4.515a3.855,3.855,0,0,1-1.268-.215,2.166,2.166,0,0,1-2.5,2.371H.45Z" transform="translate(0 4.95)" fill="#211e20"/>
      </g>
      <g id="group-4" data-name="group" transform="translate(10.645 59.625)">
        <path id="path-4" data-name="path" d="M.193.124c.88,0,1.269-.589,1.269-1.63,0-1.1-.452-1.6-1.229-1.6S-2.12-2.091-3.005.044A7.081,7.081,0,0,0-1.962.124Zm-6.613,0h1.151c.717,0,.962-.443.962-1.314V-3.136L-3.3-3.292v1.871C-2.014-3.608-.488-4.1.248-4.1c1.307,0,2.3.806,2.3,2.592A3.326,3.326,0,0,1,2.173.124H3.558l.108.989h-5.68A9.571,9.571,0,0,1-3.659.924c-.023,0-.029,0-.042-.014C-3.826.87-3.944.867-4.041.83h-.014c-.022,0-.032,0-.042.012a2.053,2.053,0,0,1-1.106.27H-6.311Z" transform="translate(6.42 4.098)" fill="#211e20"/>
      </g>
      <g id="group-5" data-name="group" transform="translate(20.524 57.506)">
        <path id="path-5" data-name="path" d="M.129.171c0-.864-.429-1.26-1.085-1.26a1.014,1.014,0,0,0-1.058.911c0,.078-.019.122-.019.169a.947.947,0,0,0-.013.18c0,.855.433,1.219,1.036,1.219h.054C-.169,1.39.129,1.039.129.171M2.21,1.654A4.108,4.108,0,0,1,.905,1.423a1.838,1.838,0,0,1-1.861.956,2.145,2.145,0,0,1-1.523-.615A3.211,3.211,0,0,1-2.8,1.357a2.273,2.273,0,0,1-1.366.3l-.1-.992c.789,0,1.152-.283,1.209-.912a1.95,1.95,0,0,1,2.1-1.81A1.98,1.98,0,0,1,1.165.138V.458a2.272,2.272,0,0,0,1.014.2h.145c.912,0,1.235-.443,1.235-1.314V-5.531l1.022-.148v5.2A1.88,1.88,0,0,1,2.442,1.654Z" transform="translate(4.266 5.679)" fill="#211e20"/>
      </g>
      <g id="group-6" data-name="group" transform="translate(30.667 57.506)">
        <path id="path-6" data-name="path" d="M0,.215V-6.97l1.014-.148V.215Z" transform="translate(0 7.118)" fill="#211e20"/>
      </g>
      <path id="path-7" data-name="path" d="M36.933-9.55h.9v1.2h-.9Zm.457,3.412a1.99,1.99,0,0,0-.477-.04h-.175c-.555,0-.992.284-.992,1.167,0,.843.388,1.073.925,1.073a3.643,3.643,0,0,0,.719-.089ZM35.51-9.55h.912v1.2H35.51Zm1.88,6.583a4.59,4.59,0,0,1-.719.069c-1.161,0-1.993-.572-1.993-2.113a1.944,1.944,0,0,1,2.06-2.206,5.193,5.193,0,0,1,1.664.275v3.755h1.205l.068.989H37.39Z" transform="translate(1.045 67.034)" fill="#211e20"/>
      <path id="path-8" data-name="path" d="M41.69-9.959h1.034v1.241H41.69Zm1.526,4.2c0-.811-.425-1.171-1.025-1.171s-1.014.361-1.014,1.171.409,1.2,1.014,1.2,1.025-.377,1.025-1.2M39.33-3.175h2.9c.578,0,.84-.169.948-.7a2.207,2.207,0,0,1-.768.238h-.237a1.888,1.888,0,0,1-2-2.118,1.883,1.883,0,0,1,2.016-2.094,1.87,1.87,0,0,1,1.8.99,2.444,2.444,0,0,1,.236,1.1v1.616c0,1.41-.625,1.956-1.934,1.956H39.439Z" transform="translate(1.185 67.021)" fill="#211e20"/>
      <g id="group-7" data-name="group" transform="translate(46.199 60.898)">
        <path id="path-9" data-name="path" d="M0,.149c.112,0,.589.035.708.035,1.053,0,1.513-.512,1.513-1.615V-4.788L3.245-4.95v2.643A2.548,2.548,0,0,0,4.458-2h.266l.089.992H4.507a3.81,3.81,0,0,1-1.262-.215,2.17,2.17,0,0,1-2.5,2.371h-.3Z" transform="translate(0 4.95)" fill="#211e20"/>
      </g>
      <g id="group-8" data-name="group" transform="translate(50.819 59.898)">
        <path id="path-10" data-name="path" d="M.093.112l1.181-2.5a2.48,2.48,0,0,0-1.181-.28,2.366,2.366,0,0,0-1.26.317ZM-3.074.247H-.885c-.538-.923-1.1-1.958-1.6-2.867A3.667,3.667,0,0,1,.093-3.7a2.959,2.959,0,0,1,2.39,1.129L1.072.247H3.1l.1.992H-2.97Z" transform="translate(3.074 3.702)" fill="#211e20"/>
      </g>
      <g id="group-9" data-name="group" transform="translate(56.887 57.506)">
        <path id="path-11" data-name="path" d="M.129.171c0-.864-.433-1.26-1.081-1.26A1.01,1.01,0,0,0-2.01-.178c0,.078-.025.122-.025.169a1.117,1.117,0,0,0-.011.18c0,.855.431,1.219,1.039,1.219h.055C-.169,1.39.129,1.039.129.171M2.213,1.654A4.157,4.157,0,0,1,.9,1.423a1.826,1.826,0,0,1-1.855.956,2.148,2.148,0,0,1-1.527-.615,2.365,2.365,0,0,1-.314-.407,2.3,2.3,0,0,1-1.37.3l-.1-.992c.789,0,1.15-.283,1.209-.912a1.951,1.951,0,0,1,2.1-1.81A1.98,1.98,0,0,1,1.165.138V.458a2.251,2.251,0,0,0,1.014.2H2.33c.908,0,1.229-.443,1.229-1.314V-5.531l1.018-.148v5.2A1.877,1.877,0,0,1,2.438,1.654Z" transform="translate(4.266 5.679)" fill="#211e20"/>
      </g>
      <g id="group-10" data-name="group" transform="translate(67.035 57.506)">
        <path id="path-12" data-name="path" d="M0,.215V-6.97l1.012-.148V.215Z" transform="translate(0 7.118)" fill="#211e20"/>
      </g>
      <g id="group-11" data-name="group" transform="translate(71.794 57.506)">
        <path id="path-13" data-name="path" d="M.063.084H.469a1.225,1.225,0,0,1-.131-.6.993.993,0,0,1,1-1.1,1.172,1.172,0,0,1,.954.5l-.354.4a.978.978,0,0,0-.6-.369c-.229,0-.433.182-.433.562,0,.4.141.6.433.6H2.374L2.091.64H-.187ZM.4,4.543a2.192,2.192,0,0,1-2.479-2.5V.139l1.034-.978V1.936c0,1.084.408,1.618,1.444,1.618H2.328c.717,0,.975-.443.975-1.318V-2.638l1.026-.148v5.2a2.731,2.731,0,0,1-.113.856,2.479,2.479,0,0,0,1.165.283h.258l.1.989H5.422A3.764,3.764,0,0,1,3.69,4.125a1.794,1.794,0,0,1-1.305.418Z" transform="translate(2.076 2.786)" fill="#211e20"/>
      </g>
      <path id="path-14" data-name="path" d="M78.316-9.592h1.03V-8.35h-1.03Zm2.1,7.4a3.52,3.52,0,0,1-1.73-.418,2.47,2.47,0,0,1-1.505.418l-.065-.989c.9,0,1.2-.443,1.2-1.314V-7.159l1.02-.158v2.992a4.182,4.182,0,0,1-.108.867,2.35,2.35,0,0,0,1.147.272h.26l.1.989Z" transform="translate(2.324 67.032)" fill="#211e20"/>
      <path id="path-15" data-name="path" d="M81.651-1.012h1.032V.223H81.651ZM80.436-3.252c.9,0,1.229-.443,1.229-1.314V-7.225l1.018-.158v2.992a1.882,1.882,0,0,1-2.149,2.128Z" transform="translate(2.424 67.099)" fill="#211e20"/>
      <g id="group-12" data-name="group" transform="translate(0.167 48.131)">
        <path id="path-16" data-name="path" d="M.1.026H-2.411v1.5H.025v.89H-2.411V4.511H.1V5.4H-3.361V-.862H.1Z" transform="translate(3.361 0.862)" fill="#211e20"/>
      </g>
      <g id="group-13" data-name="group" transform="translate(3.885 50.335)">
        <path id="path-17" data-name="path" d="M.092.061a1.344,1.344,0,0,0-.3-.919,1.036,1.036,0,0,0-.8-.355.986.986,0,0,0-.817.385A1.385,1.385,0,0,0-2.1.066a1.349,1.349,0,0,0,.27.884.975.975,0,0,0,.817.378A1,1,0,0,0-.187.948,1.35,1.35,0,0,0,.092.061M.969,1.938a4.431,4.431,0,0,1-.016.489C.94,2.572.921,2.694.9,2.8a1.621,1.621,0,0,1-.386.768,1.841,1.841,0,0,1-1.471.611,1.947,1.947,0,0,1-1.3-.421,1.77,1.77,0,0,1-.61-1.215h.919a.991.991,0,0,0,.173.446.976.976,0,0,0,.827.37c.669,0,1-.406,1-1.223V1.588A1.693,1.693,0,0,1-1.2,2.141,1.686,1.686,0,0,1-2.518,1.56,2.161,2.161,0,0,1-3.039.077a2.257,2.257,0,0,1,.487-1.466A1.673,1.673,0,0,1-1.186-2.03a1.593,1.593,0,0,1,1.241.552v-.446H.969Z" transform="translate(3.039 2.03)" fill="#211e20"/>
      </g>
      <g id="group-14" data-name="group" transform="translate(7.893 50.441)">
        <path id="path-18" data-name="path" d="M.052.094-1.721-3.125H-.668L.543-.85,1.671-3.125H2.708l-3.15,6.1H-1.485Z" transform="translate(1.721 3.125)" fill="#211e20"/>
      </g>
      <g id="group-15" data-name="group" transform="translate(12.32 50.336)">
        <path id="path-19" data-name="path" d="M.09.062a1.38,1.38,0,0,0-.31-.93A.992.992,0,0,0-1-1.23a1.04,1.04,0,0,0-.817.354,1.313,1.313,0,0,0-.313.919A1.336,1.336,0,0,0-1.82.959a1.032,1.032,0,0,0,.814.351A.974.974,0,0,0-.23.952,1.259,1.259,0,0,0,.09.062m-2.17,4.1h-.91v-6.1h.91v.432A1.691,1.691,0,0,1-.853-2.047a1.713,1.713,0,0,1,1.344.6,2.169,2.169,0,0,1,.531,1.5A2.152,2.152,0,0,1,.491,1.541a1.717,1.717,0,0,1-1.33.587A1.7,1.7,0,0,1-2.08,1.571Z" transform="translate(2.99 2.047)" fill="#211e20"/>
      </g>
      <g id="group-16" data-name="group" transform="translate(16.389 48.996)">
        <path id="path-20" data-name="path" d="M.038.067v3.1H-.876V.067h-.386V-.785h.386V-2.229H.038V-.785H.752V.067Z" transform="translate(1.262 2.229)" fill="#211e20"/>
      </g>
      <path id="path-21" data-name="path" d="M18.779-12.37h-.912v-3.952h.912Zm-1.058-5.595a.57.57,0,0,1,.177-.41.562.562,0,0,1,.422-.176.568.568,0,0,1,.42.176.566.566,0,0,1,.173.413.587.587,0,0,1-.173.424.567.567,0,0,1-.42.173.575.575,0,0,1-.422-.173.588.588,0,0,1-.177-.428" transform="translate(0.534 66.762)" fill="#211e20"/>
      <g id="group-17" data-name="group" transform="translate(19.657 50.335)">
        <path id="path-22" data-name="path" d="M.027.061A1.376,1.376,0,0,0,.335.982a1,1,0,0,0,.785.365A1.036,1.036,0,0,0,1.94,1a1.337,1.337,0,0,0,.31-.92,1.328,1.328,0,0,0-.31-.916A1.017,1.017,0,0,0,1.134-1.2a1.034,1.034,0,0,0-.794.363A1.34,1.34,0,0,0,.027.061M2.2-1.906h.912V2.046H2.2V1.634a1.761,1.761,0,0,1-1.212.525,1.75,1.75,0,0,1-1.355-.59A2.183,2.183,0,0,1-.9.061,2.128,2.128,0,0,1-.369-1.422a1.711,1.711,0,0,1,1.33-.59A1.693,1.693,0,0,1,2.2-1.449Z" transform="translate(0.902 2.012)" fill="#211e20"/>
      </g>
      <g id="group-18" data-name="group" transform="translate(24.2 50.335)">
        <path id="path-23" data-name="path" d="M0,0H.92V.368A1.5,1.5,0,0,1,2-.1,1.353,1.353,0,0,1,3.074.332a1.783,1.783,0,0,1,.337,1.2V3.955H2.493v-2.2A1.433,1.433,0,0,0,2.328.945.656.656,0,0,0,1.752.714.717.717,0,0,0,1.1,1.02,2.069,2.069,0,0,0,.92,2.05v1.9H0Z" transform="translate(0 0.103)" fill="#211e20"/>
      </g>
      <g id="group-19" data-name="group" transform="translate(30.254 48.132)">
        <path id="path-24" data-name="path" d="M.028.073l2.434-2.5H3.728L.9.406,3.741,3.837H2.476L.219,1.051l-.192.192V3.837H-.918V-2.424H.028Z" transform="translate(0.918 2.424)" fill="#211e20"/>
      </g>
      <g id="group-20" data-name="group" transform="translate(34.958 50.335)">
        <path id="path-25" data-name="path" d="M0,0H.922V.368A1.487,1.487,0,0,1,2-.1,1.349,1.349,0,0,1,3.072.332a1.75,1.75,0,0,1,.339,1.2V3.955H2.489v-2.2A1.473,1.473,0,0,0,2.326.945.654.654,0,0,0,1.752.714a.7.7,0,0,0-.646.306A2.069,2.069,0,0,0,.922,2.05v1.9H0Z" transform="translate(0 0.103)" fill="#211e20"/>
      </g>
      <g id="group-21" data-name="group" transform="translate(38.711 50.335)">
        <path id="path-26" data-name="path" d="M.027.061A1.347,1.347,0,0,0,.343,1a1.112,1.112,0,0,0,.857.347A1.112,1.112,0,0,0,2.056,1,1.31,1.31,0,0,0,2.375.079a1.3,1.3,0,0,0-.319-.921A1.117,1.117,0,0,0,1.2-1.2a1.1,1.1,0,0,0-.848.353,1.265,1.265,0,0,0-.326.9M-.9.042A1.946,1.946,0,0,1-.291-1.413a2.039,2.039,0,0,1,1.492-.6,2.055,2.055,0,0,1,1.5.6A2.009,2.009,0,0,1,3.309.076,1.994,1.994,0,0,1,2.7,1.566a2.088,2.088,0,0,1-1.511.593,2.014,2.014,0,0,1-1.495-.6A2.067,2.067,0,0,1-.9.042" transform="translate(0.902 2.012)" fill="#211e20"/>
      </g>
      <g id="group-22" data-name="group" transform="translate(42.574 50.078)">
        <path id="path-27" data-name="path" d="M.03.011,1.066,2.27,2.185-.352,3.308,2.27,4.332.011H5.354L3.277,4.26,2.185,1.718,1.07,4.26-1,.011Z" transform="translate(0.996 0.352)" fill="#211e20"/>
      </g>
      <path id="path-28" data-name="path" d="M48.466-12.351h-.912V-19.2h.912Z" transform="translate(1.433 66.743)" fill="#211e20"/>
      <g id="group-23" data-name="group" transform="translate(50.247 50.336)">
        <path id="path-29" data-name="path" d="M.083.045A.884.884,0,0,0-.836-.69a.987.987,0,0,0-.315.055,1,1,0,0,0-.266.142.943.943,0,0,0-.2.232,1.07,1.07,0,0,0-.133.307Zm.933.747H-1.812a1.179,1.179,0,0,0,.316.771.963.963,0,0,0,.718.287A.935.935,0,0,0-.218,1.69a2.223,2.223,0,0,0,.5-.6l.777.426a2.925,2.925,0,0,1-.38.521,1.937,1.937,0,0,1-.424.355,1.836,1.836,0,0,1-.49.21,2.542,2.542,0,0,1-.572.06A1.843,1.843,0,0,1-2.226,2.1,2.111,2.111,0,0,1-2.768.581,2.2,2.2,0,0,1-2.251-.937a1.79,1.79,0,0,1,1.393-.57,1.789,1.789,0,0,1,1.38.552,2.194,2.194,0,0,1,.5,1.531Z" transform="translate(2.768 1.507)" fill="#211e20"/>
      </g>
      <g id="group-24" data-name="group" transform="translate(54.223 47.541)">
        <path id="path-30" data-name="path" d="M.027.142a1.349,1.349,0,0,0,.306.921.991.991,0,0,0,.787.365,1.048,1.048,0,0,0,.82-.347,1.37,1.37,0,0,0,.314-.92A1.361,1.361,0,0,0,1.94-.755a1.037,1.037,0,0,0-.815-.358,1.01,1.01,0,0,0-.784.363A1.331,1.331,0,0,0,.027.142M2.193-4.724h.915V2.127H2.193V1.715a1.72,1.72,0,0,1-1.218.525A1.734,1.734,0,0,1-.371,1.65,2.183,2.183,0,0,1-.9.142,2.126,2.126,0,0,1-.371-1.337,1.675,1.675,0,0,1,.95-1.93a1.682,1.682,0,0,1,1.242.563Z" transform="translate(0.904 4.724)" fill="#211e20"/>
      </g>
      <g id="group-25" data-name="group" transform="translate(58.579 50.335)">
        <path id="path-31" data-name="path" d="M.092.061A1.346,1.346,0,0,0-.216-.858a1.029,1.029,0,0,0-.8-.355.992.992,0,0,0-.819.385,1.41,1.41,0,0,0-.272.894A1.374,1.374,0,0,0-1.836.95a.99.99,0,0,0,.819.378A1.012,1.012,0,0,0-.187.948,1.345,1.345,0,0,0,.092.061m.88,1.877c0,.184-.012.349-.021.489A2.521,2.521,0,0,1,.9,2.8a1.559,1.559,0,0,1-.38.768,1.846,1.846,0,0,1-1.473.611,1.936,1.936,0,0,1-1.3-.421,1.746,1.746,0,0,1-.61-1.215h.916a.957.957,0,0,0,.171.446.979.979,0,0,0,.828.37c.669,0,1.006-.406,1.006-1.223V1.588A1.7,1.7,0,0,1-1.2,2.141,1.687,1.687,0,0,1-2.522,1.56,2.181,2.181,0,0,1-3.043.077a2.311,2.311,0,0,1,.481-1.466A1.7,1.7,0,0,1-1.186-2.03a1.6,1.6,0,0,1,1.243.552v-.446H.971Z" transform="translate(3.043 2.03)" fill="#211e20"/>
      </g>
      <g id="group-26" data-name="group" transform="translate(62.935 50.336)">
        <path id="path-32" data-name="path" d="M.083.045A.877.877,0,0,0-.84-.69a.944.944,0,0,0-.308.055,1,1,0,0,0-.266.142,1.326,1.326,0,0,0-.211.232,1.119,1.119,0,0,0-.127.307Zm.939.747H-1.812a1.212,1.212,0,0,0,.318.771.966.966,0,0,0,.716.287A.968.968,0,0,0-.212,1.69a2.321,2.321,0,0,0,.5-.6l.773.426a3.136,3.136,0,0,1-.376.521,1.941,1.941,0,0,1-.431.355,1.761,1.761,0,0,1-.489.21,2.513,2.513,0,0,1-.575.06A1.848,1.848,0,0,1-2.226,2.1,2.125,2.125,0,0,1-2.762.581,2.191,2.191,0,0,1-2.245-.937a1.78,1.78,0,0,1,1.391-.57A1.777,1.777,0,0,1,.522-.955a2.166,2.166,0,0,1,.5,1.531Z" transform="translate(2.762 1.507)" fill="#211e20"/>
      </g>
      <g id="group-27" data-name="group" transform="translate(69.21 48.127)">
        <path id="path-33" data-name="path" d="M.028.157H.615a1.451,1.451,0,0,0,.939-.25A.868.868,0,0,0,1.87-.784a.886.886,0,0,0-.3-.68A1.6,1.6,0,0,0,.509-1.737H.028Zm0-2.681h.3A1.08,1.08,0,0,0,1.1-2.759a.906.906,0,0,0,.249-.688.879.879,0,0,0-.253-.672A1.036,1.036,0,0,0,.365-4.35H.028ZM-.914,1.045V-5.22H.025a4.231,4.231,0,0,1,1,.1,1.512,1.512,0,0,1,.638.326,1.783,1.783,0,0,1,.418.6,1.787,1.787,0,0,1,.157.733,1.491,1.491,0,0,1-.513,1.138,1.541,1.541,0,0,1,.787.6A1.727,1.727,0,0,1,2.8-.745,1.653,1.653,0,0,1,2.289.493a1.746,1.746,0,0,1-.7.439,4.175,4.175,0,0,1-1.066.113Z" transform="translate(0.914 5.22)" fill="#211e20"/>
      </g>
      <g id="group-28" data-name="group" transform="translate(73.138 50.335)">
        <path id="path-34" data-name="path" d="M.027.061a1.367,1.367,0,0,0,.3.921.986.986,0,0,0,.783.365A1.059,1.059,0,0,0,1.938,1a1.365,1.365,0,0,0,.306-.92,1.356,1.356,0,0,0-.306-.916A1.045,1.045,0,0,0,1.126-1.2a1.029,1.029,0,0,0-.79.363A1.311,1.311,0,0,0,.027.061M2.191-1.906H3.11V2.046H2.191V1.634a1.77,1.77,0,0,1-1.216.525,1.75,1.75,0,0,1-1.353-.59A2.192,2.192,0,0,1-.91.061,2.138,2.138,0,0,1-.377-1.422a1.712,1.712,0,0,1,1.327-.59,1.688,1.688,0,0,1,1.241.563Z" transform="translate(0.91 2.012)" fill="#211e20"/>
      </g>
      <g id="group-29" data-name="group" transform="translate(77.681 50.335)">
        <path id="path-35" data-name="path" d="M0,0H.92V.368A1.493,1.493,0,0,1,2-.1,1.367,1.367,0,0,1,3.076.332a1.774,1.774,0,0,1,.331,1.2V3.955H2.491v-2.2A1.5,1.5,0,0,0,2.332.945.667.667,0,0,0,1.754.714.711.711,0,0,0,1.1,1.02,2.05,2.05,0,0,0,.92,2.05v1.9H0Z" transform="translate(0 0.103)" fill="#211e20"/>
      </g>
      <g id="group-30" data-name="group" transform="translate(81.618 47.538)">
        <path id="path-36" data-name="path" d="M.027,0V4.185L1.312,2.9H2.539L.821,4.562,2.667,6.855H1.477L.17,5.191l-.143.144V6.855H-.885V0Z" transform="translate(0.885)" fill="#211e20"/>
      </g>
      <g id="group-31" data-name="group" transform="translate(0 29.269)">
        <path id="path-37" data-name="path" d="M2.487.2c0,3.688-19.026,6.675-42.5,6.675S-82.51,3.883-82.51.2s19.028-6.676,42.5-6.676S2.487-3.491,2.487.2" transform="translate(82.51 6.481)" fill="#d2d2d2"/>
      </g>
      <g id="group-32" data-name="group" transform="translate(14.366 33.24)">
        <path id="path-38" data-name="path" d="M1.629,0c-.021-.106-.213-.131-.5-.131C-4.639-.142-48.118-.1-48.118-.1l-5.889,4.736h.392l-.392.3,2.554-.008L-54.039,6.09-3.4,6.068c.764-.909,1.553-1.7,2.314-2.614C-.529,2.776.035,2.092.592,1.407c.213-.264.5-.611.713-.883.159-.209.342-.41.323-.52" transform="translate(54.039 0.13)" fill="#e4ae1f"/>
      </g>
      <g id="group-33" data-name="group" transform="translate(64.844 26.454)">
        <path id="path-39" data-name="path" d="M0,.094l.147,8.26L3.67,4.212V-3.11Z" transform="translate(0 3.11)" fill="#ecebec"/>
      </g>
      <g id="group-34" data-name="group" transform="translate(64.154 30.625)">
        <path id="path-40" data-name="path" d="M0,.143,4.317-4.571l.012-.187L.019-.107" transform="translate(0 4.758)" fill="#c6c4c4"/>
      </g>
      <g id="group-35" data-name="group" transform="translate(64.116 29.51)">
        <path id="path-41" data-name="path" d="M0,.141,4.395-4.484l.013-.189L.024-.113" transform="translate(0 4.673)" fill="#c6c4c4"/>
      </g>
      <g id="group-36" data-name="group" transform="translate(64.017 28.324)">
        <path id="path-42" data-name="path" d="M0,.139,4.441-4.425l.018-.19L.022-.105" transform="translate(0 4.615)" fill="#c6c4c4"/>
      </g>
      <g id="group-37" data-name="group" transform="translate(64.184 31.756)">
        <path id="path-43" data-name="path" d="M0,.143,4.312-4.57l.013-.186L.012-.1" transform="translate(0 4.756)" fill="#c6c4c4"/>
      </g>
      <g id="group-38" data-name="group" transform="translate(64.184 32.723)">
        <path id="path-44" data-name="path" d="M0,.143,4.312-4.568l.013-.184L.012-.1" transform="translate(0 4.752)" fill="#c6c4c4"/>
      </g>
      <g id="group-39" data-name="group" transform="translate(11.571 30.069)">
        <path id="path-45" data-name="path" d="M.234.006l-4.67-.2v.029c-.027-.008.764-.081-.3-.008-1.258.18-3.082,2.25-3.02,4.5A5.358,5.358,0,0,0-4.963,9.191h2.688L-1.712,9c.274,0,2.087-.3,2.1-.5C1.2,7.8.346,6.115.346,4.139S1.042.708.234.006" transform="translate(7.757 0.201)" fill="#e4ae1f"/>
      </g>
      <path id="path-46" data-name="path" d="M64.541-28.312H14.955v-7.93H64.541Z" transform="translate(0.451 66.229)" fill="#ecebec"/>
      <path id="path-47" data-name="path" d="M15.029-34.209H64.544v-.216H15.029Z" transform="translate(0.453 66.284)" fill="#c6c4c4"/>
      <path id="path-48" data-name="path" d="M15.02-32.933H64.557v-.217H15.02Z" transform="translate(0.453 66.322)" fill="#c6c4c4"/>
      <path id="path-49" data-name="path" d="M15.02-31.755H64.545v-.214H15.02Z" transform="translate(0.453 66.358)" fill="#c6c4c4"/>
      <path id="path-50" data-name="path" d="M15.02-30.611H64.545v-.233H15.02Z" transform="translate(0.453 66.392)" fill="#c6c4c4"/>
      <path id="path-51" data-name="path" d="M15.02-29.684H64.545V-29.9H15.02Z" transform="translate(0.453 66.42)" fill="#c6c4c4"/>
      <g id="group-40" data-name="group" transform="translate(13.725 25.351)">
        <path id="path-52" data-name="path" d="M1.605,0-46.9.058s-6.362,5.217-6.364,5.22c.437-.375,3.157-.272,3.679-.272H-2.946a3.368,3.368,0,0,0,.627-.048l.081.218.22.078L2.114.38C2.483-.081,1.605,0,1.605,0" transform="translate(53.266 0.005)" fill="#ce9529"/>
      </g>
      <g id="group-41" data-name="group" transform="translate(13.614 29.94)">
        <path id="path-53" data-name="path" d="M1.518,0H-49.15a4.472,4.472,0,0,0-.818.341c0,.164-1.222.912.629.278H.975Z" transform="translate(50.364)" fill="#e4ae1f"/>
      </g>
      <g id="group-42" data-name="group" transform="translate(59.917 26.769)">
        <path id="path-54" data-name="path" d="M0,.019A.427.427,0,0,0,.3-.238,1.374,1.374,0,0,1,.532-.629L0-.238Z" transform="translate(0 0.629)" fill="#ecebec"/>
      </g>
      <g id="group-43" data-name="group" transform="translate(21.581 24.397)">
        <path id="path-55" data-name="path" d="M1.258,0C1.242-.071,1.089-.088.874-.088-3.581-.1-37.173-.071-37.173-.071l-4.545,3.32h.3l-.3.211s.734,0,1.974,0l-2,.823,39.109-.02c.6-.639,1.2-1.19,1.79-1.833.435-.481.867-.959,1.3-1.442C.618.8.846.556,1.007.368,1.131.221,1.27.08,1.258,0" transform="translate(41.742 0.092)" fill="#e42831"/>
      </g>
      <g id="group-44" data-name="group" transform="translate(60.571 19.635)">
        <path id="path-56" data-name="path" d="M0,.066l.118,5.8,2.714-2.9V-2.183Z" transform="translate(0 2.183)" fill="#ecebec"/>
      </g>
      <g id="group-45" data-name="group" transform="translate(60.044 22.561)">
        <path id="path-57" data-name="path" d="M0,.1,3.327-3.207l.008-.132L.008-.071" transform="translate(0 3.339)" fill="#c6c4c4"/>
      </g>
      <g id="group-46" data-name="group" transform="translate(60.01 21.775)">
        <path id="path-58" data-name="path" d="M0,.1,3.392-3.143l.01-.138L.016-.074" transform="translate(0 3.281)" fill="#c6c4c4"/>
      </g>
      <g id="group-47" data-name="group" transform="translate(59.931 20.947)">
        <path id="path-59" data-name="path" d="M0,.1,3.428-3.108l.012-.133L.019-.081" transform="translate(0 3.241)" fill="#c6c4c4"/>
      </g>
      <g id="group-48" data-name="group" transform="translate(60.058 23.354)">
        <path id="path-60" data-name="path" d="M0,.1,3.331-3.21l.012-.131L.019-.075" transform="translate(0 3.341)" fill="#c6c4c4"/>
      </g>
      <g id="group-49" data-name="group" transform="translate(60.058 24.035)">
        <path id="path-61" data-name="path" d="M0,.1,3.331-3.2l.012-.131L.019-.073" transform="translate(0 3.334)" fill="#c6c4c4"/>
      </g>
      <g id="group-50" data-name="group" transform="translate(20.42 22.169)">
        <path id="path-62" data-name="path" d="M.151,0-3.456-.137v.02c-.016,0,.589-.058-.234,0A3.79,3.79,0,0,0-5.021,3.029a5.914,5.914,0,0,0,1.16,3.427H-1.79l.441-.143A5.228,5.228,0,0,0,.27,5.966C.9,5.475.242,4.293.242,2.9S.775.5.151,0" transform="translate(5.021 0.144)" fill="#e42831"/>
      </g>
      <path id="path-63" data-name="path" d="M60.026-38.318h-38v-5.569h38Z" transform="translate(0.664 65.999)" fill="#ecebec"/>
      <path id="path-64" data-name="path" d="M22.2-42.458H60.027v-.153H22.2Z" transform="translate(0.669 66.037)" fill="#c6c4c4"/>
      <path id="path-65" data-name="path" d="M22.191-41.557H60.036v-.156H22.191Z" transform="translate(0.669 66.064)" fill="#c6c4c4"/>
      <path id="path-66" data-name="path" d="M22.191-40.738H60.027v-.146H22.191Z" transform="translate(0.669 66.089)" fill="#c6c4c4"/>
      <path id="path-67" data-name="path" d="M22.191-39.935H60.027v-.159H22.191Z" transform="translate(0.669 66.113)" fill="#c6c4c4"/>
      <path id="path-68" data-name="path" d="M22.191-39.284H60.027v-.151H22.191Z" transform="translate(0.669 66.133)" fill="#c6c4c4"/>
      <g id="group-51" data-name="group" transform="translate(21.561 18.828)">
        <path id="path-69" data-name="path" d="M1.225,0-36.246.041s-4.416,3.468-4.418,3.475c.338-.269,1.948,0,2.35,0H-2.289a4.248,4.248,0,0,0,.483-.034l.066.149.169.06c.483-.476,2.314-2.278,2.8-2.756C1.386.784,2.406,0,1.225,0" transform="translate(40.664)" fill="#a8272f"/>
      </g>
      <g id="group-52" data-name="group" transform="translate(21.619 22.083)">
        <path id="path-70" data-name="path" d="M1.154,0-37.907.019c-.121,0-.392.23-.392.23,0,.121.249.187.367.187H.74Z" transform="translate(38.299)" fill="#e42831"/>
      </g>
      <g id="group-53" data-name="group" transform="translate(25.914 17.309)">
        <path id="path-71" data-name="path" d="M1,0C.987-.056.866-.067.693-.067c-3.531-.011-30.155.011-30.155.011l-3.612,2.58.245-.005-.245.17s.581,0,1.569-.007l-1.587.634L-2.085,3.31c.469-.5.952-.925,1.421-1.426.34-.37.686-.74,1.028-1.117C.5.62.668.432.8.287.894.174,1.01.065,1,0" transform="translate(33.092 0.07)" fill="#35509c"/>
      </g>
      <g id="group-54" data-name="group" transform="translate(56.484 13.61)">
        <path id="path-72" data-name="path" d="M0,.061.395,4.535l2.5-2.584V-2.04Z" transform="translate(0 2.04)" fill="#ecebec"/>
      </g>
      <g id="group-55" data-name="group" transform="translate(56.712 15.883)">
        <path id="path-73" data-name="path" d="M0,.078,2.638-2.49l.011-.105L.008-.061" transform="translate(0 2.595)" fill="#c6c4c4"/>
      </g>
      <g id="group-56" data-name="group" transform="translate(56.684 15.275)">
        <path id="path-74" data-name="path" d="M0,.077l2.694-2.52,0-.1L.014-.059" transform="translate(0 2.546)" fill="#c6c4c4"/>
      </g>
      <g id="group-57" data-name="group" transform="translate(56.623 14.631)">
        <path id="path-75" data-name="path" d="M0,.076,2.719-2.417l.011-.1L.014-.063" transform="translate(0 2.516)" fill="#c6c4c4"/>
      </g>
      <g id="group-58" data-name="group" transform="translate(56.593 14.027)">
        <path id="path-76" data-name="path" d="M0,.074,2.776-2.349l.01-.1L.016-.063" transform="translate(0 2.449)" fill="#c6c4c4"/>
      </g>
      <g id="group-59" data-name="group" transform="translate(56.726 16.499)">
        <path id="path-77" data-name="path" d="M0,.078,2.641-2.493l.006-.1L.008-.06" transform="translate(0 2.595)" fill="#c6c4c4"/>
      </g>
      <g id="group-60" data-name="group" transform="translate(56.726 17.026)">
        <path id="path-78" data-name="path" d="M0,.078l2.641-2.57.006-.1L.008-.059" transform="translate(0 2.593)" fill="#c6c4c4"/>
      </g>
      <g id="group-61" data-name="group" transform="translate(24.993 15.582)">
        <path id="path-79" data-name="path" d="M.934,0-29.746-.1v.014c-.019,0,.465-.044-.19,0a2.9,2.9,0,0,0-1.058,2.439A4.515,4.515,0,0,0-30.073,5h1.644L.618,4.9c.166,0,.409-.165.413-.267a3.115,3.115,0,0,0,.847-2.379A2.827,2.827,0,0,0,.934,0" transform="translate(30.994 0.11)" fill="#35509c"/>
      </g>
      <g id="group-62" data-name="group" transform="translate(25.901 12.98)">
        <path id="path-80" data-name="path" d="M.1,0l30.155-.03s.662-.08.344.289L27.65,2.7H-3.4Z" transform="translate(3.402 0.036)" fill="#292c62"/>
      </g>
      <g id="group-63" data-name="group" transform="translate(27.601 15.704)">
        <path id="path-81" data-name="path" d="M.019.146a4.683,4.683,0,0,1,.121-5l.511.014A4.564,4.564,0,0,0,.643.179Z" transform="translate(0.64 4.857)" fill="#fff"/>
      </g>
      <g id="group-64" data-name="group" transform="translate(31.349 18.033)">
        <path id="path-82" data-name="path" d="M.692.007A.262.262,0,0,1,.408.238H-22.674a.259.259,0,0,1-.277-.231.26.26,0,0,1,.277-.233H.408A.264.264,0,0,1,.692.007" transform="translate(22.951 0.226)" fill="#fff"/>
      </g>
      <g id="group-65" data-name="group" transform="translate(30.617 11.889)">
        <path id="path-83" data-name="path" d="M.726,0l0-.009H.719s0-.011-.008-.013C.613-.073-1.149,0-1.524,0L-4.6-.066H-21.189l-2.887,2.077h.219l-.219.153s.523,0,1.394,0l-1,.638,21.941.015S.707.12.715.084A.207.207,0,0,0,.726,0" transform="translate(24.076 0.066)" fill="#009f48"/>
      </g>
      <g id="group-66" data-name="group" transform="translate(52.493 9.139)">
        <path id="path-84" data-name="path" d="M0,.054.262,3.476,2.406,1.165l0-2.963Z" transform="translate(0 1.798)" fill="#ecebec"/>
      </g>
      <g id="group-67" data-name="group" transform="translate(52.903 10.62)">
        <path id="path-85" data-name="path" d="M0,.056,2-1.8l.012-.075L.014-.049" transform="translate(0 1.872)" fill="#c6c4c4"/>
      </g>
      <g id="group-68" data-name="group" transform="translate(52.867 10.157)">
        <path id="path-86" data-name="path" d="M0,.055,2.032-1.756l.011-.078L.019-.051" transform="translate(0 1.834)" fill="#c6c4c4"/>
      </g>
      <g id="group-69" data-name="group" transform="translate(52.847 9.667)">
        <path id="path-87" data-name="path" d="M0,.055l2.05-1.79.016-.074L.019-.049" transform="translate(0 1.81)" fill="#c6c4c4"/>
      </g>
      <g id="group-70" data-name="group" transform="translate(52.903 11.084)">
        <path id="path-88" data-name="path" d="M0,.057,2-1.8l.012-.077L.014-.05" transform="translate(0 1.876)" fill="#c6c4c4"/>
      </g>
      <g id="group-71" data-name="group" transform="translate(53.002 11.519)">
        <path id="path-89" data-name="path" d="M0,.059,1.929-1.87l.008-.078L.012-.046" transform="translate(0 1.948)" fill="#c6c4c4"/>
      </g>
      <g id="group-72" data-name="group" transform="translate(29.759 10.68)">
        <path id="path-90" data-name="path" d="M.017.119A5.819,5.819,0,0,0,1.284.046L21.806.068c.125,0,.8.116.8.033a3.22,3.22,0,0,0,.686-2.092,1.991,1.991,0,0,0-.636-1.628c0-.081-.081-.334-.2-.334H.544a.2.2,0,0,1-.16.141c-.007.016-.013.024-.018.034a1.206,1.206,0,0,1-.327.118.171.171,0,0,1-.052,0,2.631,2.631,0,0,0-.55,1.746A4.241,4.241,0,0,0,.017.119" transform="translate(0.561 3.953)" fill="#009f48"/>
      </g>
      <g id="group-73" data-name="group" transform="translate(49.301 11.021)">
        <path id="path-91" data-name="path" d="M.009,0A4.46,4.46,0,0,1,.081,3.736H-.225A5.249,5.249,0,0,0-.3,0Z" transform="translate(0.303)" fill="#fff"/>
      </g>
      <g id="group-74" data-name="group" transform="translate(31.924 11.892)">
        <path id="path-92" data-name="path" d="M.066.034a1.134,1.134,0,0,1-1.121,1.15A1.133,1.133,0,0,1-2.174.034,1.137,1.137,0,0,1-1.055-1.12,1.138,1.138,0,0,1,.066.034" transform="translate(2.174 1.12)" fill="#fff"/>
      </g>
      <g id="group-75" data-name="group" transform="translate(30.27 8.785)">
        <path id="path-93" data-name="path" d="M.082,0,22.006-.038s.644-.066.365.284l-2.377,1.94H-2.711Z" transform="translate(2.711 0.043)" fill="#008342"/>
      </g>
      <g id="group-76" data-name="group" transform="translate(42.415 0)">
        <path id="path-94" data-name="path" d="M0,0,7.745,9.19l-.639.8" transform="translate(0 0)" fill="#ce9529"/>
      </g>
      <g id="group-77" data-name="group" transform="translate(35.351 0)">
        <path id="path-95" data-name="path" d="M.207,0,7.313,9.988H-6.857" transform="translate(6.857 0)" fill="#e4ae1f"/>
      </g>
    </g>
  </g>
  <line id="Line_93" data-name="Line 93" y2="29.233" transform="translate(187.724 20.729)" fill="none" stroke="#94979b" stroke-width="1"/>
  <g id="Group_50372" data-name="Group 50372" transform="translate(0 13.053)">
    <path id="Path_129543" data-name="Path 129543" d="M736.58,301.023a.535.535,0,0,0-.729.2l-4.814,8.56a.714.714,0,0,0-.385.32l-4.479,8.031a.034.034,0,0,1-.044.014.031.031,0,0,1-.014-.045l4.113-8.375a.71.71,0,0,0,.046-.5l4.208-8.584a.533.533,0,0,0,.016-.435l1.846-3.766a.357.357,0,1,0-.641-.315l-1.847,3.766a.534.534,0,0,0-.336.279l-4.208,8.584a.7.7,0,0,0-.366.341l-4.035,8.291a.034.034,0,0,1-.061-.029l3.729-8.816a.71.71,0,0,0,.017-.5l3.409-8.074a.537.537,0,0,0-.011-.434l3.053-7.231a.357.357,0,1,0-.657-.277l-3.053,7.229a.53.53,0,0,0-.318.3l-3.409,8.074a.708.708,0,0,0-.347.363l-3.664,8.737a.033.033,0,0,1-.062-.024l3.384-9.459a.7.7,0,0,0-.011-.5l2.471-6.914a.535.535,0,0,0-.033-.434l3.8-10.642a.356.356,0,1,0-.671-.241l-3.8,10.643a.525.525,0,0,0-.3.312l-2.47,6.915a.7.7,0,0,0-.326.38l-3.335,9.388a.034.034,0,0,1-.042.022.033.033,0,0,1-.021-.043l3.048-10.33a.7.7,0,0,0-.038-.5l1.493-5.061a.532.532,0,0,0-.059-.431l4.15-14.072a.358.358,0,0,0-.686-.2l-4.149,14.072a.533.533,0,0,0-.283.329L724.163,305a.7.7,0,0,0-.3.4l-3.024,10.268a.033.033,0,0,1-.04.024.034.034,0,0,1-.024-.041l2.688-11.4a.713.713,0,0,0-.067-.5l.621-2.645a.531.531,0,0,0-.084-.426l3.7-15.778a.356.356,0,0,0-.1-.339l.363-1.553a.178.178,0,1,0-.347-.081l-.364,1.55a.357.357,0,0,0-.245.259l-3.7,15.778a.534.534,0,0,0-.264.345l-.619,2.645a.71.71,0,0,0-.281.414l-2.661,11.358a.034.034,0,0,1-.04.025.033.033,0,0,1-.026-.038l2.254-12.744a.716.716,0,0,0-.247-.669l2.937-16.709a.357.357,0,0,0-.122-.334l.657-3.747a.177.177,0,0,0-.145-.207.179.179,0,0,0-.207.145l-.657,3.748a.354.354,0,0,0-.229.271l-2.937,16.709a.707.707,0,0,0-.457.544l-.17.97-2.053,11.743a.034.034,0,0,1-.038.029.033.033,0,0,1-.029-.038l1.318-11.145a.7.7,0,0,0-.121-.485l.337-2.868a.527.527,0,0,0-.13-.414l1.563-13.238a.358.358,0,0,0-.142-.326l.809-6.849a.179.179,0,1,0-.355-.041l-.808,6.849a.353.353,0,0,0-.213.285l-1.563,13.236a.528.528,0,0,0-.223.372l-.339,2.868a.709.709,0,0,0-.232.444l-1.305,11.126a.034.034,0,0,1-.036.03.035.035,0,0,1-.031-.037l.594-9.642a.707.707,0,0,0-.15-.478l.371-6.066a.526.526,0,0,0-.154-.406l.546-8.926a.356.356,0,0,0-.159-.318l.621-10.158a.18.18,0,0,0-.169-.189.176.176,0,0,0-.188.167l-.621,10.158a.356.356,0,0,0-.2.3l-.546,8.924a.535.535,0,0,0-.2.385L715.8,304.6a.709.709,0,0,0-.207.455l-.573,9.637a.031.031,0,0,1-.034.032.032.032,0,0,1-.032-.033l.016-8.309a.708.708,0,0,0-.178-.468v-9.171a.535.535,0,0,0-.178-.4v-4.193a.354.354,0,0,0-.178-.307V278.484a.179.179,0,1,0-.358,0v13.363a.357.357,0,0,0-.178.307v4.193a.535.535,0,0,0-.178.4v9.171a.707.707,0,0,0-.178.468l.014,8.309a.032.032,0,0,1-.032.033.032.032,0,0,1-.034-.032l-.42-7.161a.7.7,0,0,0-.206-.457l-.732-11.971a.533.533,0,0,0-.387-.481l-.969-15.853a.179.179,0,1,0-.357.022l.969,15.853a.537.537,0,0,0-.326.524l.732,11.971a.709.709,0,0,0-.15.478l.44,7.17a.033.033,0,0,1-.031.035.033.033,0,0,1-.035-.03l-.729-6.255a.716.716,0,0,0-.232-.443l-1.27-10.756a.53.53,0,0,0-.224-.374l-.387-3.271a.359.359,0,0,0-.212-.283l-1.628-13.8a.179.179,0,0,0-.355.043l1.628,13.795a.356.356,0,0,0-.143.328l.387,3.272a.53.53,0,0,0-.129.414L710,308.219a.711.711,0,0,0-.122.485l.738,6.276a.032.032,0,0,1-.029.036.034.034,0,0,1-.038-.027l-.963-5.571a.7.7,0,0,0-.259-.433l-1.746-9.919a.53.53,0,0,0-.237-.357l-1.009-5.742a.359.359,0,0,0-.229-.272L704.046,281a.178.178,0,0,0-.2-.145.181.181,0,0,0-.147.207l2.055,11.691a.359.359,0,0,0-.122.334l1.007,5.734a.534.534,0,0,0-.113.427l1.748,9.926a.7.7,0,0,0-.094.487l.982,5.606a.033.033,0,0,1-.065.013l-1.183-5.127a.705.705,0,0,0-.281-.414l-2.2-9.4a.533.533,0,0,0-.264-.347l-1.7-7.261a.359.359,0,0,0-.243-.259l-2.24-9.552a.179.179,0,1,0-.348.081l2.241,9.553a.353.353,0,0,0-.105.341l1.7,7.261a.534.534,0,0,0-.083.427l2.2,9.4a.711.711,0,0,0-.067.5l1.214,5.173a.034.034,0,0,1-.066.017l-1.426-4.9a.708.708,0,0,0-.3-.4l-2.693-9.131a.529.529,0,0,0-.283-.329l-2.345-7.95a.355.355,0,0,0-.258-.245l-2.16-7.328a.179.179,0,0,0-.344.1l2.161,7.329a.357.357,0,0,0-.084.345l2.345,7.949a.536.536,0,0,0-.059.431l2.692,9.131a.708.708,0,0,0-.038.5l1.463,4.961a.033.033,0,1,1-.062.02l-1.744-4.948a.727.727,0,0,0-.326-.38l-3.228-9.034a.531.531,0,0,0-.3-.313l-2.83-7.92a.355.355,0,0,0-.272-.229l-1.772-4.96a.178.178,0,1,0-.336.121l1.771,4.958a.355.355,0,0,0-.065.35l2.83,7.92a.535.535,0,0,0-.035.435l3.228,9.034a.7.7,0,0,0-.01.5l1.794,5.015a.034.034,0,0,1-.02.043.033.033,0,0,1-.043-.019l-2.2-5.278a.7.7,0,0,0-.344-.36L698.533,302a.535.535,0,0,0-.325-.3l-3.059-7.244a.354.354,0,0,0-.283-.213l-1-2.37a.179.179,0,0,0-.329.139l1,2.37a.359.359,0,0,0-.044.354l3.061,7.252a.533.533,0,0,0-.006.428l3.834,9.089a.706.706,0,0,0,.016.5l2.265,5.357a.032.032,0,0,1-.016.045.034.034,0,0,1-.045-.017l-2.906-5.993a.7.7,0,0,0-.366-.342l-4.528-9.235a.533.533,0,0,0-.334-.277l-2.652-5.41a.357.357,0,0,0-.641.315l2.652,5.408a.531.531,0,0,0,.014.434l4.528,9.235a.711.711,0,0,0,.046.5l2.986,6.078a.033.033,0,1,1-.059.03l-4.046-7.263a.712.712,0,0,0-.385-.321l-5.25-9.337a.536.536,0,0,0-.934.525l5.251,9.336a.711.711,0,0,0,.073.5l4.444,7.9a.713.713,0,0,0,.624.364.693.693,0,0,0,.349-.092.709.709,0,0,0,.337-.8l.88,1.792a.711.711,0,0,0,1.334-.153l.383.909a.711.711,0,0,0,1.3.038l.162.454a.712.712,0,0,0,.428.434h0a22.689,22.689,0,0,0,13.908.01l0,0a.718.718,0,0,0,.457-.442l.156-.44a.712.712,0,0,0,1.3-.038l.39-.925a.712.712,0,0,0,1.334.154l.882-1.8a.713.713,0,0,0,1.309.535l4.872-8.665a.7.7,0,0,0,.073-.5l4.813-8.56a.534.534,0,0,0-.2-.729" transform="translate(-691.657 -278.298)" fill="#3f398e"/>
    <path id="Path_129544" data-name="Path 129544" d="M822.557,375.328a.537.537,0,0,0-.74.162l-1.854,2.9a.708.708,0,0,0-.4.3l-3.021,4.726a.715.715,0,0,0,.218.987.7.7,0,0,0,.383.112.711.711,0,0,0,.6-.329l3.021-4.726a.71.71,0,0,0,.1-.49l1.854-2.9a.537.537,0,0,0-.162-.74" transform="translate(-778.791 -345.997)" fill="#3f398e"/>
    <path id="Path_129545" data-name="Path 129545" d="M697.676,376.979a.709.709,0,0,0-.4-.3l-.761-1.19a.535.535,0,1,0-.9.576l.761,1.191a.705.705,0,0,0,.1.49l4.115,6.438a.714.714,0,1,0,1.2-.769Z" transform="translate(-694.359 -345.996)" fill="#3f398e"/>
    <path id="Path_129546" data-name="Path 129546" d="M917.525,303.9v-.1a6.573,6.573,0,0,0-.382-2.364,4.584,4.584,0,0,0-1.01-1.622,3.991,3.991,0,0,0-1.458-.933,4.955,4.955,0,0,0-1.725-.306,4.753,4.753,0,0,0-1.811.342,4.269,4.269,0,0,0-1.441.954,4.446,4.446,0,0,0-.944,1.459,5.14,5.14,0,0,0,0,3.689,4.3,4.3,0,0,0,.963,1.449,4.463,4.463,0,0,0,1.459.953,4.727,4.727,0,0,0,1.81.344,5.152,5.152,0,0,0,2.623-.667,4.168,4.168,0,0,0,1.745-2.079l-2.574-.267a1.773,1.773,0,0,1-.735.68,2.221,2.221,0,0,1-1.019.236,1.885,1.885,0,0,1-1.374-.521,2.073,2.073,0,0,1-.629-1.252Zm-2.652-1.658h-3.908a2.067,2.067,0,0,1,.667-1.154,1.936,1.936,0,0,1,1.316-.447,1.884,1.884,0,0,1,1.315.466,1.845,1.845,0,0,1,.61,1.135m-5.007-21.607.416.038V278.4c-.217-.011-.433-.032-.65-.057l-.591-.036c-.216-.013-.407-.021-.571-.021a3.5,3.5,0,0,0-.944.124,2.222,2.222,0,0,0-.791.391,1.84,1.84,0,0,0-.545.7,2.635,2.635,0,0,0-.2,1.087v2.478H904.6v2.1h1.393V291.8h2.478v-6.634h1.678v-2.1H908.47V281.3c0-.306.072-.5.216-.591a1.086,1.086,0,0,1,.575-.134,2.53,2.53,0,0,1,.265.019l.339.038m-5.982,8.655a4.868,4.868,0,0,0,0-3.689,4.349,4.349,0,0,0-1-1.458,4.646,4.646,0,0,0-1.485-.953,4.992,4.992,0,0,0-3.634,0,4.645,4.645,0,0,0-1.485.953,4.36,4.36,0,0,0-1,1.458,4.888,4.888,0,0,0,0,3.689,4.357,4.357,0,0,0,1,1.449,4.648,4.648,0,0,0,1.485.955,5,5,0,0,0,3.634,0,4.649,4.649,0,0,0,1.485-.955,4.346,4.346,0,0,0,1-1.449m-2.117-1.849a2.474,2.474,0,0,1-.6,1.706,2,2,0,0,1-1.572.678,2.139,2.139,0,0,1-.9-.182,2.013,2.013,0,0,1-.687-.506,2.39,2.39,0,0,1-.447-.753,2.641,2.641,0,0,1-.162-.944,2.457,2.457,0,0,1,.61-1.706,2.036,2.036,0,0,1,1.584-.676,2.084,2.084,0,0,1,1.563.676,2.292,2.292,0,0,1,.447.753,2.728,2.728,0,0,1,.162.953m-5.7,11.36a3.767,3.767,0,0,0-1.305-.22,3.474,3.474,0,0,0-1.469.325,3.284,3.284,0,0,0-1.2.934,1.4,1.4,0,0,1,.019-.229c0-.064,0-.137.01-.22s.009-.162.009-.239v-.342h-2.422v8.732h2.48v-5.663a3.161,3.161,0,0,1,.83-.715,1.96,1.96,0,0,1,1.02-.277,1.6,1.6,0,0,1,1.037.363,1.458,1.458,0,0,1,.449,1.2v5.09H898v-5.72a3.7,3.7,0,0,0-.237-1.363,2.923,2.923,0,0,0-.669-1.02,2.86,2.86,0,0,0-1.03-.638m-4.9-9.51a5.4,5.4,0,0,0,0-3.689,4.429,4.429,0,0,0-.9-1.458,4.107,4.107,0,0,0-1.345-.953,4.051,4.051,0,0,0-1.668-.342,3.485,3.485,0,0,0-1.716.4,2.653,2.653,0,0,0-1.047.953c0-.127,0-.325.018-.59s.019-.547.019-.84v-4.309h-2.478V291.8h2.478v-1.1a2.609,2.609,0,0,0,1.049.944,3.455,3.455,0,0,0,1.659.39,4.157,4.157,0,0,0,1.679-.342,4.1,4.1,0,0,0,1.353-.955,4.423,4.423,0,0,0,.9-1.449m-2.231-1.849a2.706,2.706,0,0,1-.161.934,2.294,2.294,0,0,1-.458.763,2.2,2.2,0,0,1-.705.516,2.244,2.244,0,0,1-1.811,0,2.2,2.2,0,0,1-.707-.516,2.308,2.308,0,0,1-.457-.763,2.795,2.795,0,0,1,0-1.878,2.355,2.355,0,0,1,.457-.753,2.1,2.1,0,0,1,.707-.5,2.353,2.353,0,0,1,1.811,0,2.1,2.1,0,0,1,.705.5,2.34,2.34,0,0,1,.458.753,2.7,2.7,0,0,1,.161.944m-14.317.726h6.5v-.1a6.579,6.579,0,0,0-.381-2.365,4.6,4.6,0,0,0-1.01-1.62,4,4,0,0,0-1.46-.935,4.948,4.948,0,0,0-1.726-.3,4.718,4.718,0,0,0-1.809.342,4.248,4.248,0,0,0-1.44.953,4.406,4.406,0,0,0-.944,1.458,5.138,5.138,0,0,0,0,3.689,4.257,4.257,0,0,0,.963,1.449,4.456,4.456,0,0,0,1.458.955,4.771,4.771,0,0,0,1.811.342,5.156,5.156,0,0,0,2.623-.667,4.16,4.16,0,0,0,1.744-2.079l-2.575-.267a1.771,1.771,0,0,1-.734.681,2.246,2.246,0,0,1-1.02.234,1.881,1.881,0,0,1-1.372-.519,2.081,2.081,0,0,1-.63-1.252m-.056-1.658a2.046,2.046,0,0,1,.667-1.154,1.926,1.926,0,0,1,1.315-.449,1.888,1.888,0,0,1,1.316.466,1.845,1.845,0,0,1,.61,1.137Zm-4.844,5.3,3.26-13.346h-2.708l-2.134,9.572-2.574-9.572H862.8l-2.556,9.553-2.077-9.553h-2.86l3.3,13.346h2.975l2.554-9.781,2.612,9.781Zm-13.061,11.9-1.41,2.059a4.3,4.3,0,0,0,.762.7,6.712,6.712,0,0,0,1.087.648,6.63,6.63,0,0,0,1.363.478,6.871,6.871,0,0,0,1.612.181,5.425,5.425,0,0,0,1.9-.315,4.363,4.363,0,0,0,1.429-.839,3.642,3.642,0,0,0,.9-1.221,3.491,3.491,0,0,0,.313-1.458,4.389,4.389,0,0,0-.161-1.238,3.06,3.06,0,0,0-.544-1.039,4.969,4.969,0,0,0-.99-.934,9.626,9.626,0,0,0-1.526-.887l-1.64-.8a2.258,2.258,0,0,1-.972-.754,1.447,1.447,0,0,1-.21-.715,1.1,1.1,0,0,1,.1-.447,1.176,1.176,0,0,1,.3-.4,1.522,1.522,0,0,1,.514-.3,2.315,2.315,0,0,1,.772-.115,3.059,3.059,0,0,1,1.421.372,4.4,4.4,0,0,1,1.324,1.1l1.6-1.849a5.184,5.184,0,0,0-2.05-1.487,6.336,6.336,0,0,0-2.373-.477,5.155,5.155,0,0,0-1.679.267,4.465,4.465,0,0,0-1.382.753,3.481,3.481,0,0,0-.944,1.171,3.363,3.363,0,0,0-.344,1.527,3.516,3.516,0,0,0,.638,2.107,5.34,5.34,0,0,0,2.069,1.573l1.545.743a4.845,4.845,0,0,1,1.334.839,1.346,1.346,0,0,1,.4.991,1.274,1.274,0,0,1-.506,1.049,1.952,1.952,0,0,1-1.248.4,3.555,3.555,0,0,1-.992-.143,5,5,0,0,1-.934-.373,4.88,4.88,0,0,1-.82-.535,4.3,4.3,0,0,1-.649-.629m-.8,10.12a7.09,7.09,0,0,0-.533,2.774,7.205,7.205,0,0,0,.523,2.774,6.573,6.573,0,0,0,1.45,2.184,6.674,6.674,0,0,0,2.172,1.429,6.943,6.943,0,0,0,2.679.514,5.834,5.834,0,0,0,1.641-.208,5.4,5.4,0,0,0,1.219-.516,3.939,3.939,0,0,0,.858-.667,5.086,5.086,0,0,0,.535-.648v1.811h2.153v-6.578h-5.663v2.136h2.917a2.844,2.844,0,0,1-.437.829,3.376,3.376,0,0,1-.743.724,3.758,3.758,0,0,1-1.02.5,4.115,4.115,0,0,1-1.287.191,4.5,4.5,0,0,1-1.668-.306,3.814,3.814,0,0,1-1.343-.887,4.085,4.085,0,0,1-.9-1.41,5.114,5.114,0,0,1-.325-1.878,5.041,5.041,0,0,1,.306-1.773,4.342,4.342,0,0,1,.848-1.421,3.75,3.75,0,0,1,1.314-.933,4.3,4.3,0,0,1,1.726-.334,3.9,3.9,0,0,1,2.289.667,3.5,3.5,0,0,1,1.334,1.869h2.917a6.266,6.266,0,0,0-.925-2.108,6.464,6.464,0,0,0-3.431-2.535,7.475,7.475,0,0,0-4.929.181,6.689,6.689,0,0,0-2.211,1.431,6.591,6.591,0,0,0-1.469,2.182m12.284-6.4a4.815,4.815,0,0,0,1.821.344,4.983,4.983,0,0,0,1.421-.2,4.821,4.821,0,0,0,1.238-.562,4.084,4.084,0,0,0,.982-.887,3.672,3.672,0,0,0,.63-1.173l-2.327-.724a2.207,2.207,0,0,1-.743.973,1.948,1.948,0,0,1-1.183.361,2.035,2.035,0,0,1-1.582-.676,2.693,2.693,0,0,1,0-3.413,2.035,2.035,0,0,1,1.582-.676,1.958,1.958,0,0,1,1.183.361,2.206,2.206,0,0,1,.743.973l2.327-.705a3.688,3.688,0,0,0-.63-1.173,4.265,4.265,0,0,0-.982-.9,4.577,4.577,0,0,0-1.238-.572,4.985,4.985,0,0,0-1.421-.2,4.84,4.84,0,0,0-1.821.342,4.56,4.56,0,0,0-1.477.954,4.437,4.437,0,0,0-.992,1.459,4.892,4.892,0,0,0,0,3.689,4.442,4.442,0,0,0,.992,1.449,4.535,4.535,0,0,0,1.477.953m4.269,7.116h-2.4v8.734h2.478V319.1a2.414,2.414,0,0,1,.44-1.63,1.783,1.783,0,0,1,1.391-.485h1.049V314.5a2.823,2.823,0,0,0-.686-.078,2.467,2.467,0,0,0-1.412.4,2.273,2.273,0,0,0-.858,1.106Zm6.123-15.733h-3.7v2.1h1.221v6.636h2.478Zm-2.478-4.148a1.562,1.562,0,0,0-.459,1.135,1.563,1.563,0,0,0,1.582,1.582,1.565,1.565,0,0,0,1.135-.457,1.513,1.513,0,0,0,.468-1.125,1.582,1.582,0,0,0-.124-.619,1.6,1.6,0,0,0-.848-.858,1.571,1.571,0,0,0-.63-.124,1.513,1.513,0,0,0-1.124.466m.1,22.409a4.886,4.886,0,0,0,0,3.689,4.391,4.391,0,0,0,1,1.448,4.649,4.649,0,0,0,1.484.953,5,5,0,0,0,3.635,0,4.65,4.65,0,0,0,1.484-.953,4.383,4.383,0,0,0,1-1.448,4.888,4.888,0,0,0,0-3.689,4.368,4.368,0,0,0-1-1.46,4.681,4.681,0,0,0-1.484-.953,5,5,0,0,0-3.635,0,4.68,4.68,0,0,0-1.484.953,4.375,4.375,0,0,0-1,1.46m2.118,1.838a2.452,2.452,0,0,1,.61-1.706,2.031,2.031,0,0,1,1.582-.677,2.09,2.09,0,0,1,1.565.677,2.308,2.308,0,0,1,.447.754,2.717,2.717,0,0,1,.162.952,2.481,2.481,0,0,1-.6,1.708,2.009,2.009,0,0,1-1.574.676,2.151,2.151,0,0,1-.9-.181,2,2,0,0,1-.686-.5,2.421,2.421,0,0,1-.449-.754,2.671,2.671,0,0,1-.161-.944m4.533-13.757a2.073,2.073,0,0,1-.629-1.252h6.5v-.1a6.581,6.581,0,0,0-.382-2.364,4.592,4.592,0,0,0-1.011-1.622,3.991,3.991,0,0,0-1.458-.933,4.949,4.949,0,0,0-1.725-.306,4.759,4.759,0,0,0-1.812.342,4.253,4.253,0,0,0-1.439.954,4.392,4.392,0,0,0-.944,1.459,5.119,5.119,0,0,0,0,3.689,4.273,4.273,0,0,0,.961,1.449,4.46,4.46,0,0,0,1.46.953,4.73,4.73,0,0,0,1.812.344,5.145,5.145,0,0,0,2.621-.667,4.168,4.168,0,0,0,1.745-2.079l-2.574-.267a1.78,1.78,0,0,1-.734.68,2.233,2.233,0,0,1-1.02.236,1.884,1.884,0,0,1-1.373-.521m-.686-2.911a2.072,2.072,0,0,1,.667-1.154,1.939,1.939,0,0,1,1.317-.447,1.883,1.883,0,0,1,1.314.466,1.849,1.849,0,0,1,.611,1.135Zm6.261,12.3H885.9v5.529a3.17,3.17,0,0,0,.277,1.307,3.269,3.269,0,0,0,.8,1.1,3.812,3.812,0,0,0,1.3.755,5.945,5.945,0,0,0,3.575,0,3.812,3.812,0,0,0,1.3-.755,3.153,3.153,0,0,0,.792-1.1,3.26,3.26,0,0,0,.267-1.307v-5.529h-2.478v5.073a1.527,1.527,0,0,1-.5,1.286,1.953,1.953,0,0,1-2.346,0,1.522,1.522,0,0,1-.5-1.286Zm9.451,0h-2.478v12.07h2.478v-4.442a2.589,2.589,0,0,0,1.049.944,3.429,3.429,0,0,0,1.658.39,4.122,4.122,0,0,0,1.678-.342,4.071,4.071,0,0,0,1.353-.953,4.416,4.416,0,0,0,.9-1.448,5.41,5.41,0,0,0,0-3.689,4.405,4.405,0,0,0-.9-1.46,4.119,4.119,0,0,0-1.344-.953,4.055,4.055,0,0,0-1.668-.342,3.5,3.5,0,0,0-1.718.4,2.657,2.657,0,0,0-1.047.953,2.048,2.048,0,0,1,.019-.229,4.155,4.155,0,0,0,.019-.476Zm-.057,4.366a2.635,2.635,0,0,1,.162-.942,2.3,2.3,0,0,1,.456-.754,2.117,2.117,0,0,1,.705-.5,2.352,2.352,0,0,1,1.811,0,2.081,2.081,0,0,1,.705.5,2.328,2.328,0,0,1,.459.754,2.8,2.8,0,0,1,0,1.876,2.308,2.308,0,0,1-.459.764,2.171,2.171,0,0,1-.705.514,2.239,2.239,0,0,1-1.811,0,2.21,2.21,0,0,1-.705-.514,2.281,2.281,0,0,1-.456-.764,2.657,2.657,0,0,1-.162-.934m5.794-11.139a4.982,4.982,0,0,0,1.421-.2,4.816,4.816,0,0,0,1.238-.562,4.094,4.094,0,0,0,.982-.887,3.633,3.633,0,0,0,.629-1.173l-2.325-.724a2.212,2.212,0,0,1-.744.973,1.946,1.946,0,0,1-1.183.361,2.032,2.032,0,0,1-1.582-.676,2.693,2.693,0,0,1,0-3.413,2.033,2.033,0,0,1,1.582-.676,1.955,1.955,0,0,1,1.183.361,2.211,2.211,0,0,1,.744.973l2.325-.705a3.648,3.648,0,0,0-.629-1.173,4.276,4.276,0,0,0-.982-.9,4.573,4.573,0,0,0-1.238-.572,4.983,4.983,0,0,0-1.421-.2,4.832,4.832,0,0,0-1.821.342,4.565,4.565,0,0,0-1.477.954,4.434,4.434,0,0,0-.991,1.459,4.869,4.869,0,0,0,0,3.689,4.439,4.439,0,0,0,.991,1.449,4.541,4.541,0,0,0,1.477.953,4.807,4.807,0,0,0,1.821.344" transform="translate(-805.903 -278.285)" fill="#040505"/>
    <path id="Path_129547" data-name="Path 129547" d="M863.966,396.017a5.457,5.457,0,0,0,1.221-.515,3.922,3.922,0,0,0,.858-.667,4.894,4.894,0,0,0,.533-.648V396h2.155V389.42H863.07v2.136h2.918a2.86,2.86,0,0,1-.439.829,3.313,3.313,0,0,1-.743.724,3.677,3.677,0,0,1-1.02.5,4.049,4.049,0,0,1-1.286.193,4.5,4.5,0,0,1-1.67-.306,3.872,3.872,0,0,1-1.343-.887,4.135,4.135,0,0,1-.9-1.412,5.109,5.109,0,0,1-.325-1.878,5.046,5.046,0,0,1,.306-1.773,4.361,4.361,0,0,1,.848-1.42,3.764,3.764,0,0,1,1.317-.934,4.29,4.29,0,0,1,1.725-.334,3.891,3.891,0,0,1,2.287.667,3.5,3.5,0,0,1,1.335,1.868H869a6.238,6.238,0,0,0-.923-2.105,6.465,6.465,0,0,0-3.433-2.537,7.469,7.469,0,0,0-4.928.181,6.7,6.7,0,0,0-2.212,1.431,6.608,6.608,0,0,0-1.467,2.182,7.07,7.07,0,0,0-.535,2.774,7.177,7.177,0,0,0,.525,2.774,6.513,6.513,0,0,0,3.623,3.613,6.945,6.945,0,0,0,2.678.516,5.769,5.769,0,0,0,1.64-.21m11.578-8.789a2.842,2.842,0,0,0-.688-.076,2.461,2.461,0,0,0-1.41.4,2.263,2.263,0,0,0-.858,1.106v-1.393h-2.4V396h2.478v-4.175a2.417,2.417,0,0,1,.438-1.631,1.786,1.786,0,0,1,1.393-.486h1.049Zm6.9,8.655a4.642,4.642,0,0,0,1.485-.953,4.355,4.355,0,0,0,1-1.448,4.889,4.889,0,0,0,0-3.689,4.343,4.343,0,0,0-1-1.459,4.64,4.64,0,0,0-1.485-.952,4.976,4.976,0,0,0-3.634,0,4.639,4.639,0,0,0-1.485.952,4.377,4.377,0,0,0-1,1.459,4.889,4.889,0,0,0,0,3.689,4.389,4.389,0,0,0,1,1.448,4.641,4.641,0,0,0,1.485.953,4.971,4.971,0,0,0,3.634,0m-.93-6.454a2.081,2.081,0,0,1,.686.5,2.253,2.253,0,0,1,.449.753,2.758,2.758,0,0,1,.161.953,2.483,2.483,0,0,1-.6,1.706,2,2,0,0,1-1.573.676,2.14,2.14,0,0,1-.9-.181,1.985,1.985,0,0,1-.687-.5,2.46,2.46,0,0,1-.447-.753,2.643,2.643,0,0,1-.162-.944,2.454,2.454,0,0,1,.61-1.706,2.036,2.036,0,0,1,1.583-.678,2.133,2.133,0,0,1,.877.181m10.513,6.521a3.838,3.838,0,0,0,1.3-.753,3.16,3.16,0,0,0,.794-1.1,3.257,3.257,0,0,0,.267-1.307v-5.529h-2.48v5.073a1.528,1.528,0,0,1-.5,1.287,1.957,1.957,0,0,1-2.344,0,1.529,1.529,0,0,1-.506-1.287v-5.073h-2.478v5.529a3.163,3.163,0,0,0,.277,1.307,3.288,3.288,0,0,0,.8,1.1,3.848,3.848,0,0,0,1.3.753,5.895,5.895,0,0,0,3.573,0m9.056-6.521a2.1,2.1,0,0,1,.7.506,2.315,2.315,0,0,1,.457.753,2.651,2.651,0,0,1,.162.944,2.679,2.679,0,0,1-.162.934,2.3,2.3,0,0,1-.457.763,2.185,2.185,0,0,1-.7.514,2.24,2.24,0,0,1-1.811,0,2.179,2.179,0,0,1-.707-.514,2.3,2.3,0,0,1-.457-.763,2.671,2.671,0,0,1-.162-.934,2.643,2.643,0,0,1,.162-.944,2.323,2.323,0,0,1,.457-.753,2.093,2.093,0,0,1,.707-.506,2.352,2.352,0,0,1,1.811,0m-3.08,5.462a2.585,2.585,0,0,0,1.049.944,3.432,3.432,0,0,0,1.658.392,4.126,4.126,0,0,0,3.032-1.3,4.435,4.435,0,0,0,.9-1.448,5.406,5.406,0,0,0,0-3.689,4.427,4.427,0,0,0-.9-1.459,4.105,4.105,0,0,0-1.345-.952,4.055,4.055,0,0,0-1.668-.344,3.49,3.49,0,0,0-1.716.4,2.666,2.666,0,0,0-1.049.952,2.057,2.057,0,0,1,.019-.228,4.231,4.231,0,0,0,.019-.477v-.42H895.53v12.07h2.478Z" transform="translate(-806.078 -351.011)" fill="#040505"/>
    <path id="Path_129548" data-name="Path 129548" d="M864.592,332.226a5.2,5.2,0,0,0-2.05-1.488,6.377,6.377,0,0,0-2.375-.476,5.193,5.193,0,0,0-1.678.266,4.5,4.5,0,0,0-1.382.753,3.526,3.526,0,0,0-.944,1.173,3.359,3.359,0,0,0-.344,1.525,3.521,3.521,0,0,0,.638,2.109,5.336,5.336,0,0,0,2.069,1.573l1.545.743a4.822,4.822,0,0,1,1.334.839,1.345,1.345,0,0,1,.4.992,1.276,1.276,0,0,1-.506,1.049,1.95,1.95,0,0,1-1.248.4,3.546,3.546,0,0,1-.992-.143,4.956,4.956,0,0,1-.934-.371,5.081,5.081,0,0,1-.82-.533,4.385,4.385,0,0,1-.649-.63l-1.41,2.06a4.374,4.374,0,0,0,.763.7,6.767,6.767,0,0,0,2.449,1.125,6.873,6.873,0,0,0,1.612.18,5.411,5.411,0,0,0,1.9-.313,4.386,4.386,0,0,0,1.431-.839,3.675,3.675,0,0,0,.9-1.221,3.486,3.486,0,0,0,.315-1.458,4.4,4.4,0,0,0-.162-1.24,3.091,3.091,0,0,0-.545-1.039,5.075,5.075,0,0,0-.991-.934,9.715,9.715,0,0,0-1.525-.886l-1.64-.8a2.25,2.25,0,0,1-.972-.753,1.459,1.459,0,0,1-.21-.715,1.116,1.116,0,0,1,.1-.449,1.181,1.181,0,0,1,.3-.4,1.533,1.533,0,0,1,.514-.3,2.273,2.273,0,0,1,.772-.115,3.06,3.06,0,0,1,1.421.373,4.419,4.419,0,0,1,1.326,1.1Zm6.573,5.224a2.21,2.21,0,0,1,.743.973l2.325-.707a3.624,3.624,0,0,0-.628-1.172,4.249,4.249,0,0,0-.982-.9,4.579,4.579,0,0,0-1.238-.573,5.04,5.04,0,0,0-1.421-.2,4.834,4.834,0,0,0-1.821.342,4.562,4.562,0,0,0-1.477.953,4.446,4.446,0,0,0-.992,1.459,4.892,4.892,0,0,0,0,3.689,4.488,4.488,0,0,0,.992,1.448,4.541,4.541,0,0,0,1.477.954,4.807,4.807,0,0,0,1.821.342,4.979,4.979,0,0,0,1.421-.2,4.77,4.77,0,0,0,1.238-.563,4,4,0,0,0,.982-.887,3.622,3.622,0,0,0,.628-1.172l-2.325-.726a2.214,2.214,0,0,1-.743.974,1.957,1.957,0,0,1-1.183.361,2.031,2.031,0,0,1-1.582-.677,2.692,2.692,0,0,1,0-3.412,2.028,2.028,0,0,1,1.582-.678,1.948,1.948,0,0,1,1.183.363m7.369-2.346h-3.7v2.1h1.221v6.636h2.478Zm-2.478-1.888a1.524,1.524,0,0,0,1.124.458,1.56,1.56,0,0,0,1.135-.458,1.508,1.508,0,0,0,.468-1.124,1.608,1.608,0,0,0-.468-1.135,1.606,1.606,0,0,0-.5-.344,1.566,1.566,0,0,0-.63-.124,1.508,1.508,0,0,0-1.124.468,1.559,1.559,0,0,0-.459,1.135,1.524,1.524,0,0,0,.459,1.124M888.68,340.1a6.57,6.57,0,0,0-.382-2.363,4.573,4.573,0,0,0-1.011-1.622,4,4,0,0,0-1.458-.934,4.994,4.994,0,0,0-1.725-.3,4.748,4.748,0,0,0-1.811.342,4.271,4.271,0,0,0-1.441.953,4.392,4.392,0,0,0-.942,1.459,5.116,5.116,0,0,0,0,3.689,4.278,4.278,0,0,0,.961,1.448,4.463,4.463,0,0,0,1.459.954,4.725,4.725,0,0,0,1.812.342,5.133,5.133,0,0,0,2.621-.667,4.158,4.158,0,0,0,1.744-2.077l-2.574-.267a1.775,1.775,0,0,1-.734.68,2.233,2.233,0,0,1-1.02.236,1.886,1.886,0,0,1-1.374-.52,2.081,2.081,0,0,1-.629-1.253h6.5Zm-3.261-2.7a1.835,1.835,0,0,1,.61,1.135h-3.907a2.06,2.06,0,0,1,.667-1.154,1.931,1.931,0,0,1,1.316-.449,1.878,1.878,0,0,1,1.315.468m6.69-1.5c0-.064,0-.137.011-.22s.01-.162.01-.239V335.1h-2.423v8.734h2.48v-5.663a3.1,3.1,0,0,1,.829-.715,1.96,1.96,0,0,1,1.02-.277,1.6,1.6,0,0,1,1.038.363,1.456,1.456,0,0,1,.449,1.2v5.092H898v-5.72a3.663,3.663,0,0,0-.239-1.363,2.894,2.894,0,0,0-.667-1.02,2.849,2.849,0,0,0-1.03-.64,3.81,3.81,0,0,0-1.307-.218,3.494,3.494,0,0,0-1.467.323,3.317,3.317,0,0,0-1.2.934,1.378,1.378,0,0,1,.018-.228m12.663,1.544a2.2,2.2,0,0,1,.743.973l2.327-.707a3.693,3.693,0,0,0-.63-1.172,4.283,4.283,0,0,0-.982-.9,4.565,4.565,0,0,0-1.24-.573,5.025,5.025,0,0,0-1.42-.2,4.828,4.828,0,0,0-1.821.342,4.557,4.557,0,0,0-1.477.953,4.393,4.393,0,0,0-.992,1.459,4.868,4.868,0,0,0,0,3.689,4.433,4.433,0,0,0,.992,1.448,4.536,4.536,0,0,0,1.477.954,4.8,4.8,0,0,0,1.821.342,4.965,4.965,0,0,0,1.42-.2,4.755,4.755,0,0,0,1.24-.563,4.033,4.033,0,0,0,.982-.887,3.691,3.691,0,0,0,.63-1.172l-2.327-.726a2.208,2.208,0,0,1-.743.974,1.957,1.957,0,0,1-1.183.361,2.032,2.032,0,0,1-1.582-.677,2.687,2.687,0,0,1,0-3.412,2.028,2.028,0,0,1,1.582-.678,1.948,1.948,0,0,1,1.183.363m12.752,2.65a6.572,6.572,0,0,0-.38-2.363,4.6,4.6,0,0,0-1.011-1.622,4,4,0,0,0-1.458-.934,5,5,0,0,0-1.727-.3,4.749,4.749,0,0,0-1.81.342,4.275,4.275,0,0,0-1.441.953,4.427,4.427,0,0,0-.944,1.459,5.118,5.118,0,0,0,0,3.689,4.316,4.316,0,0,0,.963,1.448,4.464,4.464,0,0,0,1.46.954,4.723,4.723,0,0,0,1.81.342,5.125,5.125,0,0,0,2.622-.667,4.151,4.151,0,0,0,1.746-2.077l-2.575-.267a1.761,1.761,0,0,1-.734.68,2.222,2.222,0,0,1-1.019.236,1.884,1.884,0,0,1-1.374-.52,2.077,2.077,0,0,1-.629-1.253h6.5Zm-3.26-2.7a1.841,1.841,0,0,1,.61,1.135h-3.908a2.054,2.054,0,0,1,.667-1.154,1.929,1.929,0,0,1,1.315-.449,1.881,1.881,0,0,1,1.316.468" transform="translate(-805.903 -314.583)" fill="#040505"/>
    <path id="Path_129549" data-name="Path 129549" d="M862.932,278.458l-2.554,9.553-2.077-9.553h-2.86l3.3,13.348h2.975l2.555-9.782,2.612,9.782h2.975l3.26-13.348h-2.708l-2.134,9.572-2.574-9.572Zm18.323,9.609a6.619,6.619,0,0,0-.381-2.364,4.584,4.584,0,0,0-1.01-1.62,4.009,4.009,0,0,0-1.46-.935,4.951,4.951,0,0,0-1.725-.305,4.732,4.732,0,0,0-1.811.344,4.241,4.241,0,0,0-1.439.953,4.409,4.409,0,0,0-.944,1.458,5.118,5.118,0,0,0,0,3.689,4.267,4.267,0,0,0,.963,1.449,4.452,4.452,0,0,0,1.458.955,4.767,4.767,0,0,0,1.811.342,5.148,5.148,0,0,0,2.622-.667,4.155,4.155,0,0,0,1.744-2.079l-2.574-.267a1.749,1.749,0,0,1-.734.68,2.228,2.228,0,0,1-1.02.236,1.887,1.887,0,0,1-1.372-.519,2.08,2.08,0,0,1-.63-1.252h6.5Zm-3.26-2.7a1.845,1.845,0,0,1,.609,1.133H874.7a2.057,2.057,0,0,1,.669-1.152,1.926,1.926,0,0,1,1.315-.449,1.883,1.883,0,0,1,1.316.468m9.75-.134a2.108,2.108,0,0,1,.7.5,2.337,2.337,0,0,1,.459.753,2.821,2.821,0,0,1,0,1.878,2.289,2.289,0,0,1-.459.763,2.208,2.208,0,0,1-.7.515,2.242,2.242,0,0,1-1.811,0,2.194,2.194,0,0,1-.707-.515,2.3,2.3,0,0,1-.457-.763,2.795,2.795,0,0,1,0-1.878,2.35,2.35,0,0,1,.457-.753,2.1,2.1,0,0,1,.707-.5,2.351,2.351,0,0,1,1.811,0m-3.08,5.462a2.607,2.607,0,0,0,1.049.944,3.448,3.448,0,0,0,1.659.39,4.139,4.139,0,0,0,1.677-.342,4.081,4.081,0,0,0,1.355-.955,4.429,4.429,0,0,0,.9-1.449,5.4,5.4,0,0,0,0-3.689,4.421,4.421,0,0,0-.9-1.458,4.108,4.108,0,0,0-1.345-.953,4.052,4.052,0,0,0-1.668-.344,3.486,3.486,0,0,0-1.716.4,2.658,2.658,0,0,0-1.049.953c0-.127.006-.325.019-.59s.019-.547.019-.84v-4.309h-2.478v13.348h2.478Zm16.87.992a4.622,4.622,0,0,0,1.483-.955,4.369,4.369,0,0,0,1-1.449,4.888,4.888,0,0,0,0-3.689,4.358,4.358,0,0,0-1-1.458,4.62,4.62,0,0,0-1.483-.953,4.977,4.977,0,0,0-3.635,0,4.649,4.649,0,0,0-1.484.953,4.351,4.351,0,0,0-1,1.458,4.888,4.888,0,0,0,0,3.689,4.361,4.361,0,0,0,1,1.449,4.651,4.651,0,0,0,1.484.955,5,5,0,0,0,3.635,0m-.93-6.454a2.1,2.1,0,0,1,.686.495,2.321,2.321,0,0,1,.447.753,2.717,2.717,0,0,1,.162.954,2.475,2.475,0,0,1-.6,1.706,2,2,0,0,1-1.574.678,2.149,2.149,0,0,1-.9-.182,2.02,2.02,0,0,1-.686-.506,2.356,2.356,0,0,1-.447-.753,2.641,2.641,0,0,1-.162-.944,2.451,2.451,0,0,1,.61-1.706,2.034,2.034,0,0,1,1.582-.676,2.1,2.1,0,0,1,.878.181m5.518-2.165h-1.391v2.1h1.391v6.636h2.48V285.17h1.678v-2.1H908.6V281.3c0-.306.072-.5.216-.591a1.087,1.087,0,0,1,.575-.134,2.531,2.531,0,0,1,.264.019l.341.038.414.038V278.4q-.323-.019-.648-.057c-.178-.013-.374-.025-.59-.038s-.407-.019-.571-.019a3.5,3.5,0,0,0-.944.124,2.228,2.228,0,0,0-.791.391,1.843,1.843,0,0,0-.545.705,2.615,2.615,0,0,0-.2,1.087Z" transform="translate(-806.036 -278.286)" fill="#040505"/>
    <rect id="Rectangle_8662" data-name="Rectangle 8662" width="0.524" height="44.814" transform="translate(117.619 0.17)" fill="#040505"/>
    <path id="Path_129550" data-name="Path 129550" d="M1106.909,352.389h-1.993l-.4,1.545h-1.495l2.044-6.5h1.754l2.042,6.5h-1.554Zm-.3-1.146-.159-.6c-.179-.648-.348-1.415-.528-2.093h-.04c-.15.689-.33,1.445-.508,2.093l-.161.6Z" transform="translate(-978.936 -326.577)" fill="#040505"/>
    <path id="Path_129551" data-name="Path 129551" d="M1124.3,352.313h1.2l.1.628h.04a2.275,2.275,0,0,1,1.585-.748c1.076,0,1.534.758,1.534,1.993v3.07h-1.465v-2.881c0-.718-.189-.936-.608-.936a1.249,1.249,0,0,0-.917.478v3.339H1124.3Z" transform="translate(-993.795 -329.899)" fill="#040505"/>
    <path id="Path_129552" data-name="Path 129552" d="M1144.741,354.078a.69.69,0,0,0-.778-.718,2.657,2.657,0,0,0-1.314.449l-.519-.966a4.088,4.088,0,0,1,2.114-.648c1.265,0,1.963.716,1.963,2.232v2.831h-1.2l-.11-.509h-.03a2.171,2.171,0,0,1-1.445.629,1.421,1.421,0,0,1-1.465-1.5c0-1.036.826-1.6,2.781-1.8m-.818,2.163a1.1,1.1,0,0,0,.818-.418v-.868c-1.047.14-1.386.439-1.386.818,0,.318.22.468.568.468" transform="translate(-1006.129 -329.901)" fill="#040505"/>
    <path id="Path_129553" data-name="Path 129553" d="M1159.674,345.816h1.466v5.512c0,.309.138.408.257.408a.646.646,0,0,0,.18-.019l.18,1.085a1.9,1.9,0,0,1-.739.121c-1.006,0-1.345-.659-1.345-1.655Z" transform="translate(-1018.5 -325.446)" fill="#040505"/>
    <path id="Path_129554" data-name="Path 129554" d="M1167.668,358.311a.841.841,0,0,0,.867-.648l.07-.259-1.9-4.813h1.474l.708,2.123c.14.447.259.917.388,1.405h.04c.11-.469.219-.937.339-1.405l.6-2.123h1.405l-1.716,4.993c-.468,1.246-.995,1.883-2.161,1.883a2.285,2.285,0,0,1-.7-.1l.258-1.116a1.689,1.689,0,0,0,.33.059" transform="translate(-1023.407 -330.177)" fill="#040505"/>
    <path id="Path_129555" data-name="Path 129555" d="M1185.128,350.688h-.678V349.6l.758-.061.169-1.316h1.218v1.316h1.184v1.146h-1.184v1.983c0,.559.248.788.636.788a1.408,1.408,0,0,0,.468-.1l.229,1.067a3.563,3.563,0,0,1-1.1.18c-1.226,0-1.7-.767-1.7-1.913Z" transform="translate(-1035.803 -327.129)" fill="#040505"/>
    <path id="Path_129556" data-name="Path 129556" d="M1198,345.882a.852.852,0,1,1,.848.767.784.784,0,0,1-.848-.767m.119,1.494h1.466v4.944h-1.466Z" transform="translate(-1045.265 -324.962)" fill="#040505"/>
    <path id="Path_129557" data-name="Path 129557" d="M1208.634,352.193a1.994,1.994,0,0,1,1.445.568l-.668.907a1.061,1.061,0,0,0-.688-.29c-.707,0-1.156.549-1.156,1.405s.468,1.405,1.106,1.405a1.415,1.415,0,0,0,.887-.36l.589.928a2.566,2.566,0,0,1-1.646.617,2.38,2.38,0,0,1-2.44-2.591,2.483,2.483,0,0,1,2.57-2.591" transform="translate(-1050.897 -329.899)" fill="#040505"/>
    <path id="Path_129558" data-name="Path 129558" d="M1221.8,355.771a2.129,2.129,0,0,0,1.276.519c.438,0,.627-.161.627-.418,0-.33-.5-.479-1.005-.678-.6-.229-1.307-.638-1.307-1.456,0-.915.748-1.544,1.894-1.544a2.837,2.837,0,0,1,1.744.629l-.657.875a1.839,1.839,0,0,0-1.048-.419c-.379,0-.559.14-.559.39,0,.318.458.438.968.627.627.229,1.335.579,1.335,1.485s-.708,1.595-2.034,1.595a3.184,3.184,0,0,1-1.892-.688Z" transform="translate(-1061.424 -329.899)" fill="#040505"/>
    <path id="Path_129559" data-name="Path 129559" d="M1104.041,383.536a1.875,1.875,0,0,1,.347-.584,1.512,1.512,0,0,1,.535-.385,1.834,1.834,0,0,1,1.529.06,1.557,1.557,0,0,1,.591.551l.714-.45a2.1,2.1,0,0,0-.4-.436,2.66,2.66,0,0,0-.506-.331,2.86,2.86,0,0,0-.589-.213,2.658,2.658,0,0,0-.645-.078,2.694,2.694,0,0,0-1.014.193,2.508,2.508,0,0,0-1.381,1.366,2.759,2.759,0,0,0,0,2.082,2.509,2.509,0,0,0,1.381,1.366,2.665,2.665,0,0,0,1.014.192,2.758,2.758,0,0,0,1.234-.287,2.2,2.2,0,0,0,.9-.77l-.714-.452a1.545,1.545,0,0,1-.591.551,1.834,1.834,0,0,1-1.529.06,1.494,1.494,0,0,1-.535-.385,1.857,1.857,0,0,1-.347-.584,2.191,2.191,0,0,1,0-1.465m4.374,1.773a2.477,2.477,0,0,0,.562.826,2.583,2.583,0,0,0,.831.54,2.764,2.764,0,0,0,2.026,0,2.568,2.568,0,0,0,.832-.54,2.485,2.485,0,0,0,.562-.826,2.75,2.75,0,0,0,0-2.082,2.485,2.485,0,0,0-.562-.826,2.591,2.591,0,0,0-.832-.54,2.762,2.762,0,0,0-2.026,0,2.606,2.606,0,0,0-.831.54,2.476,2.476,0,0,0-.562.826,2.765,2.765,0,0,0,0,2.082m4-.309a1.786,1.786,0,0,1-.354.584,1.543,1.543,0,0,1-.544.385,1.825,1.825,0,0,1-1.394,0,1.57,1.57,0,0,1-.54-.385,1.815,1.815,0,0,1-.352-.584,2.171,2.171,0,0,1,0-1.465,1.832,1.832,0,0,1,.352-.584,1.59,1.59,0,0,1,.54-.385,1.825,1.825,0,0,1,1.394,0,1.563,1.563,0,0,1,.544.385,1.8,1.8,0,0,1,.354.584,2.2,2.2,0,0,1,0,1.465m8.332-2.264a1.137,1.137,0,0,1,.264.769v3.229h.871v-3.226a1.949,1.949,0,0,0-.447-1.334,1.67,1.67,0,0,0-1.326-.506,2.1,2.1,0,0,0-.965.221,2.856,2.856,0,0,0-.853.7,1.412,1.412,0,0,0-.578-.688,2.167,2.167,0,0,0-1.949-.011,2.468,2.468,0,0,0-.71.578V381.8h-.848v4.934h.87v-3.449a2.051,2.051,0,0,1,1.476-.858.988.988,0,0,1,.792.309,1.137,1.137,0,0,1,.265.769v3.229h.871v-3.449a2.034,2.034,0,0,1,1.486-.858.974.974,0,0,1,.782.309m5.712,3.938a2.364,2.364,0,0,0,.8-.54,2.484,2.484,0,0,0,.528-.826,2.745,2.745,0,0,0,.194-1.041,2.854,2.854,0,0,0-.188-1.041,2.513,2.513,0,0,0-.517-.826,2.346,2.346,0,0,0-.788-.54,2.563,2.563,0,0,0-1-.193,2.108,2.108,0,0,0-.568.078,2.693,2.693,0,0,0-.522.2,1.834,1.834,0,0,0-.425.3,1.386,1.386,0,0,0-.28.374V381.8h-.87v6.873h.87v-2.731a1.233,1.233,0,0,0,.28.363,2.138,2.138,0,0,0,.414.293,2.264,2.264,0,0,0,1.068.269,2.577,2.577,0,0,0,1-.192m.5-1.674a1.821,1.821,0,0,1-.352.584,1.558,1.558,0,0,1-.546.385,1.821,1.821,0,0,1-1.393,0,1.562,1.562,0,0,1-.54-.385,1.777,1.777,0,0,1-.352-.584,2.168,2.168,0,0,1,0-1.465,1.793,1.793,0,0,1,.352-.584,1.582,1.582,0,0,1,.54-.385,1.822,1.822,0,0,1,1.393,0,1.578,1.578,0,0,1,.546.385,1.838,1.838,0,0,1,.352.584,2.177,2.177,0,0,1,0,1.465m2.733.875a.81.81,0,0,1-.242-.571q0-.772,1.024-.772h.772a1.823,1.823,0,0,0,.329-.027.382.382,0,0,0,.221-.116v.528a1.267,1.267,0,0,1-.11.557,1.07,1.07,0,0,1-.3.374,1.213,1.213,0,0,1-.43.215,1.89,1.89,0,0,1-.506.067,1.013,1.013,0,0,1-.76-.255m2.1-2.415a.405.405,0,0,1-.078.256.343.343,0,0,1-.287.1h-1.155a1.976,1.976,0,0,0-1.278.376,1.33,1.33,0,0,0-.462,1.1,1.569,1.569,0,0,0,.126.638,1.44,1.44,0,0,0,.358.5,1.64,1.64,0,0,0,.562.326,2.245,2.245,0,0,0,.739.115,2.337,2.337,0,0,0,.413-.038,2.043,2.043,0,0,0,.413-.121,1.631,1.631,0,0,0,.368-.215,1.109,1.109,0,0,0,.282-.32v.562h.87V383.42a1.671,1.671,0,0,0-.512-1.267,2.049,2.049,0,0,0-1.459-.484,2.917,2.917,0,0,0-1.124.2,2.8,2.8,0,0,0-.781.462l.461.649a3.179,3.179,0,0,1,.607-.38,1.745,1.745,0,0,1,.77-.161,1.409,1.409,0,0,1,.843.234.84.84,0,0,1,.325.732Zm6.25.048a1.892,1.892,0,0,0-.468-1.334,1.744,1.744,0,0,0-1.348-.506,2.168,2.168,0,0,0-.958.209,2.379,2.379,0,0,0-.761.6V381.8h-.849v4.934h.871v-3.449a2.821,2.821,0,0,1,.777-.648,1.616,1.616,0,0,1,.766-.21,1.031,1.031,0,0,1,.819.32,1.194,1.194,0,0,1,.281.823v3.164h.869Zm2.379,3.8a1.109,1.109,0,0,1-.308.513.856.856,0,0,1-.528.137h-.551v.716h.573a2.275,2.275,0,0,0,.606-.071,1.238,1.238,0,0,0,.428-.209,1.308,1.308,0,0,0,.3-.342,2.66,2.66,0,0,0,.226-.468l2.214-5.782h-.915l-1.5,4.186-1.41-4.186h-.969l1.807,4.934h.222Z" transform="translate(-978.936 -350.484)" fill="#040505"/>
    <path id="Path_129560" data-name="Path 129560" d="M1106.823,322.251l.742,2.216h.807l-2.234-6.489h-.9l-2.215,6.489h.761l.713-2.216Zm-.2-.64h-1.91l.965-2.911Z" transform="translate(-978.937 -306.004)" fill="#040505"/>
    <path id="Path_129561" data-name="Path 129561" d="M1129.39,317.552a2.733,2.733,0,0,1,1.924.847l-.809.907a1.53,1.53,0,0,0-1.1-.489c-.906,0-1.614.788-1.614,2.093,0,1.335.629,2.114,1.576,2.114a1.587,1.587,0,0,0,1.235-.579l.807.888a2.655,2.655,0,0,1-2.062.956,3.007,3.007,0,0,1-3.059-3.33,3.126,3.126,0,0,1,3.1-3.408" transform="translate(-995.187 -305.707)" fill="#040505"/>
    <path id="Path_129562" data-name="Path 129562" d="M1145.547,316.329h1.466v5.512c0,.309.138.409.258.409a.6.6,0,0,0,.18-.021l.18,1.086a1.9,1.9,0,0,1-.738.121c-1.006,0-1.345-.659-1.345-1.655Z" transform="translate(-1008.635 -304.853)" fill="#040505"/>
    <path id="Path_129563" data-name="Path 129563" d="M1156.7,324.591a.688.688,0,0,0-.777-.718,2.672,2.672,0,0,0-1.316.449l-.517-.966a4.09,4.09,0,0,1,2.112-.648c1.267,0,1.964.718,1.964,2.232v2.831h-1.2l-.109-.509h-.03a2.174,2.174,0,0,1-1.445.629,1.421,1.421,0,0,1-1.466-1.494c0-1.038.828-1.606,2.78-1.8m-.817,2.163a1.1,1.1,0,0,0,.817-.419v-.868c-1.046.14-1.385.44-1.385.818,0,.318.22.468.568.468" transform="translate(-1014.48 -309.308)" fill="#040505"/>
    <path id="Path_129564" data-name="Path 129564" d="M1171.7,322.826h1.2l.1.868h.04a1.655,1.655,0,0,1,1.405-.987,1.451,1.451,0,0,1,.589.1l-.241,1.267a1.8,1.8,0,0,0-.538-.08,1.22,1.22,0,0,0-1.085.906v2.871H1171.7Z" transform="translate(-1026.902 -309.307)" fill="#040505"/>
    <path id="Path_129565" data-name="Path 129565" d="M1184.192,316.391a.852.852,0,1,1,.848.767.777.777,0,0,1-.848-.767m.121,1.5h1.464v4.944h-1.464Z" transform="translate(-1035.622 -304.367)" fill="#040505"/>
    <path id="Path_129566" data-name="Path 129566" d="M1191.46,323.1h1.475l.638,2.332c.129.489.258,1.008.388,1.525h.04c.12-.517.249-1.036.379-1.525l.648-2.332h1.405l-1.616,4.944h-1.693Z" transform="translate(-1040.698 -309.583)" fill="#040505"/>
    <path id="Path_129567" data-name="Path 129567" d="M1211.987,324.591a.689.689,0,0,0-.778-.718,2.662,2.662,0,0,0-1.315.449l-.519-.966a4.087,4.087,0,0,1,2.114-.648c1.265,0,1.962.718,1.962,2.232v2.831h-1.2l-.108-.509h-.03a2.174,2.174,0,0,1-1.445.629,1.421,1.421,0,0,1-1.465-1.494c0-1.038.826-1.606,2.781-1.8m-.818,2.163a1.1,1.1,0,0,0,.818-.419v-.868c-1.047.14-1.386.44-1.386.818,0,.318.22.468.568.468" transform="translate(-1053.091 -309.308)" fill="#040505"/>
    <path id="Path_129568" data-name="Path 129568" d="M1225.879,321.2h-.678v-1.085l.757-.061.168-1.316h1.216v1.316h1.188V321.2h-1.188v1.983c0,.559.25.788.638.788a1.416,1.416,0,0,0,.468-.1l.229,1.066a3.547,3.547,0,0,1-1.1.18c-1.225,0-1.7-.767-1.7-1.913Z" transform="translate(-1064.261 -306.536)" fill="#040505"/>
    <path id="Path_129569" data-name="Path 129569" d="M1240.291,322.7a2.088,2.088,0,0,1,2.1,2.373,2.854,2.854,0,0,1-.061.618h-2.96a1.2,1.2,0,0,0,1.286,1.076,1.984,1.984,0,0,0,1.067-.33l.489.888a3.236,3.236,0,0,1-1.754.557,2.6,2.6,0,0,1-.169-5.182m.857,2.083c0-.568-.239-.966-.828-.966-.458,0-.856.307-.956.966Z" transform="translate(-1073.17 -309.306)" fill="#040505"/>
  </g>
</svg>
