<svg xmlns="http://www.w3.org/2000/svg" xmlns:xlink="http://www.w3.org/1999/xlink" width="1887.954" height="569.008" viewBox="0 0 1887.954 569.008">
  <defs>
    <linearGradient id="linear-gradient" x1="0.529" y1="1.134" x2="0.525" y2="-0.095" gradientUnits="objectBoundingBox">
      <stop offset="0" stop-color="#bfac5d"/>
      <stop offset="1" stop-color="#fffef7"/>
    </linearGradient>
  </defs>
  <path id="BG" d="M-70.178,3137.628c-194.661,29.3-350.6-126.423-149.531-276.545,133.076-99.356,313.252-183.537,508.643-245.717,198.659-63.219,460.65-23.426,655.938-33.09,111.894-5.538,210.995-11.886,295.6-9.6,144.563,3.914,246.647,33.086,297.478,134.761,128.984,258-111.406,379.158-300.994,410.406C789.371,3191.615,555.5,3043.459-70.178,3137.628Z" transform="translate(313.572 -2572.2)" opacity="0.122" fill="url(#linear-gradient)"/>
</svg>
