<svg xmlns="http://www.w3.org/2000/svg" xmlns:xlink="http://www.w3.org/1999/xlink" width="1890.679" height="584.756" viewBox="0 0 1890.679 584.756">
  <defs>
    <linearGradient id="linear-gradient" x1="0.471" y1="1.134" x2="0.475" y2="-0.095" gradientUnits="objectBoundingBox">
      <stop offset="0" stop-color="#bfac5d"/>
      <stop offset="1" stop-color="#fffef7"/>
    </linearGradient>
  </defs>
  <path id="BG" d="M1330.988,3137.628c3.7.557,7.383,1.046,11.168,1.484,189.29,21.9,335.614-130.759,138.363-278.03-133.076-99.356-313.252-183.537-508.643-245.717-60.79-19.345-127.509-29.045-196.444-33.468-156.308-10.029-323.964,7.084-459.494.377-303.237-15.007-512.517-35.967-593.073,125.165-128.984,258,86.157,398.939,275.745,430.187C446.19,3211.4,705.311,3043.459,1330.988,3137.628Z" transform="translate(316.293 -2572.199)" opacity="0.122" fill="url(#linear-gradient)"/>
</svg>
