<svg xmlns="http://www.w3.org/2000/svg" width="17.95" height="16.801" viewBox="0 0 17.95 16.801">
  <path id="Union_2493" data-name="Union 2493" d="M0,8.4l8.178,8.4,1.259-1.508-5.681-5.9H17.95V7.5H3.68L9.437,1.622,8.178,0Z" fill="#bfac5d"/>
</svg>
