<svg xmlns="http://www.w3.org/2000/svg" width="17.95" height="16.801" viewBox="0 0 17.95 16.801">
  <path id="Union_2493" data-name="Union 2493" d="M0,8.4,8.178,0,9.437,1.508l-5.681,5.9H17.95V9.3H3.68l5.758,5.879L8.178,16.8Z" transform="translate(17.95 16.801) rotate(180)" fill="#bfac5d"/>
</svg>
