<svg xmlns="http://www.w3.org/2000/svg" width="1497.359" height="486.033" viewBox="0 0 1497.359 486.033">
  <path id="Path_129930" data-name="Path 129930" d="M2572.557,1786.285a29.728,29.728,0,0,0,.376-12.447c-.085-.453-.193-.888-.286-1.334a68.741,68.741,0,0,0,12.361-1.731,83.512,83.512,0,0,0,20.741-7.733,81.584,81.584,0,0,0,15.9-11.127,104.2,104.2,0,0,0,11.191-11.631q.546-.682,1.1-1.394l61.023-.921a45.077,45.077,0,0,0-.871,5.032,47.875,47.875,0,0,0,.568,14.963c.434,2.109.925,4.093,1.46,5.982a50.824,50.824,0,0,0-5.118,1.392,57.833,57.833,0,0,0-8.676,3.708,54.743,54.743,0,0,0-8.866,5.848,46.513,46.513,0,0,0-9.618,10.373,57.3,57.3,0,0,0-5.838,11.187c-.556,1.448-1.021,2.872-1.442,4.286l-88.312-.29a114.525,114.525,0,0,0,4.308-14.163m-45.438-37.009a95.033,95.033,0,0,1-9.869-7.925c-.244-.222-.485-.464-.727-.691l24.537-.37a17.505,17.505,0,0,0,.631,3.315,49.3,49.3,0,0,0,3.459,8.108c1.531,2.983,3.37,6.167,5.492,9.536a95.957,95.957,0,0,1-23.524-11.975m43.157,15.246c-.239-.609-.477-1.22-.736-1.807a76.58,76.58,0,0,0-4.842-9.243q-2.577-4.147-4.082-6.787t-3.019-4.906c-.381-.568-.749-1.146-1.116-1.721l72.247-1.091c-1.423,1.752-2.878,3.393-4.375,4.9a70.324,70.324,0,0,1-13.7,10.935,62.749,62.749,0,0,1-14.2,6.416,76.247,76.247,0,0,1-26.172,3.3m167.313-61.69c.753-.215,1.445-.375,2.071-.5a7.725,7.725,0,0,1,1.321-.192q11.947-.5,19.424,3.147a29.124,29.124,0,0,1,10.313,8.165,48.135,48.135,0,0,0-6.957-2.505,43.257,43.257,0,0,0-12.973-1.664,30.249,30.249,0,0,0-10.862,2.277,21.459,21.459,0,0,0-7.929,5.593q-2.219,2.44-4.322,4.382t-3.77,3.268c-.863.691-1.813,1.41-2.811,2.146-.307-.181-.617-.35-.924-.525-.113-1.7-.2-2.962-.26-3.783-.075-.993-.126-1.755-.165-2.269s-.074-1.035-.11-1.557-.094-1.438-.165-2.768c-.054-.934-.107-2.18-.157-3.708a64.643,64.643,0,0,1,6.208-4.224,52.176,52.176,0,0,1,5.906-3.084c1.595-.67,2.472-1.046,2.641-1.125a4.329,4.329,0,0,1,1.381-.5c.671-.176,1.382-.361,2.138-.568m40.291,27.465a116.728,116.728,0,0,1,1.821,17.981,64.243,64.243,0,0,1-1.949,17.91,100.089,100.089,0,0,1-5.028,14.963,92.283,92.283,0,0,1-5.34,10.625q-2.515,4.145-3.02,4.9t-.877,1.318a4.863,4.863,0,0,1-1.009,1.071,11.586,11.586,0,0,1-1.568,1.006,16.105,16.105,0,0,1-2.58,1l-93.764-.31a29.782,29.782,0,0,1,1.163-3.558,48.9,48.9,0,0,1,5.408-9.993,51.58,51.58,0,0,1,6.918-7.984,74.494,74.494,0,0,1,6.909-5.784,84.759,84.759,0,0,1,7.605-4.84,45.468,45.468,0,0,1,4.54-1.456c.381,1.125.774,2.219,1.195,3.258a53.689,53.689,0,0,0,4.4,8.795,18.192,18.192,0,0,0,2.955,3.9q2.14,1.627,3.2,1.317t-.312-2.957a89.272,89.272,0,0,1-6.123-15.328c1.491-.2,3.112-.359,4.907-.482a51.676,51.676,0,0,1,10.251.44,45.133,45.133,0,0,0,6.973.626c.887-.079,1.11-.29.695-.626a20.336,20.336,0,0,0-3.643-1.509,48.394,48.394,0,0,0-15.216-1.886c-1.506.057-3.092.183-4.746.37-.112-.489-.23-.981-.328-1.462a57.466,57.466,0,0,1-1.134-16.537,46.135,46.135,0,0,1,1.227-7.2l10.611-.16c.525.026,1.051.074,1.573.132.663.263,1.327.506,1.993.713a29.291,29.291,0,0,0,5.142,1.132c.452.187.9.383,1.349.6a53.453,53.453,0,0,1,9.365,5.72,79.382,79.382,0,0,1,8.361,7.358q3.893,3.966,6.977,7.54t5.281,6.416q2.2,2.828,3.2,3.9c.671.71.9.671.691-.128s-.9-2.62-2.073-5.473a77.826,77.826,0,0,0-9.366-16.655,92.7,92.7,0,0,0-9.147-10.715,13.366,13.366,0,0,0,1.559-.965c1.292-.93,2.567-1.923,3.825-2.994s2.329-2.07,3.212-2.994a16.605,16.605,0,0,0,1.444-1.606,36.733,36.733,0,0,1,7.817-7.433,24.039,24.039,0,0,1,7.314-3.438,19.048,19.048,0,0,1,6.485-.606,23.284,23.284,0,0,1,5.431,1.106q1.255.429,2.3.886a43.1,43.1,0,0,1,3.118,10.1m-341.154-231.405a121.549,121.549,0,0,1,9.364-9.024q3.22-1.838,5.916-3.1a52.973,52.973,0,0,1,6.23-2.379c.145.049.285.1.431.145a258.061,258.061,0,0,0,31.517,7.959q1.226,1.484,2.383,3.182a30.226,30.226,0,0,1,2.576,4.7c-27.265.056-48.719.111-52.052.163l-7.915.115c.518-.6,1.037-1.193,1.552-1.756m135.832-78.161a29.72,29.72,0,0,0,.376-12.446c-.085-.454-.193-.889-.286-1.335a68.623,68.623,0,0,0,12.361-1.73,83.512,83.512,0,0,0,20.741-7.733,81.584,81.584,0,0,0,15.9-11.127,104.189,104.189,0,0,0,11.191-11.633c.364-.453.732-.917,1.1-1.392l61.023-.921a45,45,0,0,0-.871,5.031,47.871,47.871,0,0,0,.568,14.963c.434,2.109.925,4.093,1.46,5.982a51.167,51.167,0,0,0-5.118,1.394,57.806,57.806,0,0,0-8.676,3.707,54.851,54.851,0,0,0-8.866,5.849,46.513,46.513,0,0,0-9.618,10.371A57.311,57.311,0,0,0,2658,1430.9c-.556,1.445-1.021,2.87-1.442,4.285l-88.312-.292a114.525,114.525,0,0,0,4.308-14.163m-45.438-37.007a95.242,95.242,0,0,1-9.869-7.925c-.244-.221-.485-.464-.727-.691l24.537-.37a17.475,17.475,0,0,0,.631,3.314,49.36,49.36,0,0,0,3.459,8.109c1.531,2.982,3.37,6.167,5.492,9.535a96,96,0,0,1-23.524-11.973m43.157,15.245c-.239-.609-.477-1.219-.736-1.808a76.565,76.565,0,0,0-4.842-9.242q-2.577-4.145-4.082-6.787t-3.019-4.9c-.381-.571-.749-1.146-1.116-1.723l72.247-1.092c-1.423,1.752-2.878,3.393-4.375,4.9a70.386,70.386,0,0,1-13.7,10.938,62.719,62.719,0,0,1-14.2,6.413,76.239,76.239,0,0,1-26.172,3.3m167.313-61.689c.753-.217,1.445-.376,2.071-.5a7.868,7.868,0,0,1,1.321-.192q11.947-.5,19.424,3.147a29.107,29.107,0,0,1,10.313,8.165,48.144,48.144,0,0,0-6.957-2.506,43.254,43.254,0,0,0-12.973-1.663,30.223,30.223,0,0,0-10.862,2.276A21.459,21.459,0,0,0,2732,1351.6q-2.219,2.44-4.322,4.382t-3.77,3.269c-.863.69-1.813,1.41-2.811,2.146-.307-.181-.617-.351-.924-.527-.113-1.7-.2-2.961-.26-3.782-.075-.995-.126-1.755-.165-2.269s-.074-1.035-.11-1.557-.094-1.437-.165-2.769c-.054-.931-.107-2.18-.157-3.708a64.59,64.59,0,0,1,6.208-4.222,51.935,51.935,0,0,1,5.906-3.084c1.595-.671,2.472-1.046,2.641-1.127a4.372,4.372,0,0,1,1.381-.5c.671-.176,1.382-.36,2.138-.567m40.291,27.464a116.763,116.763,0,0,1,1.821,17.982,64.264,64.264,0,0,1-1.949,17.911,100.069,100.069,0,0,1-5.028,14.962,92.251,92.251,0,0,1-5.34,10.624q-2.515,4.149-3.02,4.907c-.333.5-.627.941-.877,1.317a4.863,4.863,0,0,1-1.009,1.07,11.582,11.582,0,0,1-1.568,1.007,15.846,15.846,0,0,1-2.58,1l-93.764-.31a29.688,29.688,0,0,1,1.163-3.557,48.908,48.908,0,0,1,5.408-9.995,51.635,51.635,0,0,1,6.918-7.983,74.744,74.744,0,0,1,6.909-5.785,85.115,85.115,0,0,1,7.605-4.84,45.785,45.785,0,0,1,4.54-1.456c.381,1.127.774,2.222,1.195,3.259a53.689,53.689,0,0,0,4.4,8.795,18.159,18.159,0,0,0,2.955,3.9q2.14,1.63,3.2,1.317t-.312-2.955a89.24,89.24,0,0,1-6.123-15.33c1.491-.195,3.112-.359,4.907-.479a51.567,51.567,0,0,1,10.251.439,45.463,45.463,0,0,0,6.973.628c.887-.082,1.11-.293.695-.628a20.418,20.418,0,0,0-3.643-1.51,48.465,48.465,0,0,0-15.216-1.887c-1.506.057-3.092.185-4.746.37-.112-.489-.23-.979-.328-1.462a57.46,57.46,0,0,1-1.134-16.537,46.069,46.069,0,0,1,1.227-7.2l10.611-.161c.525.026,1.049.074,1.573.132.663.263,1.327.5,1.993.711a29.42,29.42,0,0,0,5.142,1.134q.677.279,1.349.595a53.541,53.541,0,0,1,9.365,5.721,79.41,79.41,0,0,1,8.361,7.358q3.893,3.966,6.977,7.541t5.281,6.415q2.2,2.826,3.2,3.9c.671.71.9.67.691-.129s-.9-2.62-2.073-5.471a77.841,77.841,0,0,0-9.366-16.657,92.578,92.578,0,0,0-9.147-10.713,13.369,13.369,0,0,0,1.559-.966c1.292-.93,2.567-1.923,3.825-2.994s2.329-2.071,3.212-2.994a16.823,16.823,0,0,0,1.444-1.606,36.736,36.736,0,0,1,7.817-7.433,24.045,24.045,0,0,1,7.314-3.439,19.053,19.053,0,0,1,6.485-.607,23.428,23.428,0,0,1,5.431,1.107q1.255.43,2.3.887a43.2,43.2,0,0,1,3.116,10.1m-341.154-231.4a121.022,121.022,0,0,1,9.364-9.024q3.22-1.84,5.916-3.1a53.252,53.252,0,0,1,6.323-2.411,42.184,42.184,0,0,1,5.479-1.334q10.323,3.089,22.671,5.617a37.487,37.487,0,0,1,6.088,7.033,30.358,30.358,0,0,1,2.576,4.7c-27.265.056-48.719.11-52.052.161l-7.915.117c.518-.6,1.037-1.195,1.552-1.756m135.832-81.274a29.728,29.728,0,0,0,.376-12.447c-.085-.453-.193-.888-.286-1.334a68.741,68.741,0,0,0,12.361-1.731,83.464,83.464,0,0,0,20.741-7.733,81.526,81.526,0,0,0,15.9-11.127,104.187,104.187,0,0,0,11.191-11.631c.364-.454.732-.92,1.1-1.393l61.023-.921a45.07,45.07,0,0,0-.871,5.032,47.871,47.871,0,0,0,.568,14.963c.434,2.109.925,4.093,1.46,5.982a50.774,50.774,0,0,0-5.118,1.393,57.806,57.806,0,0,0-8.676,3.707,54.825,54.825,0,0,0-8.866,5.848,46.513,46.513,0,0,0-9.618,10.373,57.371,57.371,0,0,0-5.838,11.187c-.556,1.448-1.021,2.872-1.442,4.287l-88.312-.292a114.53,114.53,0,0,0,4.308-14.163m-45.438-37.008a95.2,95.2,0,0,1-9.869-7.926c-.244-.222-.483-.463-.727-.69l24.537-.37a17.509,17.509,0,0,0,.631,3.315,49.305,49.305,0,0,0,3.459,8.108c1.531,2.983,3.37,6.167,5.492,9.536a96,96,0,0,1-23.524-11.973m43.157,15.245c-.239-.609-.477-1.22-.736-1.807a76.682,76.682,0,0,0-4.842-9.243q-2.577-4.147-4.082-6.787t-3.019-4.906c-.381-.568-.749-1.145-1.116-1.721l72.247-1.091c-1.423,1.752-2.878,3.393-4.375,4.9a70.319,70.319,0,0,1-13.7,10.935,62.685,62.685,0,0,1-14.2,6.416,76.247,76.247,0,0,1-26.172,3.3m167.313-61.69c.753-.215,1.445-.375,2.071-.5a7.872,7.872,0,0,1,1.321-.192q11.947-.5,19.424,3.148a29.107,29.107,0,0,1,10.313,8.165,47.985,47.985,0,0,0-6.957-2.506,43.3,43.3,0,0,0-12.973-1.664,30.251,30.251,0,0,0-10.862,2.277,21.459,21.459,0,0,0-7.929,5.593q-2.219,2.44-4.322,4.382t-3.77,3.269c-.863.69-1.813,1.41-2.811,2.146-.307-.182-.617-.352-.924-.527q-.169-2.547-.26-3.783c-.075-.993-.126-1.755-.165-2.267s-.074-1.036-.11-1.559-.094-1.435-.165-2.768c-.054-.934-.107-2.18-.157-3.708a64.62,64.62,0,0,1,6.208-4.224,52.419,52.419,0,0,1,5.906-3.084c1.595-.67,2.472-1.046,2.641-1.125a4.369,4.369,0,0,1,1.381-.5c.671-.177,1.382-.361,2.138-.568m40.291,27.466a116.746,116.746,0,0,1,1.821,17.982,64.254,64.254,0,0,1-1.949,17.91,100.2,100.2,0,0,1-5.028,14.963,92.362,92.362,0,0,1-5.34,10.624q-2.515,4.145-3.02,4.9t-.877,1.318a4.865,4.865,0,0,1-1.009,1.071,11.6,11.6,0,0,1-1.568,1.006,15.854,15.854,0,0,1-2.58,1l-93.764-.31a29.787,29.787,0,0,1,1.163-3.558,48.936,48.936,0,0,1,5.408-9.993,51.58,51.58,0,0,1,6.918-7.984,74.706,74.706,0,0,1,6.909-5.784,84.759,84.759,0,0,1,7.605-4.84,45.468,45.468,0,0,1,4.54-1.456c.381,1.125.774,2.222,1.195,3.258a53.629,53.629,0,0,0,4.4,8.795,18.147,18.147,0,0,0,2.955,3.9q2.14,1.628,3.2,1.317t-.312-2.955a89.327,89.327,0,0,1-6.123-15.33c1.491-.2,3.112-.358,4.907-.479a51.458,51.458,0,0,1,10.251.438,45.157,45.157,0,0,0,6.973.627c.887-.079,1.11-.29.695-.627a20.442,20.442,0,0,0-3.643-1.509,48.429,48.429,0,0,0-15.216-1.887c-1.506.057-3.092.183-4.746.37-.112-.489-.23-.981-.328-1.462a57.465,57.465,0,0,1-1.134-16.537,46.114,46.114,0,0,1,1.227-7.2l10.611-.16c.525.025,1.051.072,1.573.131.663.263,1.327.506,1.993.713a29.4,29.4,0,0,0,5.142,1.132c.452.188.9.384,1.349.6a53.38,53.38,0,0,1,9.365,5.721,79.2,79.2,0,0,1,8.361,7.357q3.893,3.966,6.977,7.54t5.281,6.416q2.2,2.828,3.2,3.9c.671.711.9.671.691-.128s-.9-2.62-2.073-5.471a77.808,77.808,0,0,0-9.366-16.657,92.7,92.7,0,0,0-9.147-10.714,13.719,13.719,0,0,0,1.559-.964c1.292-.931,2.567-1.924,3.825-2.994s2.329-2.072,3.212-2.994a16.742,16.742,0,0,0,1.444-1.607,36.73,36.73,0,0,1,7.817-7.433,24.042,24.042,0,0,1,7.314-3.439,19.051,19.051,0,0,1,6.485-.606,23.284,23.284,0,0,1,5.431,1.106q1.255.431,2.3.886a43.172,43.172,0,0,1,3.116,10.1M2436.725,764.675a121.277,121.277,0,0,1,9.364-9.022c2.146-1.227,4.119-2.256,5.916-3.1a53.509,53.509,0,0,1,6.323-2.409,43.238,43.238,0,0,1,7.64-1.666,30.659,30.659,0,0,1,8.214.06,21.744,21.744,0,0,1,7.983,2.752,32.661,32.661,0,0,1,10.4,10.17,30.3,30.3,0,0,1,2.576,4.7c-27.265.056-48.719.11-52.052.161l-7.915.115c.518-.6,1.037-1.193,1.552-1.756m135.832-89.434a29.728,29.728,0,0,0,.376-12.447c-.085-.453-.193-.888-.286-1.334a68.73,68.73,0,0,0,12.361-1.731A83.514,83.514,0,0,0,2605.75,652a81.586,81.586,0,0,0,15.9-11.127,104.318,104.318,0,0,0,11.191-11.631c.364-.454.732-.92,1.1-1.393l61.023-.921a45.074,45.074,0,0,0-.871,5.032,47.874,47.874,0,0,0,.568,14.963c.434,2.109.925,4.092,1.46,5.982a51.165,51.165,0,0,0-5.118,1.392,57.687,57.687,0,0,0-8.676,3.708,54.643,54.643,0,0,0-8.866,5.848,46.509,46.509,0,0,0-9.618,10.373A57.287,57.287,0,0,0,2658,685.408c-.556,1.448-1.021,2.872-1.442,4.286l-88.312-.29a114.523,114.523,0,0,0,4.308-14.163m-45.438-37.009a95.017,95.017,0,0,1-9.869-7.925c-.244-.222-.483-.463-.727-.691l24.537-.371a17.5,17.5,0,0,0,.631,3.316,49.305,49.305,0,0,0,3.459,8.108c1.531,2.981,3.37,6.167,5.492,9.535a95.95,95.95,0,0,1-23.524-11.973m43.157,15.246c-.239-.609-.477-1.22-.736-1.807a76.7,76.7,0,0,0-4.842-9.245q-2.577-4.145-4.082-6.786t-3.019-4.906c-.381-.57-.749-1.146-1.116-1.721l72.247-1.091c-1.423,1.752-2.878,3.391-4.375,4.9a70.317,70.317,0,0,1-13.7,10.935,62.742,62.742,0,0,1-14.2,6.416,76.243,76.243,0,0,1-26.172,3.3m167.313-61.69c.753-.215,1.445-.375,2.071-.5a7.727,7.727,0,0,1,1.321-.192q11.947-.5,19.424,3.147a29.108,29.108,0,0,1,10.313,8.165,48.324,48.324,0,0,0-6.957-2.508,43.34,43.34,0,0,0-12.973-1.662,30.281,30.281,0,0,0-10.862,2.276,21.491,21.491,0,0,0-7.929,5.593q-2.219,2.442-4.322,4.383t-3.77,3.268c-.863.691-1.813,1.41-2.811,2.147-.307-.182-.617-.35-.924-.527-.113-1.7-.2-2.959-.26-3.782-.075-.993-.126-1.755-.165-2.27s-.074-1.035-.11-1.556-.094-1.438-.165-2.768c-.054-.934-.107-2.18-.157-3.71a64.869,64.869,0,0,1,6.208-4.222,51.716,51.716,0,0,1,5.906-3.084c1.595-.67,2.472-1.046,2.641-1.125a4.334,4.334,0,0,1,1.381-.5c.671-.176,1.382-.361,2.138-.568m40.291,27.466a116.712,116.712,0,0,1,1.821,17.981,64.244,64.244,0,0,1-1.949,17.91,100.087,100.087,0,0,1-5.028,14.963,92.382,92.382,0,0,1-5.34,10.626q-2.515,4.145-3.02,4.9t-.877,1.318a4.9,4.9,0,0,1-1.009,1.071,11.6,11.6,0,0,1-1.568,1.006,16.1,16.1,0,0,1-2.58,1l-93.764-.31a29.783,29.783,0,0,1,1.163-3.558,48.864,48.864,0,0,1,5.408-9.993,51.582,51.582,0,0,1,6.918-7.984,74.486,74.486,0,0,1,6.909-5.784,85.063,85.063,0,0,1,7.605-4.842,45.835,45.835,0,0,1,4.54-1.456c.381,1.127.774,2.22,1.195,3.258a53.649,53.649,0,0,0,4.4,8.8,18.147,18.147,0,0,0,2.955,3.9q2.14,1.628,3.2,1.317t-.312-2.955a89.329,89.329,0,0,1-6.123-15.33c1.491-.2,3.112-.358,4.907-.482a51.671,51.671,0,0,1,10.251.44,45.334,45.334,0,0,0,6.973.627c.887-.079,1.11-.29.695-.627a20.406,20.406,0,0,0-3.643-1.51,48.427,48.427,0,0,0-15.216-1.885c-1.506.057-3.092.183-4.746.37-.112-.489-.23-.981-.328-1.462a57.468,57.468,0,0,1-1.134-16.537,46.085,46.085,0,0,1,1.227-7.2l10.611-.161c.525.026,1.051.074,1.573.131.663.264,1.327.507,1.993.714a29.534,29.534,0,0,0,5.142,1.132c.452.187.9.383,1.349.6a53.449,53.449,0,0,1,9.365,5.719,79.548,79.548,0,0,1,8.361,7.359q3.893,3.964,6.977,7.54t5.281,6.416q2.2,2.828,3.2,3.9c.671.71.9.671.691-.129s-.9-2.619-2.073-5.471a77.833,77.833,0,0,0-9.366-16.655,92.706,92.706,0,0,0-9.147-10.714,13.554,13.554,0,0,0,1.559-.966c1.292-.929,2.567-1.923,3.825-2.994s2.329-2.072,3.212-3a16.73,16.73,0,0,0,1.444-1.6,36.725,36.725,0,0,1,7.817-7.433,24.008,24.008,0,0,1,7.314-3.439,19.016,19.016,0,0,1,6.485-.606,23.281,23.281,0,0,1,5.431,1.106q1.255.429,2.3.886a43.173,43.173,0,0,1,3.116,10.1M2436.725,387.849a121.522,121.522,0,0,1,9.364-9.025q3.22-1.838,5.916-3.1a53.51,53.51,0,0,1,6.323-2.408,43.238,43.238,0,0,1,7.64-1.666,30.711,30.711,0,0,1,8.214.058,21.8,21.8,0,0,1,7.983,2.752,32.637,32.637,0,0,1,10.4,10.171,30.347,30.347,0,0,1,2.576,4.7c-27.265.056-48.719.11-52.052.163l-7.915.115c.518-.6,1.037-1.193,1.552-1.756m125.965,76.984a8.631,8.631,0,0,1-2.64-1.253,7.785,7.785,0,0,1-2.013-2.015,1.834,1.834,0,0,1-.251-2.013,11.28,11.28,0,0,1,2.827-2.26q2.33-1.509,5.532-3.394c2.137-1.263,4.421-2.533,6.854-3.834s4.648-2.492,6.662-3.587,3.686-2.013,5.028-2.765c.965-.54,1.556-.886,1.784-1.041a2.284,2.284,0,0,0,.165.729,8.614,8.614,0,0,1,.376,2.326,7,7,0,0,1-.628,3.018,5.879,5.879,0,0,1-2.833,2.765,51.086,51.086,0,0,0-5.152,2.893q-3.02,1.882-5.848,3.835t-5.028,3.707a15.341,15.341,0,0,0-2.7,2.515,2.061,2.061,0,0,1-2.137.377m242.517,229.311a26.78,26.78,0,0,1-6.224-1.57,8.938,8.938,0,0,1-3.65-2.829q-1.438-1.886-.312-5.278a6.549,6.549,0,0,1,1.381-2.579,8.366,8.366,0,0,1,1.7-1.445,3.544,3.544,0,0,1,1.446-.567c.416-.04.624.019.624.188a17.9,17.9,0,0,0,1.006,6.16,34.311,34.311,0,0,0,2.077,4.717,21.937,21.937,0,0,0,1.756,2.827c.465.588.528.711.194.375M2562.69,841.659a8.6,8.6,0,0,1-2.64-1.253,7.8,7.8,0,0,1-2.013-2.013,1.834,1.834,0,0,1-.251-2.013,11.216,11.216,0,0,1,2.827-2.26q2.33-1.511,5.532-3.4c2.137-1.263,4.421-2.533,6.854-3.835s4.648-2.492,6.662-3.587,3.686-2.013,5.028-2.765c.965-.54,1.556-.886,1.784-1.041a2.277,2.277,0,0,0,.165.729,8.623,8.623,0,0,1,.376,2.326,7.013,7.013,0,0,1-.628,3.019,5.885,5.885,0,0,1-2.833,2.765,50.762,50.762,0,0,0-5.152,2.891q-3.02,1.882-5.848,3.834t-5.028,3.707a15.316,15.316,0,0,0-2.7,2.517,2.067,2.067,0,0,1-2.137.374m242.517,229.311a26.718,26.718,0,0,1-6.224-1.57,8.947,8.947,0,0,1-3.65-2.827q-1.438-1.886-.312-5.28a6.527,6.527,0,0,1,1.381-2.576,8.339,8.339,0,0,1,1.7-1.448,3.562,3.562,0,0,1,1.446-.567c.416-.04.624.021.624.188a17.9,17.9,0,0,0,1.006,6.16,34.317,34.317,0,0,0,2.077,4.717,22.084,22.084,0,0,0,1.756,2.829c.465.586.528.71.194.374M2562.69,1210.326a8.636,8.636,0,0,1-2.64-1.255,7.783,7.783,0,0,1-2.013-2.013,1.832,1.832,0,0,1-.251-2.012,11.242,11.242,0,0,1,2.827-2.262q2.33-1.511,5.532-3.4c2.137-1.261,4.421-2.531,6.854-3.835s4.648-2.492,6.662-3.587,3.686-2.012,5.028-2.763c.965-.541,1.556-.888,1.784-1.041a2.292,2.292,0,0,0,.165.729,8.621,8.621,0,0,1,.376,2.324,7.015,7.015,0,0,1-.628,3.02,5.884,5.884,0,0,1-2.833,2.763,51.276,51.276,0,0,0-5.152,2.891q-3.02,1.882-5.848,3.835t-5.028,3.707a15.376,15.376,0,0,0-2.7,2.517,2.07,2.07,0,0,1-2.137.375m242.517,229.31a26.886,26.886,0,0,1-6.224-1.567,8.951,8.951,0,0,1-3.65-2.829q-1.438-1.888-.312-5.281a6.537,6.537,0,0,1,1.381-2.576,8.327,8.327,0,0,1,1.7-1.446,3.547,3.547,0,0,1,1.446-.568c.416-.039.624.021.624.189a17.883,17.883,0,0,0,1.006,6.159,34.225,34.225,0,0,0,2.077,4.717,21.868,21.868,0,0,0,1.756,2.829c.465.586.528.71.194.374M2562.69,1575.877a8.635,8.635,0,0,1-2.64-1.253,7.785,7.785,0,0,1-2.013-2.015,1.832,1.832,0,0,1-.251-2.012,11.215,11.215,0,0,1,2.827-2.26q2.33-1.511,5.532-3.4c2.137-1.263,4.421-2.533,6.854-3.835s4.648-2.493,6.662-3.587,3.686-2.013,5.028-2.765c.965-.541,1.556-.887,1.784-1.041a2.285,2.285,0,0,0,.165.729,8.614,8.614,0,0,1,.376,2.326,7,7,0,0,1-.628,3.018,5.886,5.886,0,0,1-2.833,2.766,50.822,50.822,0,0,0-5.152,2.891q-3.02,1.882-5.848,3.835t-5.028,3.707a15.277,15.277,0,0,0-2.7,2.516,2.068,2.068,0,0,1-2.137.375m242.517,229.311a26.706,26.706,0,0,1-6.224-1.57,8.947,8.947,0,0,1-3.65-2.827q-1.438-1.886-.312-5.281a6.538,6.538,0,0,1,1.381-2.576,8.379,8.379,0,0,1,1.7-1.446,3.543,3.543,0,0,1,1.446-.567c.416-.04.624.02.624.188a17.9,17.9,0,0,0,1.006,6.16,34.311,34.311,0,0,0,2.077,4.717,22.066,22.066,0,0,0,1.756,2.829c.465.586.528.71.194.374m-308.137,53.2a61.49,61.49,0,0,0,7.605-1.446,108.155,108.155,0,0,0,10.624-3.27,84.268,84.268,0,0,0,12.5-5.78,99.305,99.305,0,0,0,13.2-8.928,79.2,79.2,0,0,0,12.629-12.761,89.143,89.143,0,0,0,5.847-8.276h94.607a73.358,73.358,0,0,0,.392,7.882,29.74,29.74,0,0,0,2.133,8.173,32.381,32.381,0,0,0,4.593,7.166,28.428,28.428,0,0,0,8.675,6.79,47.184,47.184,0,0,0,14.139,4.525q8.542,1.511,20.872.253,18.478-1.888,35.442-2.7,16.98-.819,30.675-1.13t23.07-.317q9.369,0,12.637-.124a43.237,43.237,0,0,1,7.165.376q3.9.5,7.35,1.07t5.846,1c1.591.3,2.469.315,2.644.064a23.851,23.851,0,0,1,1.695-1.949,24.526,24.526,0,0,0,3.082-4.463,38.084,38.084,0,0,0,2.948-6.977,28.615,28.615,0,0,0,1.2-9.491,31.045,31.045,0,0,0-2.012-10.373,52.607,52.607,0,0,0-4.842-9.619,88.783,88.783,0,0,0-6.534-8.988q-3.582-4.337-6.973-8.487a34.222,34.222,0,0,1-4.9-7.542,23.639,23.639,0,0,1-1.886-5.848,15.6,15.6,0,0,1,.12-5.217,40.96,40.96,0,0,0,.255-7.416c-.168-1.338-.5-1.97-1.007-1.886s-1.085.715-1.758,1.886-1.34,2.452-2.012,3.835-1.255,2.684-1.757,3.9-.8,1.906-.887,2.073a37.251,37.251,0,0,1-3.268,3.771q-3.019,3.272-6.909,8.048-3.907,4.776-7.8,10.37a58.424,58.424,0,0,0-6.032,10.689,16.505,16.505,0,0,0-1.509,8.986q.623,3.9,5.654,5.281,7.285,2.013,12.191.818a22.382,22.382,0,0,0,7.922-3.394,20.677,20.677,0,0,0,5.529-6.6,13.841,13.841,0,0,0,1.884,2.58q1.895,2.324,4.273,5.217,2.649,3.272,6.167,7.416c-3.778.085-7.166.125-10.184.125h-41.107q-2.011,0-6.726.192t-10.816.5q-6.1.317-12.883.631t-12.886.692q-6.1.377-10.808.628c-3.146.171-5.383.294-6.726.379q-1.511.125-5.528.25t-9.242-.192a87.356,87.356,0,0,1-10.936-1.381,37.349,37.349,0,0,1-10.44-3.519,22.075,22.075,0,0,1-7.723-6.538,13.514,13.514,0,0,1-.9-1.409h84.132a24.022,24.022,0,0,0,8.739-1.823,21.013,21.013,0,0,0,5.842-3.835,182.7,182.7,0,0,0,19.675-21.432,83.772,83.772,0,0,0,11.5-19.924,67.963,67.963,0,0,0,4.589-20.436,117.759,117.759,0,0,0-.943-22.942,35.031,35.031,0,0,0-5.718-15.082,42.166,42.166,0,0,0-11.5-11.44,49.2,49.2,0,0,0-15.654-6.855,54.1,54.1,0,0,0-18.1-1.382,59.984,59.984,0,0,0-18.856,4.963,57.508,57.508,0,0,0-10.308,5.911c-.041-1.286-.083-2.674-.134-4.182q-.22-6.931-.551-17.626t-.775-26.335a121.092,121.092,0,0,1,1-21.172,53.055,53.055,0,0,1,3.879-14.139,21.709,21.709,0,0,1,6.152-8.257,17.453,17.453,0,0,1,7.708-3.5,22.223,22.223,0,0,1,8.426.171,46.427,46.427,0,0,1,8.482,2.6,56.63,56.63,0,0,1,7.868,3.994l.11.068a39.489,39.489,0,0,1-.5,3.957,26.418,26.418,0,0,1-3.271,6.544,33.022,33.022,0,0,1-4.589,5.592,23.884,23.884,0,0,1-6.85,4.713,66.451,66.451,0,0,0-8.172,4.594,17.141,17.141,0,0,0-6.159,6.717q-2.007,4.026-.879,9.81t7.541,13.7a39.228,39.228,0,0,0,10.309,8.933,51.379,51.379,0,0,0,12.761,5.527,53.337,53.337,0,0,0,13.575,2.013,40.437,40.437,0,0,0,12.761-1.7,28.382,28.382,0,0,0,10.308-5.592,19.936,19.936,0,0,0,6.159-9.553,81,81,0,0,0,2.2-13.828q.69-8.173.75-17.1t-.311-17.726q-.377-8.8-1.006-15.97-.629-11.06-.879-18.6t-.315-12.637q-.06-5.083.064-7.982t.313-4.649c.126-1.176.25-2.077.378-2.7a10.747,10.747,0,0,0,.188-2.079,24.7,24.7,0,0,0-.124-4.146,19.183,19.183,0,0,0-4.717-10.562,17.344,17.344,0,0,0-6.222-4.274,29.5,29.5,0,0,0-10.813-2.333,43.289,43.289,0,0,0-9.806.943,53.087,53.087,0,0,0-8.106,2.452q-3.585,1.451-5.844,2.2a97.492,97.492,0,0,0-13.7,7.477q-7.8,4.972-16.531,11.312t-17.913,13.453q-9.174,7.1-17.849,13.892t-16.408,12.767q-7.73,5.964-13.639,10.111a18.631,18.631,0,0,0-1.131-3.266q-1.259-3.261-3.52-8.549t-5.407-11.943c-.738-1.564-1.51-3.133-2.3-4.7.948-.92,1.893-1.851,2.843-2.758a114.823,114.823,0,0,1,11.567-9.746,61.011,61.011,0,0,1,11.819-6.855,28.911,28.911,0,0,1,12.129-2.452,41.317,41.317,0,0,0,9.806-.439c2.009-.456,2.972-1.046,2.891-1.758s-1.05-1.462-2.891-2.26A28.78,28.78,0,0,0,2692.3,1554a81.783,81.783,0,0,0-10.875-.629,67.333,67.333,0,0,0-13.138,1.381,81.3,81.3,0,0,0-14.142,4.275,61.538,61.538,0,0,0-11.915,6.433c-1.056-1.706-2.114-3.407-3.211-5.067a72.676,72.676,0,0,0-8.423-10.68,86.183,86.183,0,0,0-13.763-11.7,129.036,129.036,0,0,0-13.512-8.108,91.607,91.607,0,0,0-10.939-4.842q-4.648-1.628-6.159-2.012a20.168,20.168,0,0,0-2.827-.5,2.61,2.61,0,0,0-1.7.192c-.251.207-.021.606.691,1.189a25.362,25.362,0,0,0,4.46,2.516,63.635,63.635,0,0,1,8.36,5.473,80.864,80.864,0,0,1,10.248,9.3,108,108,0,0,1,10.37,13.014,89.1,89.1,0,0,1,8.861,16.593c.966,2.347,1.9,4.645,2.812,6.917q-5.546,5.377-10.752,10.576-5.408,5.406-10.373,9.995a62.453,62.453,0,0,1-9.8,7.541,26.175,26.175,0,0,1-9.553,3.707,14.912,14.912,0,0,1-9.491-1.757q-3.271-1.763-3.581-4.586a10.9,10.9,0,0,1,1.38-6.159,30,30,0,0,1,5.028-6.855,69.506,69.506,0,0,1,7.481-6.79q3.391-2.636,6.662-5.025a65.141,65.141,0,0,0,5.718-4.656,29.02,29.02,0,0,0,3.9-4.275,6.541,6.541,0,0,0,1.445-3.769,20.241,20.241,0,0,0-2.26-9.245,21.484,21.484,0,0,0-5.532-6.662,31.047,31.047,0,0,0-7.48-4.393,52.553,52.553,0,0,0-8.044-2.644,41.629,41.629,0,0,0-7.292-1.135,29.762,29.762,0,0,0-5.215.064q-7.167,4.158-13.513,7.047t-10.812,5.215a23.862,23.862,0,0,0-6.538,4.586,4.365,4.365,0,0,0-.756,5.152q1.326,2.9,6.416,6.79a139.383,139.383,0,0,0,15.021,9.556,28.61,28.61,0,0,0-3.772,6.541,21.209,21.209,0,0,0-1.321,6.663,13.172,13.172,0,0,0,1.949,7.413,30.761,30.761,0,0,0,4.086,5.153,32.277,32.277,0,0,0,7.921,5.848,63.875,63.875,0,0,0,12.633,5.089,85,85,0,0,0,18.228,3.018,22.119,22.119,0,0,0,10.683-2.012,54.61,54.61,0,0,0,10.877-6.535,117.628,117.628,0,0,0,11-9.553c1.2-1.171,2.4-2.369,3.612-3.561q1.061,2.79,2,5.3,2.451,6.542,3.834,10.441t1.381,4.019a11.044,11.044,0,0,0,2.138,1.262q2.139,1.125,5.279,2.7t6.85,3.14c2.476,1.054,4.718,1.909,6.726,2.581s5.072-.042,9.179-2.141a132.787,132.787,0,0,0,14.394-8.8q8.234-5.656,17.849-13.078t19.488-15.147q9.866-7.727,19.418-14.835t17.6-12.133a73.343,73.343,0,0,1,13.955-7.1q5.908-2.071,8.67.193.259,14.08.5,26.147.125,5.149.251,10.367t.314,9.81q.188,4.591.317,8.173t.251,5.464q.252,2.516.628,6.726t.69,9.307q.317,5.091.251,10.809a100.026,100.026,0,0,1-.756,11.319,67.376,67.376,0,0,1-2.2,10.745,31.888,31.888,0,0,1-4.272,9.178,18.783,18.783,0,0,1-10.369,5.409,21.957,21.957,0,0,1-11.631-1.134,24.3,24.3,0,0,1-8.172-5.089,30.622,30.622,0,0,1-5.656-7.11,23.981,23.981,0,0,1-2.826-7.54,12.926,12.926,0,0,1,.188-6.408c.083-.168.251-.59.5-1.263a10.624,10.624,0,0,1,1.317-2.323,13.279,13.279,0,0,1,2.518-2.573,12.133,12.133,0,0,1,3.957-2.013,22.433,22.433,0,0,0,8.551-4.529,30.506,30.506,0,0,0,6.973-8.172,27.18,27.18,0,0,0,3.387-9.385q2.284,1.684,4.867,3.83,3.329,4.1,4.766,4.495c.961.253,1.2-.261.723-1.55a23.233,23.233,0,0,0-3.6-5.543,39.246,39.246,0,0,0-6.4-6.121,26.5,26.5,0,0,0-1.791-8.605,51.651,51.651,0,0,0-7.354-13.515,52.564,52.564,0,0,0-7.857-8.293,19.713,19.713,0,0,0-5.906-3.65q-2.265-.684-1.51.439a14.648,14.648,0,0,0,2.388,2.644q1.763,1.63,3.834,3.9a53.755,53.755,0,0,1,4.209,5.281,34.055,34.055,0,0,1,3.711,6.847,32.943,32.943,0,0,1,2.135,8.49c.044.363.057.742.087,1.11q-3.259-1.822-7.116-3.552a79.227,79.227,0,0,0-18.572-5.431,31.071,31.071,0,0,0-13.913.225,24.472,24.472,0,0,0-10.145,5.536,30.644,30.644,0,0,0-6.872,9.483,61.466,61.466,0,0,0-4.212,12.083,91.742,91.742,0,0,0-2.162,13.471q-.609,6.983-.61,13.582t.278,12.308q.275,5.708.61,9.815.333,5.431.774,11.362t.832,11.64q.39,5.716.666,10.92t.553,9.152c.011.16.021.328.03.492-1.891.018-4.575.058-8.079.117q-7.286.131-17.849.246-10.564.131-23.633.384l-7.491.143c.343-.732.671-1.441.966-2.092q1.377-3.078,2.891-6.413t2.387-5.785a15.378,15.378,0,0,0,.943-3.4q.06-.934-1.385.886a84.318,84.318,0,0,0-4.648,7.04c-1.533,2.49-3.493,5.782-5.864,9.848q-7.423.135-15.205.272-14.331.254-29.1.5t-28.724.5c-5.759.1-11.291.2-16.648.285-.134-.92-.243-1.858-.315-2.816-.129-1.717-.208-3.287-.255-4.714q-.046-1.58-.089-2.745c1.738.058,3.463.1,5.163.1q6.771,0,12.637-.286t10.075-.627q5.577-.339,11.669-.795t11.949-.854q5.869-.4,11.211-.682t9.4-.568q4.037-.288,8.71-.4a28.111,28.111,0,0,0,6.2-6.945,32.637,32.637,0,0,0,3.362-7.284,28.519,28.519,0,0,0,1.31-6.944,52.683,52.683,0,0,0,0-5.863,22.96,22.96,0,0,0-.571-4.1c-.269-1.024-.4-1.574-.4-1.651a8.727,8.727,0,0,0-1.649-3.359c-.955-1.328-1.974-2.637-3.073-3.929s-2.128-2.39-3.075-3.3a17.221,17.221,0,0,0-1.649-1.482,37.862,37.862,0,0,1-7.633-8.026,24.707,24.707,0,0,1-3.529-7.512,19.522,19.522,0,0,1-.623-6.659,23.965,23.965,0,0,1,1.137-5.577,25.249,25.249,0,0,1,1.823-4.214c.643-1.139,1.077-1.973,1.31-2.5a4.84,4.84,0,0,0,.222-.572,3.606,3.606,0,0,0,.232-1.022,2.235,2.235,0,0,0-.339-1.139,1.012,1.012,0,0,0-1.027-.51,3.569,3.569,0,0,0-1.766.966,13.113,13.113,0,0,0-2.445,3.186,57.154,57.154,0,0,0-6.6,14.744,44.526,44.526,0,0,0-1.706,13.321,31.061,31.061,0,0,0,2.337,11.155,22.04,22.04,0,0,0,5.744,8.141q2.5,2.28,4.5,4.438t3.356,3.871q1.367,1.709,2.85,3.758c-2.357.151-4.043.267-5.069.343s-1.8.129-2.33.171-1.064.077-1.6.111-1.476.1-2.843.171-3.355.154-5.974.228-6.3.192-11.045.343-10.777.34-18.1.568-16.334.5-27.039.795a124.346,124.346,0,0,1-21.736-1.022,54.6,54.6,0,0,1-14.517-3.982,22.307,22.307,0,0,1-8.479-6.32,17.919,17.919,0,0,1-3.586-7.914,22.785,22.785,0,0,1,.172-8.653,47.745,47.745,0,0,1,2.67-8.708,58.074,58.074,0,0,1,4.1-8.08q2.334-3.814,4.383-6.716t4.891-6.32q4.21-3.415,4.615-4.893c.26-.986-.267-1.234-1.592-.742a23.813,23.813,0,0,0-5.692,3.7,44.391,44.391,0,0,0-7.74,8.482,75.138,75.138,0,0,0-7.689,13.66,81.29,81.29,0,0,0-5.577,19.068,31.892,31.892,0,0,0,.231,14.288,25.1,25.1,0,0,0,5.687,10.416,31.4,31.4,0,0,0,9.736,7.056,62.9,62.9,0,0,0,12.4,4.326,94.492,94.492,0,0,0,13.829,2.222q3.735.325,7.358.478c-.463,1.217-1.113,3.239-1.937,6.063q-.69,2.332-1.3,4.347l-4.365.069q-12.377.179-21.812.31c-6.282.089-11.375.145-15.274.193H2503c-1.312-2.038-2.579-4.171-3.79-6.416A79.938,79.938,0,0,1,2492.8,1702a163.973,163.973,0,0,1-3.016-17.279q-1.009-8.5-1.259-17.287t.188-18.1q.444-9.309,1.323-19.867.377-3.776.75-6.471v-.013a175.1,175.1,0,0,1,4.592-17.178,222.9,222.9,0,0,1,12.294-29.641,163.959,163.959,0,0,0,8.846-21.43,160.191,160.191,0,0,0,4.825-18.1,99.391,99.391,0,0,0,1.9-14.528c.04-.928.072-1.819.1-2.682l278.707-2.58a31.1,31.1,0,0,1,11.917,3.047,63.334,63.334,0,0,1,11.1,6.777,93.952,93.952,0,0,1,9.9,8.718q4.614,4.7,8.268,8.936t6.256,7.6q2.367,3.047,3.562,4.365a12.567,12.567,0,0,0-3.1,3.855,5.52,5.52,0,0,0-.471,3.491,6.583,6.583,0,0,0,1.669,3.027,17.005,17.005,0,0,0,2.919,2.5c1.077.728,2.189,1.411,3.336,2.034a26.658,26.658,0,0,1,2.869,1.776c.1.072.2.132.306.2-.717,1.349-1.507,2.747-2.391,4.206a23.065,23.065,0,0,1-4.8,5.731,13.174,13.174,0,0,0-3.441,4.175,5.523,5.523,0,0,0-.471,3.491,6.569,6.569,0,0,0,1.669,3.027,16.941,16.941,0,0,0,2.919,2.5c1.077.729,2.189,1.411,3.336,2.034a27.1,27.1,0,0,1,2.869,1.777c.1.072.2.131.306.2-.717,1.348-1.507,2.747-2.391,4.205a23.036,23.036,0,0,1-4.8,5.731,13.187,13.187,0,0,0-3.441,4.174,5.523,5.523,0,0,0-.471,3.491,6.568,6.568,0,0,0,1.669,3.029,16.876,16.876,0,0,0,2.919,2.5q1.615,1.094,3.336,2.034a27.134,27.134,0,0,1,2.869,1.776c.1.074.2.133.306.2-.717,1.348-1.507,2.747-2.391,4.206a23.046,23.046,0,0,1-4.8,5.732,13.175,13.175,0,0,0-3.441,4.175,5.521,5.521,0,0,0-.471,3.491,6.584,6.584,0,0,0,1.669,3.027,17,17,0,0,0,2.919,2.5c1.077.728,2.189,1.412,3.336,2.034a27.884,27.884,0,0,1,2.694,1.653q-.88,1.6-1.911,3.305a23.066,23.066,0,0,1-4.8,5.732,13.174,13.174,0,0,0-3.441,4.174,5.523,5.523,0,0,0-.471,3.491,6.58,6.58,0,0,0,1.669,3.029,16.875,16.875,0,0,0,2.919,2.5c1.077.729,2.189,1.411,3.336,2.034a27.1,27.1,0,0,1,2.869,1.777c.1.074.2.132.306.2-.717,1.348-1.507,2.747-2.391,4.206a23.016,23.016,0,0,1-4.8,5.731,13.19,13.19,0,0,0-3.441,4.175,5.522,5.522,0,0,0-.471,3.491,6.582,6.582,0,0,0,1.669,3.029,17,17,0,0,0,2.919,2.5c1.077.728,2.189,1.412,3.336,2.034a26.907,26.907,0,0,1,2.869,1.774c.1.074.2.133.306.2-.717,1.348-1.507,2.748-2.391,4.207a23.063,23.063,0,0,1-4.8,5.731,13.178,13.178,0,0,0-3.441,4.175,5.522,5.522,0,0,0-.471,3.491,6.577,6.577,0,0,0,1.669,3.027,17,17,0,0,0,2.919,2.5c1.077.729,2.189,1.412,3.336,2.034a27.335,27.335,0,0,1,2.869,1.776c.1.072.2.132.306.2-.717,1.348-1.507,2.745-2.391,4.2a23.068,23.068,0,0,1-4.8,5.732,13.174,13.174,0,0,0-3.441,4.173,5.524,5.524,0,0,0-.471,3.491,6.574,6.574,0,0,0,1.669,3.029,16.858,16.858,0,0,0,2.919,2.5c1.077.729,2.189,1.411,3.336,2.034a27.14,27.14,0,0,1,2.869,1.777,11.457,11.457,0,0,0,2.815,1.51,2.568,2.568,0,0,0,1.616.153c.311-.139.4-.418.26-.828a3.59,3.59,0,0,0-1.354-1.464,2.339,2.339,0,0,1-1.2-2.4,7.659,7.659,0,0,1,1.515-3.022,32.39,32.39,0,0,1,3.073-3.491q1.826-1.83,3.5-3.7a25.417,25.417,0,0,0,2.763-3.7,5.247,5.247,0,0,0,.885-3.386,4.983,4.983,0,0,0-2.138-2.611c-1.288-.975-2.692-1.942-4.222-2.915-1.537-.946-3.23-1.892-5.065-2.836a1.989,1.989,0,0,1-.306-1.473,7.659,7.659,0,0,1,1.515-3.019,32.536,32.536,0,0,1,3.073-3.493q1.826-1.828,3.5-3.7a25.261,25.261,0,0,0,2.763-3.7,5.243,5.243,0,0,0,.885-3.384,4.972,4.972,0,0,0-2.138-2.611c-1.288-.975-2.692-1.942-4.222-2.917-1.537-.943-3.23-1.89-5.065-2.836a1.981,1.981,0,0,1-.306-1.47,7.666,7.666,0,0,1,1.515-3.022,32.519,32.519,0,0,1,3.073-3.491q1.826-1.83,3.5-3.7a25.337,25.337,0,0,0,2.763-3.7,5.246,5.246,0,0,0,.885-3.387,4.987,4.987,0,0,0-2.138-2.611c-1.288-.973-2.692-1.94-4.222-2.915-1.537-.945-3.23-1.889-5.065-2.836a1.983,1.983,0,0,1-.306-1.47,7.658,7.658,0,0,1,1.515-3.022,32.4,32.4,0,0,1,3.073-3.491q1.826-1.83,3.5-3.7a25.347,25.347,0,0,0,2.763-3.705,5.241,5.241,0,0,0,.885-3.384,4.981,4.981,0,0,0-2.138-2.611q-1.931-1.461-4.222-2.915c-1.623-1-3.419-2-5.374-2.994,0-.032,0-.06,0-.092a7.685,7.685,0,0,1,1.515-3.022,32.531,32.531,0,0,1,3.073-3.491q1.826-1.826,3.5-3.7a25.339,25.339,0,0,0,2.763-3.7,5.245,5.245,0,0,0,.885-3.386,4.983,4.983,0,0,0-2.138-2.611c-1.288-.974-2.692-1.941-4.222-2.916-1.537-.943-3.23-1.889-5.065-2.836a1.982,1.982,0,0,1-.306-1.47,7.666,7.666,0,0,1,1.515-3.022,32.531,32.531,0,0,1,3.073-3.491q1.826-1.83,3.5-3.7a25.267,25.267,0,0,0,2.763-3.7,5.243,5.243,0,0,0,.885-3.386,4.987,4.987,0,0,0-2.138-2.61q-1.931-1.459-4.222-2.915c-1.537-.946-3.23-1.891-5.065-2.836a1.987,1.987,0,0,1-.306-1.471,7.653,7.653,0,0,1,1.515-3.02,32.4,32.4,0,0,1,3.073-3.493q1.826-1.828,3.5-3.7a25.274,25.274,0,0,0,2.763-3.7,5.241,5.241,0,0,0,.885-3.385,4.973,4.973,0,0,0-2.138-2.61c-1.288-.975-2.692-1.942-4.222-2.915-1.537-.946-3.23-1.892-5.065-2.837a1.985,1.985,0,0,1-.306-1.471,7.662,7.662,0,0,1,1.515-3.02,32.419,32.419,0,0,1,3.073-3.493q1.826-1.826,3.5-3.7a25.409,25.409,0,0,0,2.763-3.7,5.245,5.245,0,0,0,.885-3.386,4.982,4.982,0,0,0-2.138-2.611c-1.288-.974-2.692-1.941-4.222-2.916q-2.716-1.669-6.046-3.339-1.461,3.022-3.546,6.467a23.4,23.4,0,0,1-4.344,5.314c-.39-1.157-1.12-3.031-2.2-5.643a92.2,92.2,0,0,0-11.1-19.737,107.08,107.08,0,0,0-15.116-16.754,78.462,78.462,0,0,0-16.985-11.7,37.658,37.658,0,0,0-16.828-4.392q-3.132,0-11.771.151t-21.148.293q-12.517.154-28,.454t-32.474.6q-16.98.3-34.482.6t-34.035.595c-6.115.111-59.877.213-108.206.307-.014-.054-.028-.1-.043-.163a29.7,29.7,0,0,0-2.242-5.4,44.586,44.586,0,0,0-4.2-6.54c.1-.035.185-.064.283-.1a83.958,83.958,0,0,0,12.5-5.78,98.986,98.986,0,0,0,13.2-8.927,79.207,79.207,0,0,0,12.629-12.762,88.8,88.8,0,0,0,5.847-8.276h94.607a73.386,73.386,0,0,0,.392,7.884,29.755,29.755,0,0,0,2.133,8.172,32.384,32.384,0,0,0,4.593,7.166,28.428,28.428,0,0,0,8.675,6.79,47.184,47.184,0,0,0,14.139,4.525q8.542,1.511,20.872.251,18.478-1.886,35.442-2.7,16.98-.821,30.675-1.13t23.07-.315q9.369,0,12.637-.125a43.387,43.387,0,0,1,7.165.375q3.9.5,7.35,1.071t5.846,1c1.591.3,2.469.315,2.644.065a23.718,23.718,0,0,1,1.695-1.951,24.5,24.5,0,0,0,3.082-4.46,38.116,38.116,0,0,0,2.948-6.98,28.608,28.608,0,0,0,1.2-9.489,31.053,31.053,0,0,0-2.012-10.374,52.653,52.653,0,0,0-4.842-9.618,88.77,88.77,0,0,0-6.534-8.988q-3.582-4.337-6.973-8.487a34.184,34.184,0,0,1-4.9-7.541,23.641,23.641,0,0,1-1.886-5.848,15.6,15.6,0,0,1,.12-5.217,40.96,40.96,0,0,0,.255-7.416c-.168-1.338-.5-1.97-1.007-1.887s-1.085.717-1.758,1.887-1.34,2.452-2.012,3.835-1.255,2.684-1.757,3.9-.8,1.9-.887,2.073a37.419,37.419,0,0,1-3.268,3.771q-3.019,3.272-6.909,8.048-3.907,4.774-7.8,10.37a58.42,58.42,0,0,0-6.032,10.688,16.508,16.508,0,0,0-1.509,8.986q.623,3.9,5.654,5.281,7.285,2.013,12.191.818a22.363,22.363,0,0,0,7.922-3.394,20.671,20.671,0,0,0,5.529-6.6,13.9,13.9,0,0,0,1.884,2.58q1.895,2.324,4.273,5.217,2.649,3.27,6.167,7.418c-3.778.083-7.166.124-10.184.124h-41.107q-2.011,0-6.726.192t-10.816.5q-6.1.317-12.883.631t-12.886.691q-6.1.379-10.808.628c-3.146.171-5.383.294-6.726.379q-1.511.125-5.528.251t-9.242-.192a87.391,87.391,0,0,1-10.936-1.382,37.306,37.306,0,0,1-10.44-3.519,22.089,22.089,0,0,1-7.723-6.537,13.7,13.7,0,0,1-.9-1.41h84.132a23.968,23.968,0,0,0,8.739-1.821,21.042,21.042,0,0,0,5.842-3.835,182.587,182.587,0,0,0,19.675-21.433,83.739,83.739,0,0,0,11.5-19.923,67.973,67.973,0,0,0,4.589-20.434,117.763,117.763,0,0,0-.943-22.943,35.019,35.019,0,0,0-5.718-15.083,42.147,42.147,0,0,0-11.5-11.44,49.167,49.167,0,0,0-15.654-6.854,53.981,53.981,0,0,0-18.1-1.382,59.974,59.974,0,0,0-18.856,4.96,57.6,57.6,0,0,0-10.308,5.913c-.041-1.286-.083-2.673-.134-4.182q-.22-6.931-.551-17.628t-.775-26.333a121.082,121.082,0,0,1,1-21.172,53.068,53.068,0,0,1,3.879-14.139,21.689,21.689,0,0,1,6.152-8.257,17.439,17.439,0,0,1,7.708-3.5,22.252,22.252,0,0,1,8.426.17,46.547,46.547,0,0,1,8.482,2.6,56.47,56.47,0,0,1,7.868,3.994c.038.022.072.044.11.068a39.6,39.6,0,0,1-.5,3.957,26.41,26.41,0,0,1-3.271,6.542,32.97,32.97,0,0,1-4.589,5.592,23.887,23.887,0,0,1-6.85,4.714,66.969,66.969,0,0,0-8.172,4.593,17.168,17.168,0,0,0-6.159,6.717q-2.007,4.026-.879,9.81t7.541,13.7a39.194,39.194,0,0,0,10.309,8.931,51.333,51.333,0,0,0,12.761,5.528,53.4,53.4,0,0,0,13.575,2.013,40.4,40.4,0,0,0,12.761-1.7,28.424,28.424,0,0,0,10.308-5.592,19.928,19.928,0,0,0,6.159-9.554,80.982,80.982,0,0,0,2.2-13.828q.69-8.171.75-17.1t-.311-17.726q-.377-8.795-1.006-15.969-.629-11.06-.879-18.6t-.315-12.639q-.06-5.081.064-7.98t.313-4.65c.126-1.173.25-2.077.378-2.7a10.746,10.746,0,0,0,.188-2.078,24.705,24.705,0,0,0-.124-4.146,19.172,19.172,0,0,0-4.717-10.56,17.327,17.327,0,0,0-6.222-4.274,29.5,29.5,0,0,0-10.813-2.333,43.373,43.373,0,0,0-9.806.943,53.252,53.252,0,0,0-8.106,2.452q-3.585,1.448-5.844,2.2a97.519,97.519,0,0,0-13.7,7.479q-7.8,4.972-16.531,11.312t-17.913,13.453q-9.174,7.107-17.849,13.891t-16.408,12.766q-7.73,5.966-13.639,10.114a18.6,18.6,0,0,0-1.131-3.269q-1.259-3.257-3.52-8.547-2.262-5.27-5.407-11.941c-.738-1.566-1.51-3.134-2.3-4.706.948-.918,1.893-1.848,2.843-2.756a115.053,115.053,0,0,1,11.567-9.748,60.931,60.931,0,0,1,11.819-6.852,28.844,28.844,0,0,1,12.129-2.453,41.464,41.464,0,0,0,9.806-.439c2.009-.456,2.972-1.046,2.891-1.757s-1.05-1.462-2.891-2.262a28.692,28.692,0,0,0-7.416-1.82,81.5,81.5,0,0,0-10.875-.632,67.347,67.347,0,0,0-13.138,1.382,81.556,81.556,0,0,0-14.142,4.274,61.479,61.479,0,0,0-11.915,6.434c-1.056-1.706-2.114-3.407-3.211-5.068a72.733,72.733,0,0,0-8.423-10.68,86.161,86.161,0,0,0-13.763-11.7,128.532,128.532,0,0,0-13.512-8.108,91.568,91.568,0,0,0-10.939-4.842q-4.648-1.63-6.159-2.013a20.4,20.4,0,0,0-2.827-.5,2.62,2.62,0,0,0-1.7.192c-.251.207-.021.607.691,1.191a25.418,25.418,0,0,0,4.46,2.517,63.413,63.413,0,0,1,8.36,5.47,80.913,80.913,0,0,1,10.248,9.3,107.88,107.88,0,0,1,10.37,13.014,89.082,89.082,0,0,1,8.861,16.591c.966,2.347,1.9,4.646,2.812,6.919q-5.546,5.375-10.752,10.576-5.408,5.4-10.373,9.993a62.379,62.379,0,0,1-9.8,7.541,26.208,26.208,0,0,1-9.553,3.708,14.921,14.921,0,0,1-9.491-1.758q-3.271-1.763-3.581-4.586a10.91,10.91,0,0,1,1.38-6.16,30.023,30.023,0,0,1,5.028-6.852,69.235,69.235,0,0,1,7.481-6.791q3.391-2.638,6.662-5.025a64.679,64.679,0,0,0,5.718-4.657,29.01,29.01,0,0,0,3.9-4.274,6.544,6.544,0,0,0,1.445-3.771,20.24,20.24,0,0,0-2.26-9.243,21.481,21.481,0,0,0-5.532-6.662,31.088,31.088,0,0,0-7.48-4.395,52.7,52.7,0,0,0-8.044-2.644,41.905,41.905,0,0,0-7.292-1.135,29.91,29.91,0,0,0-5.215.064q-7.167,4.158-13.513,7.047t-10.812,5.217a23.864,23.864,0,0,0-6.538,4.585,4.367,4.367,0,0,0-.756,5.153q1.326,2.9,6.416,6.79a139.206,139.206,0,0,0,15.021,9.554,28.65,28.65,0,0,0-3.772,6.542,21.2,21.2,0,0,0-1.321,6.662,13.179,13.179,0,0,0,1.949,7.415,30.76,30.76,0,0,0,4.086,5.152,32.216,32.216,0,0,0,7.921,5.848,63.713,63.713,0,0,0,12.633,5.089,84.978,84.978,0,0,0,18.228,3.021,22.154,22.154,0,0,0,10.683-2.013,54.613,54.613,0,0,0,10.877-6.534,118.1,118.1,0,0,0,11-9.556c1.2-1.168,2.4-2.368,3.612-3.56q1.061,2.791,2,5.3,2.451,6.542,3.834,10.441t1.381,4.018a11.067,11.067,0,0,0,2.138,1.263q2.139,1.127,5.279,2.7t6.85,3.139c2.476,1.056,4.718,1.91,6.726,2.581s5.072-.039,9.179-2.141a132.385,132.385,0,0,0,14.394-8.8q8.234-5.654,17.849-13.076t19.488-15.146q9.866-7.73,19.418-14.835t17.6-12.134a73.325,73.325,0,0,1,13.955-7.1q5.908-2.073,8.67.192.259,14.079.5,26.147.125,5.152.251,10.369t.314,9.81q.188,4.589.317,8.173t.251,5.463q.252,2.518.628,6.727t.69,9.307q.317,5.091.251,10.808a99.98,99.98,0,0,1-.756,11.319,67.391,67.391,0,0,1-2.2,10.746,31.888,31.888,0,0,1-4.272,9.178,18.784,18.784,0,0,1-10.369,5.409,21.974,21.974,0,0,1-11.631-1.134,24.319,24.319,0,0,1-8.172-5.089,30.706,30.706,0,0,1-5.656-7.109,24.013,24.013,0,0,1-2.826-7.541,12.932,12.932,0,0,1,.188-6.409c.083-.167.251-.59.5-1.26a10.6,10.6,0,0,1,1.317-2.326,13.353,13.353,0,0,1,2.518-2.572,12.137,12.137,0,0,1,3.957-2.015,22.392,22.392,0,0,0,8.551-4.529,30.5,30.5,0,0,0,6.973-8.171,27.177,27.177,0,0,0,3.387-9.385q2.284,1.684,4.867,3.83,3.329,4.1,4.766,4.495t.723-1.55a23.232,23.232,0,0,0-3.6-5.545,39.3,39.3,0,0,0-6.4-6.12,26.47,26.47,0,0,0-1.791-8.6,51.62,51.62,0,0,0-7.354-13.517,52.621,52.621,0,0,0-7.857-8.293,19.751,19.751,0,0,0-5.906-3.651q-2.265-.684-1.51.44a14.648,14.648,0,0,0,2.388,2.644q1.763,1.63,3.834,3.9a53.857,53.857,0,0,1,4.209,5.279,34.028,34.028,0,0,1,3.711,6.848,32.926,32.926,0,0,1,2.135,8.49c.044.363.057.74.087,1.109q-3.259-1.82-7.116-3.551a79.162,79.162,0,0,0-18.572-5.432,31.087,31.087,0,0,0-13.913.226,24.472,24.472,0,0,0-10.145,5.537,30.629,30.629,0,0,0-6.872,9.484,61.452,61.452,0,0,0-4.212,12.082,91.8,91.8,0,0,0-2.162,13.471q-.609,6.985-.61,13.583t.278,12.307q.275,5.708.61,9.816.333,5.431.774,11.363t.832,11.638q.39,5.716.666,10.92t.553,9.153c.011.16.021.328.03.49-1.891.018-4.575.058-8.079.117q-7.286.131-17.849.247-10.564.131-23.633.383c-2.46.047-4.964.1-7.491.142.343-.732.671-1.439.966-2.091q1.377-3.078,2.891-6.415t2.387-5.784a15.377,15.377,0,0,0,.943-3.4q.06-.934-1.385.886a83.959,83.959,0,0,0-4.648,7.038c-1.533,2.491-3.493,5.784-5.864,9.848q-7.423.137-15.205.274-14.331.252-29.1.5t-28.724.5c-5.759.1-11.291.2-16.648.285-.134-.921-.243-1.856-.315-2.816-.129-1.717-.208-3.287-.255-4.713-.031-1.056-.06-1.969-.089-2.747,1.738.058,3.463.1,5.163.1q6.771,0,12.637-.285t10.075-.625q5.577-.342,11.669-.8t11.949-.853q5.869-.4,11.211-.684t9.4-.568q4.037-.288,8.71-.4a28.082,28.082,0,0,0,6.2-6.944,32.667,32.667,0,0,0,3.362-7.284,28.519,28.519,0,0,0,1.31-6.944,52.68,52.68,0,0,0,0-5.863,23,23,0,0,0-.571-4.1c-.269-1.024-.4-1.573-.4-1.649a8.739,8.739,0,0,0-1.649-3.361c-.955-1.327-1.974-2.637-3.073-3.926s-2.128-2.393-3.075-3.3a17.1,17.1,0,0,0-1.649-1.481,37.831,37.831,0,0,1-7.633-8.028,24.689,24.689,0,0,1-3.529-7.512,19.518,19.518,0,0,1-.623-6.659,23.994,23.994,0,0,1,1.137-5.577,25.356,25.356,0,0,1,1.823-4.214c.643-1.139,1.077-1.971,1.31-2.5a4.719,4.719,0,0,0,.222-.571,3.621,3.621,0,0,0,.232-1.024,2.231,2.231,0,0,0-.339-1.139,1.009,1.009,0,0,0-1.027-.51,3.559,3.559,0,0,0-1.766.965,13.112,13.112,0,0,0-2.445,3.186,57.148,57.148,0,0,0-6.6,14.742,44.535,44.535,0,0,0-1.706,13.322,31.075,31.075,0,0,0,2.337,11.155,22.045,22.045,0,0,0,5.744,8.14q2.5,2.28,4.5,4.439t3.356,3.869q1.367,1.711,2.85,3.758c-2.357.153-4.043.268-5.069.343s-1.8.132-2.33.172-1.064.075-1.6.111-1.476.1-2.843.17-3.355.156-5.974.228-6.3.192-11.045.345-10.777.339-18.1.567-16.334.5-27.039.8a123.949,123.949,0,0,1-21.736-1.024,54.558,54.558,0,0,1-14.517-3.982,22.3,22.3,0,0,1-8.479-6.319,17.909,17.909,0,0,1-3.586-7.915,22.77,22.77,0,0,1,.172-8.65,47.772,47.772,0,0,1,2.67-8.711,58.147,58.147,0,0,1,4.1-8.08q2.334-3.814,4.383-6.716t4.891-6.319q4.21-3.418,4.615-4.895c.26-.986-.267-1.232-1.592-.74a23.8,23.8,0,0,0-5.692,3.7,44.379,44.379,0,0,0-7.74,8.48,75.073,75.073,0,0,0-7.689,13.663,81.236,81.236,0,0,0-5.577,19.067,31.885,31.885,0,0,0,.231,14.286,25.1,25.1,0,0,0,5.687,10.417,31.425,31.425,0,0,0,9.736,7.056,63.086,63.086,0,0,0,12.4,4.326,94.46,94.46,0,0,0,13.829,2.22q3.735.325,7.358.479c-.463,1.217-1.113,3.237-1.937,6.062q-.69,2.332-1.3,4.347c-1.464.024-2.935.048-4.365.069q-12.377.179-21.812.311t-15.274.192H2503c-1.312-2.038-2.579-4.169-3.79-6.416a79.861,79.861,0,0,1-6.409-16.033,164.044,164.044,0,0,1-3.016-17.279q-1.009-8.494-1.259-17.287t.188-18.1q.444-9.311,1.323-19.869.377-3.774.75-6.47v-.012a174.981,174.981,0,0,1,4.592-17.176,222.76,222.76,0,0,1,12.294-29.644,164.024,164.024,0,0,0,8.846-21.428,160.3,160.3,0,0,0,4.825-18.1,99.387,99.387,0,0,0,1.9-14.53c.04-.928.072-1.817.1-2.681l278.707-2.58a31.121,31.121,0,0,1,11.917,3.047,63.335,63.335,0,0,1,11.1,6.779,93.634,93.634,0,0,1,9.9,8.718q4.614,4.7,8.268,8.935t6.256,7.6q2.367,3.045,3.562,4.365a12.565,12.565,0,0,0-3.1,3.854,5.523,5.523,0,0,0-.471,3.491,6.587,6.587,0,0,0,1.669,3.029,16.927,16.927,0,0,0,2.919,2.5c1.077.729,2.189,1.412,3.336,2.034a27.1,27.1,0,0,1,2.869,1.777c.1.072.2.131.306.2-.717,1.348-1.507,2.745-2.391,4.205a23.06,23.06,0,0,1-4.8,5.731,13.189,13.189,0,0,0-3.441,4.174,5.526,5.526,0,0,0-.471,3.493,6.577,6.577,0,0,0,1.669,3.027,16.94,16.94,0,0,0,2.919,2.5c1.077.728,2.189,1.412,3.336,2.035a26.691,26.691,0,0,1,2.869,1.774c.1.074.2.132.306.2-.717,1.348-1.507,2.748-2.391,4.207a23.027,23.027,0,0,1-4.8,5.73,13.193,13.193,0,0,0-3.441,4.175,5.525,5.525,0,0,0-.471,3.493,6.576,6.576,0,0,0,1.669,3.027,16.935,16.935,0,0,0,2.919,2.5c1.077.729,2.189,1.412,3.336,2.034a27.116,27.116,0,0,1,2.869,1.775c.1.072.2.132.306.2-.717,1.349-1.507,2.747-2.391,4.205a23.065,23.065,0,0,1-4.8,5.732,13.175,13.175,0,0,0-3.441,4.174,5.523,5.523,0,0,0-.471,3.491,6.581,6.581,0,0,0,1.669,3.029,16.933,16.933,0,0,0,2.919,2.5c1.077.729,2.189,1.411,3.336,2.034a27.868,27.868,0,0,1,2.694,1.655q-.88,1.6-1.911,3.307a23.077,23.077,0,0,1-4.8,5.73,13.179,13.179,0,0,0-3.441,4.175,5.522,5.522,0,0,0-.471,3.491,6.57,6.57,0,0,0,1.669,3.027,16.94,16.94,0,0,0,2.919,2.5c1.077.728,2.189,1.412,3.336,2.035a26.446,26.446,0,0,1,2.869,1.776c.1.072.2.131.306.2-.717,1.349-1.507,2.748-2.391,4.207a23.1,23.1,0,0,1-4.8,5.732,13.157,13.157,0,0,0-3.441,4.172,5.527,5.527,0,0,0-.471,3.493,6.589,6.589,0,0,0,1.669,3.029,16.938,16.938,0,0,0,2.919,2.5c1.077.729,2.189,1.411,3.336,2.034a27.115,27.115,0,0,1,2.869,1.776c.1.074.2.133.306.2-.717,1.349-1.507,2.747-2.391,4.205a23.042,23.042,0,0,1-4.8,5.732,13.19,13.19,0,0,0-3.441,4.174,5.522,5.522,0,0,0-.471,3.491,6.58,6.58,0,0,0,1.669,3.029,17,17,0,0,0,2.919,2.5c1.077.728,2.189,1.411,3.336,2.034a26.894,26.894,0,0,1,2.869,1.776c.1.072.2.132.306.2-.717,1.348-1.507,2.748-2.391,4.207a23.079,23.079,0,0,1-4.8,5.729,13.178,13.178,0,0,0-3.441,4.175,5.522,5.522,0,0,0-.471,3.491,6.569,6.569,0,0,0,1.669,3.027,16.931,16.931,0,0,0,2.919,2.5c1.077.729,2.189,1.412,3.336,2.035a26.876,26.876,0,0,1,2.869,1.775,11.5,11.5,0,0,0,2.815,1.51,2.555,2.555,0,0,0,1.616.151c.311-.138.4-.417.26-.827a3.582,3.582,0,0,0-1.354-1.466,2.338,2.338,0,0,1-1.2-2.4,7.667,7.667,0,0,1,1.515-3.022,32.649,32.649,0,0,1,3.073-3.491q1.826-1.828,3.5-3.7a25.416,25.416,0,0,0,2.763-3.7,5.248,5.248,0,0,0,.885-3.387,4.976,4.976,0,0,0-2.138-2.609q-1.931-1.461-4.222-2.916c-1.537-.945-3.23-1.889-5.065-2.836a1.984,1.984,0,0,1-.306-1.47,7.658,7.658,0,0,1,1.515-3.022,32.4,32.4,0,0,1,3.073-3.491q1.826-1.83,3.5-3.7a25.411,25.411,0,0,0,2.763-3.7,5.243,5.243,0,0,0,.885-3.386,4.981,4.981,0,0,0-2.138-2.611c-1.288-.974-2.692-1.941-4.222-2.915-1.537-.946-3.23-1.891-5.065-2.836a1.986,1.986,0,0,1-.306-1.471,7.667,7.667,0,0,1,1.515-3.022,32.53,32.53,0,0,1,3.073-3.491q1.826-1.83,3.5-3.7a25.274,25.274,0,0,0,2.763-3.7,5.243,5.243,0,0,0,.885-3.385,4.985,4.985,0,0,0-2.138-2.612c-1.288-.974-2.692-1.941-4.222-2.915-1.537-.945-3.23-1.891-5.065-2.837a1.982,1.982,0,0,1-.306-1.47,7.645,7.645,0,0,1,1.515-3.02,32.43,32.43,0,0,1,3.073-3.493q1.826-1.828,3.5-3.7a25.33,25.33,0,0,0,2.763-3.7,5.249,5.249,0,0,0,.885-3.387,4.987,4.987,0,0,0-2.138-2.61q-1.931-1.459-4.222-2.915c-1.623-1-3.419-2-5.374-2.994,0-.031,0-.06,0-.09a7.662,7.662,0,0,1,1.515-3.021,32.548,32.548,0,0,1,3.073-3.493q1.826-1.828,3.5-3.7a25.347,25.347,0,0,0,2.763-3.705,5.241,5.241,0,0,0,.885-3.384,4.983,4.983,0,0,0-2.138-2.611c-1.288-.975-2.692-1.942-4.222-2.915-1.537-.946-3.23-1.892-5.065-2.836a1.989,1.989,0,0,1-.306-1.473,7.663,7.663,0,0,1,1.515-3.02,32.407,32.407,0,0,1,3.073-3.493q1.826-1.828,3.5-3.7a25.261,25.261,0,0,0,2.763-3.7,5.245,5.245,0,0,0,.885-3.386,4.977,4.977,0,0,0-2.138-2.61c-1.288-.974-2.692-1.941-4.222-2.916-1.537-.943-3.23-1.89-5.065-2.836a1.983,1.983,0,0,1-.306-1.47,7.659,7.659,0,0,1,1.515-3.022,32.542,32.542,0,0,1,3.073-3.491q1.826-1.83,3.5-3.7a25.409,25.409,0,0,0,2.763-3.7,5.249,5.249,0,0,0,.885-3.387,4.982,4.982,0,0,0-2.138-2.61q-1.931-1.459-4.222-2.915c-1.537-.946-3.23-1.889-5.065-2.836a1.985,1.985,0,0,1-.306-1.47,7.658,7.658,0,0,1,1.515-3.022,32.4,32.4,0,0,1,3.073-3.491q1.826-1.83,3.5-3.7a25.347,25.347,0,0,0,2.763-3.705,5.241,5.241,0,0,0,.885-3.385,4.978,4.978,0,0,0-2.138-2.61c-1.288-.975-2.692-1.942-4.222-2.915q-2.716-1.671-6.046-3.341-1.461,3.022-3.546,6.467a23.368,23.368,0,0,1-4.344,5.314c-.39-1.157-1.12-3.031-2.2-5.643a92.219,92.219,0,0,0-11.1-19.735,107.027,107.027,0,0,0-15.116-16.755,78.415,78.415,0,0,0-16.985-11.7,37.678,37.678,0,0,0-16.828-4.393c-2.088,0-6.006.058-11.771.151s-12.807.2-21.148.295-17.677.256-28,.454-21.154.4-32.474.6-22.81.4-34.482.6-23.013.4-34.035.6c-6.115.11-59.877.213-108.206.306-.014-.054-.028-.1-.043-.161a29.7,29.7,0,0,0-2.242-5.4,45.387,45.387,0,0,0-4.6-7.066q-.744-.965-1.6-1.9c.746-.253,1.5-.508,2.275-.788a84.243,84.243,0,0,0,12.5-5.78,99.292,99.292,0,0,0,13.2-8.928,79.147,79.147,0,0,0,12.629-12.761,88.98,88.98,0,0,0,5.847-8.276h94.607a73.425,73.425,0,0,0,.392,7.884,29.742,29.742,0,0,0,2.133,8.171,32.384,32.384,0,0,0,4.593,7.166,28.385,28.385,0,0,0,8.675,6.79,47.146,47.146,0,0,0,14.139,4.525q8.542,1.511,20.872.253,18.478-1.888,35.442-2.7,16.98-.819,30.675-1.13t23.07-.317q9.369,0,12.637-.124a43.264,43.264,0,0,1,7.165.376q3.9.5,7.35,1.071t5.846,1c1.591.3,2.469.315,2.644.064a24.1,24.1,0,0,1,1.695-1.949,24.523,24.523,0,0,0,3.082-4.463,38.079,38.079,0,0,0,2.948-6.977,28.611,28.611,0,0,0,1.2-9.489,31.047,31.047,0,0,0-2.012-10.374,52.606,52.606,0,0,0-4.842-9.618,88.783,88.783,0,0,0-6.534-8.988q-3.582-4.337-6.973-8.487a34.226,34.226,0,0,1-4.9-7.541,23.642,23.642,0,0,1-1.886-5.848,15.6,15.6,0,0,1,.12-5.217,40.96,40.96,0,0,0,.255-7.416c-.168-1.338-.5-1.97-1.007-1.887s-1.085.715-1.758,1.887-1.34,2.452-2.012,3.835-1.255,2.684-1.757,3.9-.8,1.906-.887,2.074a37.444,37.444,0,0,1-3.268,3.771q-3.019,3.27-6.909,8.047-3.907,4.776-7.8,10.37a58.428,58.428,0,0,0-6.032,10.689,16.506,16.506,0,0,0-1.509,8.986q.623,3.9,5.654,5.281,7.285,2.013,12.191.818a22.407,22.407,0,0,0,7.922-3.394,20.692,20.692,0,0,0,5.529-6.6,13.818,13.818,0,0,0,1.884,2.581q1.895,2.324,4.273,5.216,2.649,3.272,6.167,7.416c-3.778.086-7.166.125-10.184.125h-41.107q-2.011,0-6.726.192t-10.816.5q-6.1.315-12.883.629t-12.886.692q-6.1.377-10.808.628c-3.146.171-5.383.295-6.726.379q-1.511.125-5.528.25t-9.242-.192a87.356,87.356,0,0,1-10.936-1.381,37.353,37.353,0,0,1-10.44-3.519,22.078,22.078,0,0,1-7.723-6.538,13.671,13.671,0,0,1-.9-1.409h84.132a23.992,23.992,0,0,0,8.739-1.823,21.036,21.036,0,0,0,5.842-3.833,182.82,182.82,0,0,0,19.675-21.433,83.794,83.794,0,0,0,11.5-19.923,67.971,67.971,0,0,0,4.589-20.437,117.757,117.757,0,0,0-.943-22.942,35.031,35.031,0,0,0-5.718-15.083,42.168,42.168,0,0,0-11.5-11.44,49.2,49.2,0,0,0-15.654-6.855,54.054,54.054,0,0,0-18.1-1.381,60.01,60.01,0,0,0-18.856,4.961,57.494,57.494,0,0,0-10.308,5.912c-.041-1.287-.083-2.673-.134-4.181q-.22-6.933-.551-17.628t-.775-26.335a121.092,121.092,0,0,1,1-21.172,53.069,53.069,0,0,1,3.879-14.139,21.694,21.694,0,0,1,6.152-8.255,17.422,17.422,0,0,1,7.708-3.5,22.194,22.194,0,0,1,8.426.169,46.446,46.446,0,0,1,8.482,2.6,56.617,56.617,0,0,1,7.868,3.994l.11.068a39.495,39.495,0,0,1-.5,3.957,26.416,26.416,0,0,1-3.271,6.544,33.022,33.022,0,0,1-4.589,5.592,23.879,23.879,0,0,1-6.85,4.713,66.452,66.452,0,0,0-8.172,4.594,17.149,17.149,0,0,0-6.159,6.717q-2.007,4.026-.879,9.81t7.541,13.7a39.228,39.228,0,0,0,10.309,8.933,51.442,51.442,0,0,0,12.761,5.528,53.394,53.394,0,0,0,13.575,2.012,40.441,40.441,0,0,0,12.761-1.7,28.423,28.423,0,0,0,10.308-5.592,19.94,19.94,0,0,0,6.159-9.554,80.98,80.98,0,0,0,2.2-13.828q.69-8.171.75-17.1t-.311-17.726q-.377-8.8-1.006-15.97-.629-11.058-.879-18.6t-.315-12.637q-.06-5.083.064-7.982t.313-4.649c.126-1.175.25-2.077.378-2.7a10.745,10.745,0,0,0,.188-2.078,24.7,24.7,0,0,0-.124-4.146,19.173,19.173,0,0,0-4.717-10.56,17.329,17.329,0,0,0-6.222-4.275,29.53,29.53,0,0,0-10.813-2.333,43.38,43.38,0,0,0-9.806.943,53.082,53.082,0,0,0-8.106,2.454q-3.585,1.448-5.844,2.2a97.645,97.645,0,0,0-13.7,7.477q-7.8,4.972-16.531,11.312T2711.8,839.567q-9.174,7.1-17.849,13.892t-16.408,12.767q-7.73,5.966-13.639,10.112a18.634,18.634,0,0,0-1.131-3.266q-1.259-3.257-3.52-8.547-2.262-5.275-5.407-11.944c-.738-1.563-1.51-3.133-2.3-4.7.948-.92,1.893-1.851,2.843-2.756a114.691,114.691,0,0,1,11.567-9.748,61.09,61.09,0,0,1,11.819-6.855,28.91,28.91,0,0,1,12.129-2.452,41.312,41.312,0,0,0,9.806-.439c2.009-.454,2.972-1.046,2.891-1.758s-1.05-1.462-2.891-2.26a28.684,28.684,0,0,0-7.416-1.82,81.26,81.26,0,0,0-10.875-.632,67.337,67.337,0,0,0-13.138,1.381,81.427,81.427,0,0,0-14.142,4.275,61.544,61.544,0,0,0-11.915,6.433c-1.056-1.706-2.114-3.407-3.211-5.067a72.738,72.738,0,0,0-8.423-10.68,86.25,86.25,0,0,0-13.763-11.7,128.753,128.753,0,0,0-13.512-8.107,91.633,91.633,0,0,0-10.939-4.843q-4.648-1.628-6.159-2.012a20.15,20.15,0,0,0-2.827-.5,2.619,2.619,0,0,0-1.7.192c-.251.207-.021.606.691,1.191a25.283,25.283,0,0,0,4.46,2.515,63.618,63.618,0,0,1,8.36,5.473,80.878,80.878,0,0,1,10.248,9.3,108.107,108.107,0,0,1,10.37,13.014,89.1,89.1,0,0,1,8.861,16.593c.966,2.347,1.9,4.645,2.812,6.919q-5.546,5.375-10.752,10.576-5.408,5.4-10.373,9.993a62.457,62.457,0,0,1-9.8,7.541,26.177,26.177,0,0,1-9.553,3.707,14.913,14.913,0,0,1-9.491-1.757q-3.271-1.761-3.581-4.586a10.9,10.9,0,0,1,1.38-6.159,30.032,30.032,0,0,1,5.028-6.855,69.493,69.493,0,0,1,7.481-6.79q3.391-2.636,6.662-5.024a65.184,65.184,0,0,0,5.718-4.658,28.946,28.946,0,0,0,3.9-4.274,6.541,6.541,0,0,0,1.445-3.769,20.246,20.246,0,0,0-2.26-9.245,21.516,21.516,0,0,0-5.532-6.662,31.087,31.087,0,0,0-7.48-4.393,52.541,52.541,0,0,0-8.044-2.644,41.64,41.64,0,0,0-7.292-1.135,29.769,29.769,0,0,0-5.215.064q-7.167,4.158-13.513,7.047t-10.812,5.216a23.862,23.862,0,0,0-6.538,4.586,4.365,4.365,0,0,0-.756,5.152q1.326,2.9,6.416,6.79a139.166,139.166,0,0,0,15.021,9.556,28.613,28.613,0,0,0-3.772,6.541,21.217,21.217,0,0,0-1.321,6.663,13.172,13.172,0,0,0,1.949,7.413,30.766,30.766,0,0,0,4.086,5.153,32.282,32.282,0,0,0,7.921,5.848,63.886,63.886,0,0,0,12.633,5.089,85.07,85.07,0,0,0,18.228,3.019,22.134,22.134,0,0,0,10.683-2.013,54.617,54.617,0,0,0,10.877-6.535,117.616,117.616,0,0,0,11-9.553c1.2-1.168,2.4-2.369,3.612-3.56q1.061,2.788,2,5.3,2.451,6.542,3.834,10.441t1.381,4.019a11.033,11.033,0,0,0,2.138,1.261q2.139,1.125,5.279,2.7t6.85,3.14c2.476,1.056,4.718,1.91,6.726,2.581s5.072-.04,9.179-2.141a132.6,132.6,0,0,0,14.394-8.8q8.234-5.656,17.849-13.078t19.488-15.145q9.866-7.73,19.418-14.837t17.6-12.133a73.238,73.238,0,0,1,13.955-7.1q5.908-2.074,8.67.192.259,14.079.5,26.147.125,5.152.251,10.369t.314,9.809q.188,4.591.317,8.173t.251,5.464q.252,2.515.628,6.727t.69,9.306q.317,5.091.251,10.809a100.022,100.022,0,0,1-.756,11.319,67.377,67.377,0,0,1-2.2,10.745,31.869,31.869,0,0,1-4.272,9.178,18.774,18.774,0,0,1-10.369,5.409,21.943,21.943,0,0,1-11.631-1.134,24.27,24.27,0,0,1-8.172-5.089,30.623,30.623,0,0,1-5.656-7.111,23.979,23.979,0,0,1-2.826-7.54,12.926,12.926,0,0,1,.188-6.408c.083-.167.251-.59.5-1.262a10.6,10.6,0,0,1,1.317-2.324,13.281,13.281,0,0,1,2.518-2.572,12.111,12.111,0,0,1,3.957-2.015,22.412,22.412,0,0,0,8.551-4.529,30.507,30.507,0,0,0,6.973-8.172,27.158,27.158,0,0,0,3.387-9.385q2.284,1.684,4.867,3.83,3.329,4.1,4.766,4.494t.723-1.551a23.26,23.26,0,0,0-3.6-5.543,39.241,39.241,0,0,0-6.4-6.121,26.485,26.485,0,0,0-1.791-8.6,51.642,51.642,0,0,0-7.354-13.517,52.692,52.692,0,0,0-7.857-8.293,19.74,19.74,0,0,0-5.906-3.65q-2.265-.684-1.51.439a14.656,14.656,0,0,0,2.388,2.644q1.763,1.632,3.834,3.9a53.908,53.908,0,0,1,4.209,5.281,34.054,34.054,0,0,1,3.711,6.847,32.952,32.952,0,0,1,2.135,8.492c.044.361.057.741.087,1.109q-3.259-1.819-7.116-3.551a79.091,79.091,0,0,0-18.572-5.432,31.069,31.069,0,0,0-13.913.225,24.49,24.49,0,0,0-10.145,5.538,30.615,30.615,0,0,0-6.872,9.484,61.421,61.421,0,0,0-4.212,12.082,91.8,91.8,0,0,0-2.162,13.471q-.609,6.983-.61,13.582t.278,12.308q.275,5.708.61,9.814.333,5.433.774,11.365t.832,11.638q.39,5.717.666,10.92t.553,9.151c.011.161.021.328.03.492-1.891.018-4.575.058-8.079.117q-7.286.131-17.849.247t-23.633.382c-2.46.047-4.964.1-7.491.143.343-.732.671-1.439.966-2.092q1.377-3.078,2.891-6.413t2.387-5.784a15.418,15.418,0,0,0,.943-3.4q.06-.936-1.385.886a83.98,83.98,0,0,0-4.648,7.038c-1.533,2.491-3.493,5.784-5.864,9.848q-7.423.135-15.205.274-14.331.252-29.1.5t-28.724.5c-5.759.1-11.291.2-16.648.285-.134-.92-.243-1.856-.315-2.816-.129-1.716-.208-3.286-.255-4.714q-.046-1.58-.089-2.745c1.738.058,3.463.1,5.163.1q6.771,0,12.637-.285t10.075-.625q5.577-.342,11.669-.8t11.949-.854q5.869-.4,11.211-.683t9.4-.568q4.037-.288,8.71-.4a28.106,28.106,0,0,0,6.2-6.944,32.7,32.7,0,0,0,3.362-7.284,28.541,28.541,0,0,0,1.31-6.945,52.685,52.685,0,0,0,0-5.863,22.962,22.962,0,0,0-.571-4.1c-.269-1.024-.4-1.574-.4-1.649a8.72,8.72,0,0,0-1.649-3.361c-.955-1.328-1.974-2.637-3.073-3.929s-2.128-2.39-3.075-3.3a17.213,17.213,0,0,0-1.649-1.482,37.821,37.821,0,0,1-7.633-8.026,24.722,24.722,0,0,1-3.529-7.512,19.522,19.522,0,0,1-.623-6.659,23.978,23.978,0,0,1,1.137-5.577,25.255,25.255,0,0,1,1.823-4.214c.643-1.139,1.077-1.971,1.31-2.5a4.848,4.848,0,0,0,.222-.572,3.606,3.606,0,0,0,.232-1.022,2.234,2.234,0,0,0-.339-1.139,1.014,1.014,0,0,0-1.027-.51,3.569,3.569,0,0,0-1.766.966,13.124,13.124,0,0,0-2.445,3.187,57.126,57.126,0,0,0-6.6,14.742,44.531,44.531,0,0,0-1.706,13.322,31.061,31.061,0,0,0,2.337,11.154,22.041,22.041,0,0,0,5.744,8.141q2.5,2.28,4.5,4.438t3.356,3.871q1.367,1.709,2.85,3.758c-2.357.151-4.043.267-5.069.343s-1.8.131-2.33.171-1.064.076-1.6.111-1.476.1-2.843.171-3.355.156-5.974.228-6.3.192-11.045.343-10.777.34-18.1.568-16.334.5-27.039.795a124.358,124.358,0,0,1-21.736-1.022,54.6,54.6,0,0,1-14.517-3.982,22.3,22.3,0,0,1-8.479-6.319,17.93,17.93,0,0,1-3.586-7.915,22.786,22.786,0,0,1,.172-8.653,47.744,47.744,0,0,1,2.67-8.708,58.148,58.148,0,0,1,4.1-8.08q2.334-3.814,4.383-6.716t4.891-6.319q4.21-3.418,4.615-4.895c.26-.986-.267-1.234-1.592-.74a23.743,23.743,0,0,0-5.692,3.7,44.393,44.393,0,0,0-7.74,8.482,75.141,75.141,0,0,0-7.689,13.66,81.31,81.31,0,0,0-5.577,19.069,31.892,31.892,0,0,0,.231,14.288,25.114,25.114,0,0,0,5.687,10.417,31.468,31.468,0,0,0,9.736,7.056,62.989,62.989,0,0,0,12.4,4.325,94.492,94.492,0,0,0,13.829,2.222q3.735.325,7.358.478c-.463,1.217-1.113,3.239-1.937,6.063q-.69,2.332-1.3,4.347l-4.365.069q-12.377.179-21.812.311t-15.274.192H2503c-1.312-2.038-2.579-4.171-3.79-6.416a79.94,79.94,0,0,1-6.409-16.034,163.969,163.969,0,0,1-3.016-17.279q-1.009-8.5-1.259-17.287t.188-18.1q.444-9.311,1.323-19.869.377-3.776.75-6.471v-.013a175.183,175.183,0,0,1,4.592-17.178,222.89,222.89,0,0,1,12.294-29.641,163.966,163.966,0,0,0,8.846-21.43,160.2,160.2,0,0,0,4.825-18.1,99.393,99.393,0,0,0,1.9-14.528c.04-.928.072-1.819.1-2.681l278.707-2.58a31.1,31.1,0,0,1,11.917,3.047,63.323,63.323,0,0,1,11.1,6.777,93.812,93.812,0,0,1,9.9,8.719q4.614,4.7,8.268,8.935t6.256,7.6q2.367,3.047,3.562,4.365a12.568,12.568,0,0,0-3.1,3.855,5.521,5.521,0,0,0-.471,3.491,6.577,6.577,0,0,0,1.669,3.027,17,17,0,0,0,2.919,2.5c1.077.728,2.189,1.412,3.336,2.034a26.885,26.885,0,0,1,2.869,1.776c.1.072.2.132.306.2-.717,1.349-1.507,2.747-2.391,4.206a23.1,23.1,0,0,1-4.8,5.732,13.159,13.159,0,0,0-3.441,4.174,5.523,5.523,0,0,0-.471,3.491,6.569,6.569,0,0,0,1.669,3.027,16.819,16.819,0,0,0,2.919,2.5c1.077.729,2.189,1.411,3.336,2.034a27.1,27.1,0,0,1,2.869,1.777c.1.074.2.132.306.2-.717,1.348-1.507,2.747-2.391,4.206a23.011,23.011,0,0,1-4.8,5.731,13.2,13.2,0,0,0-3.441,4.173,5.527,5.527,0,0,0-.471,3.493,6.57,6.57,0,0,0,1.669,3.027,16.942,16.942,0,0,0,2.919,2.5c1.077.728,2.189,1.41,3.336,2.034a26.906,26.906,0,0,1,2.869,1.774c.1.074.2.132.306.2-.717,1.35-1.507,2.748-2.391,4.207a23.065,23.065,0,0,1-4.8,5.731,13.175,13.175,0,0,0-3.441,4.175,5.522,5.522,0,0,0-.471,3.491,6.577,6.577,0,0,0,1.669,3.027,16.941,16.941,0,0,0,2.919,2.5c1.077.729,2.189,1.411,3.336,2.034a27.628,27.628,0,0,1,2.694,1.655q-.88,1.6-1.911,3.3a23.068,23.068,0,0,1-4.8,5.732,13.174,13.174,0,0,0-3.441,4.173,5.523,5.523,0,0,0-.471,3.491,6.581,6.581,0,0,0,1.669,3.029,16.875,16.875,0,0,0,2.919,2.5c1.077.729,2.189,1.411,3.336,2.034a27.1,27.1,0,0,1,2.869,1.777c.1.074.2.132.306.2-.717,1.348-1.507,2.748-2.391,4.207a23.027,23.027,0,0,1-4.8,5.73,13.192,13.192,0,0,0-3.441,4.175,5.522,5.522,0,0,0-.471,3.491,6.563,6.563,0,0,0,1.669,3.027,16.949,16.949,0,0,0,2.919,2.5c1.077.728,2.189,1.411,3.336,2.034a26.887,26.887,0,0,1,2.869,1.774c.1.074.2.133.306.2-.717,1.35-1.507,2.748-2.391,4.207a23.094,23.094,0,0,1-4.8,5.732,13.16,13.16,0,0,0-3.441,4.174,5.522,5.522,0,0,0-.471,3.491,6.588,6.588,0,0,0,1.669,3.029,16.933,16.933,0,0,0,2.919,2.5c1.077.729,2.189,1.412,3.336,2.034a27.337,27.337,0,0,1,2.869,1.776c.1.074.2.133.306.2-.717,1.348-1.507,2.745-2.391,4.2a23.044,23.044,0,0,1-4.8,5.732,13.19,13.19,0,0,0-3.441,4.173,5.527,5.527,0,0,0-.471,3.493,6.577,6.577,0,0,0,1.669,3.027,16.941,16.941,0,0,0,2.919,2.5c1.077.728,2.189,1.411,3.336,2.034a26.894,26.894,0,0,1,2.869,1.776,11.448,11.448,0,0,0,2.815,1.51,2.568,2.568,0,0,0,1.616.153c.311-.139.4-.418.26-.828a3.59,3.59,0,0,0-1.354-1.464,2.339,2.339,0,0,1-1.2-2.4,7.658,7.658,0,0,1,1.515-3.022,32.39,32.39,0,0,1,3.073-3.491q1.826-1.83,3.5-3.7a25.411,25.411,0,0,0,2.763-3.7,5.243,5.243,0,0,0,.885-3.386,4.982,4.982,0,0,0-2.138-2.61c-1.288-.974-2.692-1.941-4.222-2.915-1.537-.946-3.23-1.89-5.065-2.836a1.987,1.987,0,0,1-.306-1.471,7.663,7.663,0,0,1,1.515-3.02,32.536,32.536,0,0,1,3.073-3.493q1.826-1.828,3.5-3.7a25.267,25.267,0,0,0,2.763-3.7,5.243,5.243,0,0,0,.885-3.384,4.982,4.982,0,0,0-2.138-2.61c-1.288-.975-2.692-1.942-4.222-2.916-1.537-.945-3.23-1.891-5.065-2.834a1.989,1.989,0,0,1-.306-1.473,7.676,7.676,0,0,1,1.515-3.022,32.531,32.531,0,0,1,3.073-3.491q1.826-1.828,3.5-3.7a25.252,25.252,0,0,0,2.763-3.7,5.247,5.247,0,0,0,.885-3.387,4.987,4.987,0,0,0-2.138-2.61c-1.288-.973-2.692-1.94-4.222-2.915-1.537-.943-3.23-1.889-5.065-2.836a1.983,1.983,0,0,1-.306-1.47,7.659,7.659,0,0,1,1.515-3.022,32.39,32.39,0,0,1,3.073-3.491q1.826-1.83,3.5-3.7a25.417,25.417,0,0,0,2.763-3.7,5.245,5.245,0,0,0,.885-3.386,4.982,4.982,0,0,0-2.138-2.611q-1.931-1.459-4.222-2.915c-1.623-1-3.419-2-5.374-2.994,0-.031,0-.06,0-.092a7.659,7.659,0,0,1,1.515-3.019,32.412,32.412,0,0,1,3.073-3.494q1.826-1.826,3.5-3.7a25.274,25.274,0,0,0,2.763-3.7,5.243,5.243,0,0,0,.885-3.384,4.973,4.973,0,0,0-2.138-2.611c-1.288-.975-2.692-1.942-4.222-2.916-1.537-.945-3.23-1.891-5.065-2.837a1.981,1.981,0,0,1-.306-1.47,7.666,7.666,0,0,1,1.515-3.022,32.53,32.53,0,0,1,3.073-3.491q1.826-1.83,3.5-3.7a25.334,25.334,0,0,0,2.763-3.7,5.247,5.247,0,0,0,.885-3.387,4.987,4.987,0,0,0-2.138-2.611c-1.288-.973-2.692-1.939-4.222-2.915-1.537-.946-3.23-1.889-5.065-2.836a1.984,1.984,0,0,1-.306-1.47,7.659,7.659,0,0,1,1.515-3.022,32.407,32.407,0,0,1,3.073-3.491q1.826-1.83,3.5-3.705a25.267,25.267,0,0,0,2.763-3.7,5.241,5.241,0,0,0,.885-3.384,4.982,4.982,0,0,0-2.138-2.611c-1.288-.975-2.692-1.942-4.222-2.915-1.537-.946-3.23-1.892-5.065-2.836a1.989,1.989,0,0,1-.306-1.473,7.672,7.672,0,0,1,1.515-3.02,32.4,32.4,0,0,1,3.073-3.493q1.826-1.826,3.5-3.7a25.338,25.338,0,0,0,2.763-3.7,5.245,5.245,0,0,0,.885-3.386,4.975,4.975,0,0,0-2.138-2.609c-1.288-.975-2.692-1.942-4.222-2.918q-2.716-1.669-6.046-3.339-1.461,3.022-3.546,6.467a23.4,23.4,0,0,1-4.344,5.314c-.39-1.157-1.12-3.032-2.2-5.645a92.255,92.255,0,0,0-11.1-19.735,107.084,107.084,0,0,0-15.116-16.754,78.47,78.47,0,0,0-16.985-11.7,37.675,37.675,0,0,0-16.828-4.392q-3.132,0-11.771.151t-21.148.293q-12.517.158-28,.456t-32.474.595q-16.98.3-34.482.6t-34.035.6c-6.115.11-59.877.213-108.206.306-.014-.054-.028-.1-.043-.161a29.664,29.664,0,0,0-2.242-5.4,45.465,45.465,0,0,0-4.6-7.068,36.411,36.411,0,0,0-7.526-7.119c-.37-.268-.75-.531-1.138-.79,2.789-.731,5.887-1.7,9.342-2.934a84.237,84.237,0,0,0,12.5-5.78,99.281,99.281,0,0,0,13.2-8.928,79.207,79.207,0,0,0,12.629-12.761,89.161,89.161,0,0,0,5.847-8.276h94.607a73.36,73.36,0,0,0,.392,7.882,29.738,29.738,0,0,0,2.133,8.173,32.383,32.383,0,0,0,4.593,7.166,28.449,28.449,0,0,0,8.675,6.79,47.19,47.19,0,0,0,14.139,4.525q8.542,1.511,20.872.253,18.478-1.888,35.442-2.705,16.98-.819,30.675-1.13t23.07-.317q9.369,0,12.637-.124a43.257,43.257,0,0,1,7.165.377q3.9.5,7.35,1.07t5.846,1c1.591.3,2.469.315,2.644.064a23.839,23.839,0,0,1,1.695-1.949,24.579,24.579,0,0,0,3.082-4.463,38.079,38.079,0,0,0,2.948-6.977,28.618,28.618,0,0,0,1.2-9.492,31.038,31.038,0,0,0-2.012-10.371,52.607,52.607,0,0,0-4.842-9.618,88.757,88.757,0,0,0-6.534-8.988q-3.582-4.337-6.973-8.487a34.258,34.258,0,0,1-4.9-7.541,23.64,23.64,0,0,1-1.886-5.848,15.6,15.6,0,0,1,.12-5.217,40.974,40.974,0,0,0,.255-7.418c-.168-1.337-.5-1.969-1.007-1.885s-1.085.716-1.758,1.885-1.34,2.452-2.012,3.836-1.255,2.684-1.757,3.9-.8,1.906-.887,2.073a37.259,37.259,0,0,1-3.268,3.771q-3.019,3.272-6.909,8.05-3.907,4.774-7.8,10.367a58.517,58.517,0,0,0-6.032,10.689,16.512,16.512,0,0,0-1.509,8.988q.623,3.9,5.654,5.281,7.285,2.013,12.191.818a22.407,22.407,0,0,0,7.922-3.394,20.692,20.692,0,0,0,5.529-6.6,13.872,13.872,0,0,0,1.884,2.581q1.895,2.322,4.273,5.216,2.649,3.272,6.167,7.416c-3.778.085-7.166.125-10.184.125h-41.107q-2.011,0-6.726.192t-10.816.5q-6.1.317-12.883.631t-12.886.692q-6.1.377-10.808.628c-3.146.171-5.383.295-6.726.378q-1.511.127-5.528.251t-9.242-.192a87.391,87.391,0,0,1-10.936-1.381,37.353,37.353,0,0,1-10.44-3.519,22.081,22.081,0,0,1-7.723-6.54,13.5,13.5,0,0,1-.9-1.407h84.132a24.049,24.049,0,0,0,8.739-1.823,21.041,21.041,0,0,0,5.842-3.834,182.822,182.822,0,0,0,19.675-21.432,83.773,83.773,0,0,0,11.5-19.924,67.963,67.963,0,0,0,4.589-20.436,117.775,117.775,0,0,0-.943-22.943,35.026,35.026,0,0,0-5.718-15.081,42.167,42.167,0,0,0-11.5-11.44,49.2,49.2,0,0,0-15.654-6.855,54.052,54.052,0,0,0-18.1-1.381,59.9,59.9,0,0,0-18.856,4.961,57.5,57.5,0,0,0-10.308,5.912c-.041-1.288-.083-2.673-.134-4.182q-.22-6.931-.551-17.626t-.775-26.336a121.082,121.082,0,0,1,1-21.171,53.055,53.055,0,0,1,3.879-14.139,21.715,21.715,0,0,1,6.152-8.258,17.466,17.466,0,0,1,7.708-3.494,22.223,22.223,0,0,1,8.426.171,46.546,46.546,0,0,1,8.482,2.6,56.63,56.63,0,0,1,7.868,4l.11.067a39.473,39.473,0,0,1-.5,3.958,26.418,26.418,0,0,1-3.271,6.544,33.025,33.025,0,0,1-4.589,5.592,23.88,23.88,0,0,1-6.85,4.713,66.8,66.8,0,0,0-8.172,4.592,17.165,17.165,0,0,0-6.159,6.72q-2.007,4.026-.879,9.81t7.541,13.7a39.2,39.2,0,0,0,10.309,8.932,51.331,51.331,0,0,0,12.761,5.528,53.326,53.326,0,0,0,13.575,2.013,40.437,40.437,0,0,0,12.761-1.7,28.4,28.4,0,0,0,10.308-5.592,19.936,19.936,0,0,0,6.159-9.553,81,81,0,0,0,2.2-13.828q.69-8.176.75-17.1t-.311-17.726q-.377-8.794-1.006-15.969-.629-11.06-.879-18.606t-.315-12.636q-.06-5.083.064-7.982t.313-4.649c.126-1.175.25-2.077.378-2.7a10.694,10.694,0,0,0,.188-2.076,24.7,24.7,0,0,0-.124-4.146,19.182,19.182,0,0,0-4.717-10.562,17.345,17.345,0,0,0-6.222-4.274,29.5,29.5,0,0,0-10.813-2.333,43.373,43.373,0,0,0-9.806.943,53.094,53.094,0,0,0-8.106,2.452q-3.585,1.45-5.844,2.2a97.353,97.353,0,0,0-13.7,7.477q-7.8,4.972-16.531,11.311T2711.8,462.741q-9.174,7.1-17.849,13.892T2677.546,489.4q-7.73,5.966-13.639,10.113a18.635,18.635,0,0,0-1.131-3.266q-1.259-3.259-3.52-8.547t-5.407-11.944c-.738-1.566-1.51-3.134-2.3-4.7.948-.92,1.893-1.849,2.843-2.758a115.015,115.015,0,0,1,11.567-9.745,61.087,61.087,0,0,1,11.819-6.855,28.887,28.887,0,0,1,12.129-2.452,41.312,41.312,0,0,0,9.806-.439c2.009-.456,2.972-1.048,2.891-1.758s-1.05-1.462-2.891-2.26a28.787,28.787,0,0,0-7.416-1.823,81.763,81.763,0,0,0-10.875-.629,67.342,67.342,0,0,0-13.138,1.381,81.437,81.437,0,0,0-14.142,4.275,61.53,61.53,0,0,0-11.915,6.431c-1.056-1.7-2.114-3.407-3.211-5.065a72.751,72.751,0,0,0-8.423-10.681,86.161,86.161,0,0,0-13.763-11.7,128.751,128.751,0,0,0-13.512-8.108,91.589,91.589,0,0,0-10.939-4.842q-4.648-1.628-6.159-2.012a20.38,20.38,0,0,0-2.827-.5,2.619,2.619,0,0,0-1.7.192c-.251.208-.021.607.691,1.191a25.261,25.261,0,0,0,4.46,2.516,63.459,63.459,0,0,1,8.36,5.473,80.883,80.883,0,0,1,10.248,9.3,108.087,108.087,0,0,1,10.37,13.012,89.138,89.138,0,0,1,8.861,16.593c.966,2.348,1.9,4.646,2.812,6.919q-5.546,5.377-10.752,10.576-5.408,5.406-10.373,9.995a62.545,62.545,0,0,1-9.8,7.541,26.15,26.15,0,0,1-9.553,3.705,14.911,14.911,0,0,1-9.491-1.756q-3.271-1.763-3.581-4.586a10.9,10.9,0,0,1,1.38-6.159,30,30,0,0,1,5.028-6.855,69.5,69.5,0,0,1,7.481-6.79q3.391-2.636,6.662-5.025a64.942,64.942,0,0,0,5.718-4.657,29.016,29.016,0,0,0,3.9-4.274,6.541,6.541,0,0,0,1.445-3.771,20.24,20.24,0,0,0-2.26-9.243,21.47,21.47,0,0,0-5.532-6.662,31.041,31.041,0,0,0-7.48-4.393,52.541,52.541,0,0,0-8.044-2.644,41.64,41.64,0,0,0-7.292-1.135,29.781,29.781,0,0,0-5.215.064q-7.167,4.158-13.513,7.047T2545.4,442.9a23.9,23.9,0,0,0-6.538,4.585,4.367,4.367,0,0,0-.756,5.153q1.326,2.9,6.416,6.79a139.2,139.2,0,0,0,15.021,9.554,28.65,28.65,0,0,0-3.772,6.542,21.192,21.192,0,0,0-1.321,6.663,13.172,13.172,0,0,0,1.949,7.413,30.766,30.766,0,0,0,4.086,5.153,32.319,32.319,0,0,0,7.921,5.848,63.887,63.887,0,0,0,12.633,5.089,84.992,84.992,0,0,0,18.228,3.018,22.135,22.135,0,0,0,10.683-2.012,54.614,54.614,0,0,0,10.877-6.535,117.616,117.616,0,0,0,11-9.553c1.2-1.171,2.4-2.369,3.612-3.561q1.061,2.791,2,5.3,2.451,6.542,3.834,10.441t1.381,4.019a11.031,11.031,0,0,0,2.138,1.262q2.139,1.125,5.279,2.7t6.85,3.14c2.476,1.055,4.718,1.909,6.726,2.58s5.072-.04,9.179-2.14a132.812,132.812,0,0,0,14.394-8.8q8.234-5.656,17.849-13.078t19.488-15.146q9.866-7.728,19.418-14.835t17.6-12.134a73.311,73.311,0,0,1,13.955-7.1q5.908-2.073,8.67.19.259,14.082.5,26.149.125,5.15.251,10.367t.314,9.81q.188,4.591.317,8.172t.251,5.466q.252,2.515.628,6.726t.69,9.307q.317,5.091.251,10.809a100.022,100.022,0,0,1-.756,11.319,67.374,67.374,0,0,1-2.2,10.745,31.887,31.887,0,0,1-4.272,9.178,18.784,18.784,0,0,1-10.369,5.409,21.958,21.958,0,0,1-11.631-1.134,24.294,24.294,0,0,1-8.172-5.089,30.627,30.627,0,0,1-5.656-7.111,23.975,23.975,0,0,1-2.826-7.541,12.922,12.922,0,0,1,.188-6.406c.083-.167.251-.59.5-1.263a10.628,10.628,0,0,1,1.317-2.323,13.322,13.322,0,0,1,2.518-2.574,12.161,12.161,0,0,1,3.957-2.012,22.411,22.411,0,0,0,8.551-4.529,30.49,30.49,0,0,0,6.973-8.173,27.157,27.157,0,0,0,3.387-9.385q2.284,1.686,4.867,3.83,3.329,4.1,4.766,4.5c.961.253,1.2-.261.723-1.55a23.2,23.2,0,0,0-3.6-5.543,39.243,39.243,0,0,0-6.4-6.121,26.5,26.5,0,0,0-1.791-8.605,51.686,51.686,0,0,0-7.354-13.517,52.609,52.609,0,0,0-7.857-8.292,19.71,19.71,0,0,0-5.906-3.65q-2.265-.684-1.51.439a14.652,14.652,0,0,0,2.388,2.644q1.763,1.63,3.834,3.9a53.416,53.416,0,0,1,4.209,5.281,34.08,34.08,0,0,1,3.711,6.845,32.953,32.953,0,0,1,2.135,8.492c.044.363.057.741.087,1.11q-3.259-1.823-7.116-3.552a79.16,79.16,0,0,0-18.572-5.431,31.05,31.05,0,0,0-13.913.225,24.471,24.471,0,0,0-10.145,5.536,30.657,30.657,0,0,0-6.872,9.482,61.507,61.507,0,0,0-4.212,12.084,91.779,91.779,0,0,0-2.162,13.469q-.609,6.986-.61,13.583t.278,12.308q.275,5.706.61,9.814.333,5.433.774,11.363t.832,11.64q.39,5.717.666,10.92t.553,9.151c.011.161.021.328.03.49-1.891.018-4.575.06-8.079.117q-7.286.133-17.849.247-10.564.131-23.633.383l-7.491.143c.343-.732.671-1.441.966-2.092q1.377-3.08,2.891-6.414t2.387-5.784a15.377,15.377,0,0,0,.943-3.4q.06-.934-1.385.886t-4.648,7.038c-1.533,2.491-3.493,5.784-5.864,9.849q-7.423.135-15.205.272-14.331.252-29.1.5t-28.724.5c-5.759.1-11.291.2-16.648.285-.134-.92-.243-1.857-.315-2.816-.129-1.719-.208-3.289-.255-4.714-.031-1.054-.06-1.967-.089-2.745,1.738.058,3.463.1,5.163.1q6.771,0,12.637-.286t10.075-.627q5.577-.342,11.669-.795t11.949-.855q5.869-.4,11.211-.684t9.4-.567q4.037-.288,8.71-.4a28.128,28.128,0,0,0,6.2-6.944,32.675,32.675,0,0,0,3.362-7.286,28.53,28.53,0,0,0,1.31-6.944,52.684,52.684,0,0,0,0-5.863,22.96,22.96,0,0,0-.571-4.1c-.269-1.024-.4-1.576-.4-1.649a8.721,8.721,0,0,0-1.649-3.361c-.955-1.328-1.974-2.637-3.073-3.929s-2.128-2.39-3.075-3.3a16.983,16.983,0,0,0-1.649-1.482,37.857,37.857,0,0,1-7.633-8.026,24.722,24.722,0,0,1-3.529-7.512,19.522,19.522,0,0,1-.623-6.659,23.963,23.963,0,0,1,1.137-5.577,25.252,25.252,0,0,1,1.823-4.214c.643-1.139,1.077-1.973,1.31-2.5a4.84,4.84,0,0,0,.222-.572,3.615,3.615,0,0,0,.232-1.023,2.234,2.234,0,0,0-.339-1.139,1.012,1.012,0,0,0-1.027-.51,3.57,3.57,0,0,0-1.766.966,13.109,13.109,0,0,0-2.445,3.186,57.154,57.154,0,0,0-6.6,14.744,44.518,44.518,0,0,0-1.706,13.319,31.076,31.076,0,0,0,2.337,11.156,22.042,22.042,0,0,0,5.744,8.141q2.5,2.278,4.5,4.438t3.356,3.871q1.367,1.709,2.85,3.758c-2.357.151-4.043.267-5.069.343s-1.8.129-2.33.169-1.064.076-1.6.113-1.476.1-2.843.171-3.355.154-5.974.228-6.3.192-11.045.343-10.777.34-18.1.567-16.334.5-27.039.8a124.362,124.362,0,0,1-21.736-1.023,54.6,54.6,0,0,1-14.517-3.982,22.307,22.307,0,0,1-8.479-6.32,17.925,17.925,0,0,1-3.586-7.914,22.785,22.785,0,0,1,.172-8.653,47.741,47.741,0,0,1,2.67-8.708,58.145,58.145,0,0,1,4.1-8.08q2.334-3.814,4.383-6.716t4.891-6.32q4.21-3.418,4.615-4.893c.26-.988-.267-1.234-1.592-.742a23.836,23.836,0,0,0-5.692,3.7,44.448,44.448,0,0,0-7.74,8.483,75.14,75.14,0,0,0-7.689,13.66,81.288,81.288,0,0,0-5.577,19.069,31.892,31.892,0,0,0,.231,14.288,25.108,25.108,0,0,0,5.687,10.416,31.424,31.424,0,0,0,9.736,7.056,62.9,62.9,0,0,0,12.4,4.326,94.492,94.492,0,0,0,13.829,2.222q3.735.323,7.358.478c-.463,1.217-1.113,3.239-1.937,6.063q-.69,2.332-1.3,4.347l-4.365.068q-12.377.181-21.812.313t-15.274.192H2503c-1.312-2.038-2.579-4.171-3.79-6.417a79.9,79.9,0,0,1-6.409-16.033,163.968,163.968,0,0,1-3.016-17.279q-1.009-8.5-1.259-17.287t.188-18.1q.444-9.309,1.323-19.866.377-3.776.75-6.471v-.013a174.983,174.983,0,0,1,4.592-17.178,222.814,222.814,0,0,1,12.294-29.641,163.964,163.964,0,0,0,8.846-21.43,160.193,160.193,0,0,0,4.825-18.1,99.4,99.4,0,0,0,1.9-14.528c.04-.928.072-1.819.1-2.681l278.707-2.581a31.122,31.122,0,0,1,11.917,3.048,63.327,63.327,0,0,1,11.1,6.777,94.106,94.106,0,0,1,9.9,8.717q4.614,4.7,8.268,8.938t6.256,7.6q2.367,3.047,3.562,4.365a12.567,12.567,0,0,0-3.1,3.855,5.52,5.52,0,0,0-.471,3.491,6.583,6.583,0,0,0,1.669,3.027,17,17,0,0,0,2.919,2.5c1.077.728,2.189,1.412,3.336,2.034a26.907,26.907,0,0,1,2.869,1.774c.1.074.2.133.306.2-.717,1.348-1.507,2.747-2.391,4.205a23.061,23.061,0,0,1-4.8,5.731,13.177,13.177,0,0,0-3.441,4.175,5.523,5.523,0,0,0-.471,3.491,6.577,6.577,0,0,0,1.669,3.027,16.938,16.938,0,0,0,2.919,2.5c1.077.729,2.189,1.411,3.336,2.034a27.112,27.112,0,0,1,2.869,1.777c.1.071.2.131.306.2-.717,1.348-1.507,2.747-2.391,4.206a23.085,23.085,0,0,1-4.8,5.731,13.2,13.2,0,0,0-3.441,4.174,5.523,5.523,0,0,0-.471,3.491,6.574,6.574,0,0,0,1.669,3.029,16.871,16.871,0,0,0,2.919,2.5q1.615,1.1,3.336,2.037a26.691,26.691,0,0,1,2.869,1.774c.1.074.2.132.306.2-.717,1.348-1.507,2.748-2.391,4.207a23.061,23.061,0,0,1-4.8,5.731,13.174,13.174,0,0,0-3.441,4.174,5.525,5.525,0,0,0-.471,3.493,6.584,6.584,0,0,0,1.669,3.027,17,17,0,0,0,2.919,2.5c1.077.728,2.189,1.411,3.336,2.034a27.931,27.931,0,0,1,2.694,1.653q-.88,1.6-1.911,3.305a23.068,23.068,0,0,1-4.8,5.732,13.174,13.174,0,0,0-3.441,4.174,5.523,5.523,0,0,0-.471,3.491,6.588,6.588,0,0,0,1.669,3.029,16.93,16.93,0,0,0,2.919,2.5c1.077.729,2.189,1.412,3.336,2.034a27.1,27.1,0,0,1,2.869,1.777c.1.074.2.132.306.2-.717,1.348-1.507,2.747-2.391,4.206a23.01,23.01,0,0,1-4.8,5.731,13.2,13.2,0,0,0-3.441,4.173,5.527,5.527,0,0,0-.471,3.493,6.57,6.57,0,0,0,1.669,3.027,16.945,16.945,0,0,0,2.919,2.5c1.077.728,2.189,1.41,3.336,2.034a26.691,26.691,0,0,1,2.869,1.774c.1.074.2.132.306.2-.717,1.349-1.507,2.748-2.391,4.207a23.063,23.063,0,0,1-4.8,5.731,13.177,13.177,0,0,0-3.441,4.175,5.521,5.521,0,0,0-.471,3.491,6.577,6.577,0,0,0,1.669,3.027,16.935,16.935,0,0,0,2.919,2.5c1.077.729,2.189,1.412,3.336,2.034a27.1,27.1,0,0,1,2.869,1.776c.1.072.2.132.306.2-.717,1.348-1.507,2.745-2.391,4.2a23.069,23.069,0,0,1-4.8,5.732,13.173,13.173,0,0,0-3.441,4.173,5.523,5.523,0,0,0-.471,3.491,6.581,6.581,0,0,0,1.669,3.029,16.93,16.93,0,0,0,2.919,2.5c1.077.729,2.189,1.412,3.336,2.034a27.112,27.112,0,0,1,2.869,1.777,11.444,11.444,0,0,0,2.815,1.51,2.568,2.568,0,0,0,1.616.153c.311-.14.4-.418.26-.829a3.6,3.6,0,0,0-1.354-1.463,2.339,2.339,0,0,1-1.2-2.4,7.658,7.658,0,0,1,1.515-3.022,32.4,32.4,0,0,1,3.073-3.491q1.826-1.83,3.5-3.7a25.414,25.414,0,0,0,2.763-3.7,5.245,5.245,0,0,0,.885-3.386,4.982,4.982,0,0,0-2.138-2.611c-1.288-.975-2.692-1.942-4.222-2.915-1.537-.946-3.23-1.892-5.065-2.836a1.989,1.989,0,0,1-.306-1.473,7.663,7.663,0,0,1,1.515-3.02,32.4,32.4,0,0,1,3.073-3.491q1.826-1.83,3.5-3.7a25.264,25.264,0,0,0,2.763-3.7,5.243,5.243,0,0,0,.885-3.384,4.979,4.979,0,0,0-2.138-2.612c-1.288-.974-2.692-1.941-4.222-2.915-1.537-.945-3.23-1.891-5.065-2.837a1.982,1.982,0,0,1-.306-1.47,7.658,7.658,0,0,1,1.515-3.022,32.53,32.53,0,0,1,3.073-3.491q1.826-1.83,3.5-3.7a25.412,25.412,0,0,0,2.763-3.7,5.249,5.249,0,0,0,.885-3.387,4.987,4.987,0,0,0-2.138-2.611q-1.931-1.459-4.222-2.915c-1.537-.946-3.23-1.889-5.065-2.836a1.984,1.984,0,0,1-.306-1.47,7.658,7.658,0,0,1,1.515-3.022,32.407,32.407,0,0,1,3.073-3.491q1.826-1.83,3.5-3.7a25.344,25.344,0,0,0,2.763-3.705,5.241,5.241,0,0,0,.885-3.384,4.983,4.983,0,0,0-2.138-2.611c-1.288-.975-2.692-1.942-4.222-2.915-1.623-1-3.419-2-5.374-2.994,0-.032,0-.06,0-.092a7.676,7.676,0,0,1,1.515-3.022,32.536,32.536,0,0,1,3.073-3.491q1.826-1.828,3.5-3.7a25.335,25.335,0,0,0,2.763-3.7,5.245,5.245,0,0,0,.885-3.386,4.984,4.984,0,0,0-2.138-2.612c-1.288-.972-2.692-1.94-4.222-2.915-1.537-.943-3.23-1.889-5.065-2.836a1.983,1.983,0,0,1-.306-1.47,7.658,7.658,0,0,1,1.515-3.022,32.525,32.525,0,0,1,3.073-3.491q1.826-1.83,3.5-3.7a25.406,25.406,0,0,0,2.763-3.7,5.251,5.251,0,0,0,.885-3.387,4.987,4.987,0,0,0-2.138-2.611q-1.931-1.459-4.222-2.915c-1.537-.946-3.23-1.891-5.065-2.836a1.987,1.987,0,0,1-.306-1.471,7.654,7.654,0,0,1,1.515-3.02,32.274,32.274,0,0,1,3.073-3.491q1.826-1.83,3.5-3.705a25.264,25.264,0,0,0,2.763-3.7,5.241,5.241,0,0,0,.885-3.384,4.972,4.972,0,0,0-2.138-2.611c-1.288-.975-2.692-1.942-4.222-2.916-1.537-.945-3.23-1.891-5.065-2.836a1.986,1.986,0,0,1-.306-1.471,7.667,7.667,0,0,1,1.515-3.022,32.536,32.536,0,0,1,3.073-3.491q1.826-1.828,3.5-3.7a25.414,25.414,0,0,0,2.763-3.7,5.245,5.245,0,0,0,.885-3.386,4.989,4.989,0,0,0-2.138-2.612c-1.288-.973-2.692-1.94-4.222-2.915q-2.716-1.669-6.046-3.339-1.461,3.022-3.546,6.466a23.34,23.34,0,0,1-4.344,5.314c-.39-1.157-1.12-3.03-2.2-5.643a92.223,92.223,0,0,0-11.1-19.735,107.084,107.084,0,0,0-15.116-16.754,78.471,78.471,0,0,0-16.985-11.7,37.658,37.658,0,0,0-16.828-4.392q-3.132,0-11.771.151t-21.148.293q-12.517.154-28,.453t-32.474.6q-16.98.3-34.482.6t-34.035.595c-6.115.111-59.877.213-108.206.307-.014-.054-.028-.106-.043-.163a29.7,29.7,0,0,0-2.242-5.4,45.343,45.343,0,0,0-4.6-7.069,36.4,36.4,0,0,0-7.526-7.117,43.241,43.241,0,0,0-11.144-5.637,50.9,50.9,0,0,0-15.51-2.526,57.294,57.294,0,0,0-16.428,1.781,62.1,62.1,0,0,0-13.5,5.286A59.934,59.934,0,0,0,2440,375.555a93.091,93.091,0,0,0-7.523,7.117,46.136,46.136,0,0,0-4.538,5.52c-.44.659-.77,1.164-1,1.532-3.421.05-6.659.094-9.693.133q-11.164.156-18.1.226t-7.969-.075c-1.088-.1-1.637.322-1.637,1.259a8.753,8.753,0,0,0,1.041,3.579,43.594,43.594,0,0,0,2.685,4.695q1.638,2.526,3.2,4.76t2.753,3.73c.795.995,1.141,1.487,1.042,1.487l17.047-.158c-.291,1.1-.564,2.234-.806,3.423a62.252,62.252,0,0,0-1.152,11.836,63.99,63.99,0,0,0,1.552,13.959c-.076.074.041.533.343,1.373s.689,1.767,1.15,2.761a24.682,24.682,0,0,0,1.492,2.759q.806,1.259,1.321,1.38c.346.074.577-.386.689-1.38a24.3,24.3,0,0,0-.517-5.63,58.561,58.561,0,0,1-1.494-8.732,54.753,54.753,0,0,1,.175-9.593,51.032,51.032,0,0,1,2.7-11.894c.038-.107.085-.207.124-.313l76.3-.706a107.07,107.07,0,0,1-1.738,21.526q-2.761,16.145-11.834,37.975-1.265-5.289-2.3-9.361t-2.354-8.965q-1.319-4.885-2.814-9.418T2475.1,432.2a16.708,16.708,0,0,0-3.045-5.111.813.813,0,0,0-.229-.175.9.9,0,0,1-.231-.168,3.224,3.224,0,0,0-1.437-1.437,5.783,5.783,0,0,0-2.413-.4,13.671,13.671,0,0,0-4.192.92c-1.15.381-2.817,1.016-5,1.891a64.75,64.75,0,0,0-7.352,3.622,69.466,69.466,0,0,0-8.5,5.746,53.971,53.971,0,0,0-8.443,8.33,58.2,58.2,0,0,0-7.238,11.434,58.969,58.969,0,0,0-4.826,15.048,47.605,47.605,0,0,0-.69,15.228,39.77,39.77,0,0,0,3.333,11.777,35.912,35.912,0,0,0,5.687,8.674,46.54,46.54,0,0,0,6.318,5.914,32.511,32.511,0,0,0,5.341,3.4q2.3,1.084,2.644,1.2c.386.074,1.167.19,2.354.343a23.467,23.467,0,0,0,4.082.118,32.9,32.9,0,0,0,4.825-.635,15.91,15.91,0,0,0,4.594-1.666,14.221,14.221,0,0,0,2.7-1.956c.422-.453.44-.8.057-1.029a5.755,5.755,0,0,0-2.124-.518c-1.032-.117-2.319-.213-3.852-.285a20.922,20.922,0,0,1-5.569-1.263,16.959,16.959,0,0,1-6.377-4.315,29.292,29.292,0,0,1-5.571-8.732,44.8,44.8,0,0,1-3.159-14.528,88.274,88.274,0,0,1,0-14.253,49.992,49.992,0,0,1,2.524-12.237,33.358,33.358,0,0,1,14.479-17.865c.459-.307,1.3.934,2.53,3.737a101.477,101.477,0,0,1,4.076,11.887q2.24,7.7,4.483,18.442t3.617,23.385q1.379,12.639,1.552,26.717a84.634,84.634,0,0,0,1.333,12.054c.022,3.923.022,7.8-.011,11.6-.043,4.531.56,9.2-.026,14.141-.589,4.953-2.466,10.338-3.808,16.033a164.477,164.477,0,0,1-5.91,19.109,87.244,87.244,0,0,1-10.309,20.618,89.118,89.118,0,0,1-10.935,13.078,68.616,68.616,0,0,1-12.066,9.051,24.348,24.348,0,0,1-3.08-5.536,29.234,29.234,0,0,1-1.574-7.037,33.2,33.2,0,0,1,.567-9.93,59.328,59.328,0,0,1,4.211-12.758q3.145-7.106,10.559-16.034.5-.5,2.512-2.324a44.434,44.434,0,0,1,11.947-7.54,25.709,25.709,0,0,1,8.044-2.078c2.685-.247,4.272-.583,4.776-1.006s.272-.775-.691-1.071a17.519,17.519,0,0,0-4.587-.439,24.144,24.144,0,0,0-6.915,1.134,55.388,55.388,0,0,0-5.531,1.949,49.571,49.571,0,0,0-6.915,3.516,57.732,57.732,0,0,0-7.417,5.407,44.415,44.415,0,0,0-7.1,7.8,58.049,58.049,0,0,0-5.97,10.5,59.038,59.038,0,0,0-4.025,13.579c0,.081-.145.895-.44,2.445a19.566,19.566,0,0,0,.063,6.038,34.728,34.728,0,0,0,2.452,8.421,32.106,32.106,0,0,0,6.6,9.618,18.9,18.9,0,0,0,2.138,2.077,43.211,43.211,0,0,0,5.154,3.962,27.208,27.208,0,0,0,6.348,3.14,6.161,6.161,0,0,0,5.718-.5q2.392-1.632,6.6-4.147a54.735,54.735,0,0,0,9.3-7.358,85.332,85.332,0,0,0,10.62-12.693,100.607,100.607,0,0,0,10.437-19.931,24.2,24.2,0,0,0,1.635,3.523,72.064,72.064,0,0,0,5.594,8.924,112.937,112.937,0,0,0,9.93,11.879,88.8,88.8,0,0,0,14.645,12.325,100.86,100.86,0,0,0,19.8,10.306,91.725,91.725,0,0,0,23.683,5.649c.167.27.342.547.507.814q3.081,4.968,4.968,8.8c1.253,2.558,1.637,4.294,1.134,5.217q-.5.879-1.7,3.769a44.994,44.994,0,0,1-3.834,6.98c-.595.922-1.279,1.887-2,2.87l-100.2-.331c-.335.081-.522.04-.565-.129a.372.372,0,0,1,.063-.374,49.641,49.641,0,0,0,3.144-4.4q1.886-2.9,3.518-5.657t2.576-4.656c.632-1.254.692-1.678.189-1.254a119.976,119.976,0,0,0-13.324,13.14,116.288,116.288,0,0,0-8.424,11,67.7,67.7,0,0,0-5.656,10.178H2538.4a111.1,111.1,0,0,1-14.18,8.276,137.879,137.879,0,0,1-22.31,8.486,117.453,117.453,0,0,1-25.715,4.59,113.649,113.649,0,0,1-24.89-1.071,96.351,96.351,0,0,1-22.565-6.346,76.706,76.706,0,0,1-18.852-11.251,61.607,61.607,0,0,1-13.763-15.779,53.025,53.025,0,0,1-7.11-19.927c0-.168-.039-.188-.12-.064a5.307,5.307,0,0,0-.319.567,5.828,5.828,0,0,0-.313.814,3.015,3.015,0,0,0-.126.692q0,.125.192,2.516a31.89,31.89,0,0,0,1.381,6.348,56.365,56.365,0,0,0,3.834,9.114,58.6,58.6,0,0,0,7.541,10.941,90.831,90.831,0,0,0,12.509,11.879,108.084,108.084,0,0,0,18.795,11.755,190.831,190.831,0,0,0,26.274,10.621q2.009.661,4.105,1.3a61.229,61.229,0,0,0-12.258,4.915A59.934,59.934,0,0,0,2440,752.381a92.85,92.85,0,0,0-7.523,7.119,46.029,46.029,0,0,0-4.538,5.518c-.44.659-.77,1.164-1,1.534-3.421.049-6.659.094-9.693.133q-11.164.154-18.1.225t-7.969-.074c-1.088-.1-1.637.321-1.637,1.257a8.753,8.753,0,0,0,1.041,3.579,43.594,43.594,0,0,0,2.685,4.695c1.092,1.684,2.158,3.276,3.2,4.761s1.959,2.736,2.753,3.729,1.141,1.487,1.042,1.487l17.047-.157c-.291,1.1-.564,2.233-.806,3.422a62.252,62.252,0,0,0-1.152,11.836,63.98,63.98,0,0,0,1.552,13.959c-.076.074.041.534.343,1.373s.689,1.767,1.15,2.761a24.557,24.557,0,0,0,1.492,2.759q.806,1.261,1.321,1.38c.346.074.577-.386.689-1.38a24.3,24.3,0,0,0-.517-5.63,58.529,58.529,0,0,1-1.494-8.732,54.755,54.755,0,0,1,.175-9.593,51.032,51.032,0,0,1,2.7-11.894c.038-.106.085-.207.124-.313l76.3-.706a107.1,107.1,0,0,1-1.738,21.529q-2.761,16.143-11.834,37.972-1.265-5.289-2.3-9.36-1.033-4.087-2.354-8.967t-2.814-9.417q-1.495-4.545-3.044-8.162a16.673,16.673,0,0,0-3.045-5.111.787.787,0,0,0-.229-.175.934.934,0,0,1-.231-.168,3.22,3.22,0,0,0-1.437-1.438,5.782,5.782,0,0,0-2.413-.4,13.67,13.67,0,0,0-4.192.92c-1.15.381-2.817,1.016-5,1.892a64.718,64.718,0,0,0-7.352,3.621,69.613,69.613,0,0,0-8.5,5.746,54.027,54.027,0,0,0-8.443,8.33,58.28,58.28,0,0,0-7.238,11.434,58.97,58.97,0,0,0-4.826,15.048,47.612,47.612,0,0,0-.69,15.23,39.794,39.794,0,0,0,3.333,11.777,35.937,35.937,0,0,0,5.687,8.674,46.608,46.608,0,0,0,6.318,5.913,32.519,32.519,0,0,0,5.341,3.4q2.3,1.084,2.644,1.2c.386.072,1.167.189,2.354.343a23.648,23.648,0,0,0,4.082.117,32.887,32.887,0,0,0,4.825-.635,15.916,15.916,0,0,0,4.594-1.666,14.216,14.216,0,0,0,2.7-1.956c.422-.453.44-.8.057-1.029a5.754,5.754,0,0,0-2.124-.518c-1.032-.117-2.319-.211-3.852-.285a20.92,20.92,0,0,1-5.569-1.263,16.959,16.959,0,0,1-6.377-4.315,29.292,29.292,0,0,1-5.571-8.732,44.786,44.786,0,0,1-3.159-14.528,88.256,88.256,0,0,1,0-14.252,49.99,49.99,0,0,1,2.524-12.239,33.358,33.358,0,0,1,14.479-17.865c.459-.306,1.3.934,2.53,3.739a101.292,101.292,0,0,1,4.076,11.887q2.24,7.7,4.483,18.442t3.617,23.387q1.379,12.635,1.552,26.714a84.631,84.631,0,0,0,1.333,12.054c.022,3.923.022,7.8-.011,11.6-.043,4.529.56,9.2-.026,14.139-.589,4.953-2.466,10.338-3.808,16.034a164.537,164.537,0,0,1-5.91,19.107,87.246,87.246,0,0,1-10.309,20.618,89.072,89.072,0,0,1-10.935,13.079,68.677,68.677,0,0,1-12.066,9.05,24.374,24.374,0,0,1-3.08-5.535,29.248,29.248,0,0,1-1.574-7.038,33.2,33.2,0,0,1,.567-9.929,59.33,59.33,0,0,1,4.211-12.758q3.145-7.106,10.559-16.033.5-.5,2.512-2.324a44.38,44.38,0,0,1,11.947-7.541,25.671,25.671,0,0,1,8.044-2.077c2.685-.249,4.272-.583,4.776-1.007s.272-.775-.691-1.071a17.521,17.521,0,0,0-4.587-.439,24.137,24.137,0,0,0-6.915,1.134,55.44,55.44,0,0,0-5.531,1.951,49.541,49.541,0,0,0-6.915,3.515,57.855,57.855,0,0,0-7.417,5.407,44.411,44.411,0,0,0-7.1,7.8,58.1,58.1,0,0,0-5.97,10.5,59.032,59.032,0,0,0-4.025,13.581c0,.079-.145.893-.44,2.444a19.584,19.584,0,0,0,.063,6.041,34.73,34.73,0,0,0,2.452,8.418,32.075,32.075,0,0,0,6.6,9.618,18.971,18.971,0,0,0,2.138,2.078,43.211,43.211,0,0,0,5.154,3.961,27.209,27.209,0,0,0,6.348,3.14,6.158,6.158,0,0,0,5.718-.5q2.392-1.63,6.6-4.146a54.794,54.794,0,0,0,9.3-7.358,85.427,85.427,0,0,0,10.62-12.694,100.6,100.6,0,0,0,10.437-19.931,24.2,24.2,0,0,0,1.635,3.523,71.96,71.96,0,0,0,5.594,8.924,112.8,112.8,0,0,0,9.93,11.879,88.878,88.878,0,0,0,14.645,12.326,101.018,101.018,0,0,0,19.8,10.306,91.786,91.786,0,0,0,23.683,5.648c.167.271.342.547.507.816q3.081,4.968,4.968,8.8c1.253,2.556,1.637,4.293,1.134,5.216q-.5.879-1.7,3.772a45.046,45.046,0,0,1-3.834,6.977c-.595.923-1.279,1.887-2,2.872l-100.2-.332c-.335.081-.522.04-.565-.126a.376.376,0,0,1,.063-.377,49.434,49.434,0,0,0,3.144-4.4q1.886-2.9,3.518-5.656t2.576-4.657c.632-1.255.692-1.678.189-1.255a119.983,119.983,0,0,0-13.324,13.142,116.3,116.3,0,0,0-8.424,11,67.7,67.7,0,0,0-5.656,10.178H2538.4a111.119,111.119,0,0,1-14.18,8.276,137.749,137.749,0,0,1-22.31,8.486,117.453,117.453,0,0,1-25.715,4.59,113.737,113.737,0,0,1-24.89-1.07,96.478,96.478,0,0,1-22.565-6.346,76.708,76.708,0,0,1-18.852-11.252,61.608,61.608,0,0,1-13.763-15.779,53.008,53.008,0,0,1-7.11-19.927c0-.167-.039-.187-.12-.064a5.757,5.757,0,0,0-.319.567,5.848,5.848,0,0,0-.313.816,3.006,3.006,0,0,0-.126.69q0,.127.192,2.516a31.891,31.891,0,0,0,1.381,6.348,56.323,56.323,0,0,0,3.834,9.115,58.634,58.634,0,0,0,7.541,10.94,90.748,90.748,0,0,0,12.509,11.879,108.008,108.008,0,0,0,18.795,11.755,175.362,175.362,0,0,0,19.15,8.158c-.34.174-.7.335-1.029.516a59.927,59.927,0,0,0-10.513,7.126,93.322,93.322,0,0,0-7.523,7.119,46.025,46.025,0,0,0-4.538,5.52c-.44.657-.77,1.164-1,1.532-3.421.049-6.659.094-9.693.133q-11.164.154-18.1.228t-7.969-.076c-1.088-.1-1.637.321-1.637,1.257a8.754,8.754,0,0,0,1.041,3.579,43.6,43.6,0,0,0,2.685,4.694q1.638,2.528,3.2,4.763c1.041,1.495,1.959,2.734,2.753,3.729s1.141,1.487,1.042,1.487l17.047-.158c-.291,1.1-.564,2.234-.806,3.422a62.276,62.276,0,0,0-1.152,11.836,63.993,63.993,0,0,0,1.552,13.96c-.076.072.041.532.343,1.373s.689,1.766,1.15,2.759a24.7,24.7,0,0,0,1.492,2.761q.806,1.259,1.321,1.38c.346.072.577-.388.689-1.38a24.289,24.289,0,0,0-.517-5.63,58.591,58.591,0,0,1-1.494-8.732,54.755,54.755,0,0,1,.175-9.593,51.058,51.058,0,0,1,2.7-11.9c.038-.1.085-.206.124-.313l76.3-.706a107.1,107.1,0,0,1-1.738,21.529q-2.761,16.143-11.834,37.973-1.265-5.289-2.3-9.36t-2.354-8.965q-1.319-4.885-2.814-9.42t-3.044-8.162a16.709,16.709,0,0,0-3.045-5.111.812.812,0,0,0-.229-.175.9.9,0,0,1-.231-.168,3.235,3.235,0,0,0-1.437-1.438,5.81,5.81,0,0,0-2.413-.4,13.631,13.631,0,0,0-4.192.92c-1.15.379-2.817,1.016-5,1.891a64.7,64.7,0,0,0-7.352,3.621,69.6,69.6,0,0,0-8.5,5.746,54.039,54.039,0,0,0-8.443,8.332,58.264,58.264,0,0,0-7.238,11.433,58.988,58.988,0,0,0-4.826,15.048,47.613,47.613,0,0,0-.69,15.23,39.769,39.769,0,0,0,3.333,11.777,35.886,35.886,0,0,0,5.687,8.674,46.52,46.52,0,0,0,6.318,5.913,32.324,32.324,0,0,0,5.341,3.4q2.3,1.086,2.644,1.2c.386.074,1.167.19,2.354.343a23.477,23.477,0,0,0,4.082.117,32.707,32.707,0,0,0,4.825-.635,15.946,15.946,0,0,0,4.594-1.664,14.271,14.271,0,0,0,2.7-1.958c.422-.452.44-.8.057-1.03a5.761,5.761,0,0,0-2.124-.517c-1.032-.117-2.319-.213-3.852-.286a20.915,20.915,0,0,1-5.569-1.261,16.961,16.961,0,0,1-6.377-4.315,29.309,29.309,0,0,1-5.571-8.732,44.794,44.794,0,0,1-3.159-14.53,88.256,88.256,0,0,1,0-14.252,49.994,49.994,0,0,1,2.524-12.237,33.358,33.358,0,0,1,14.479-17.865c.459-.307,1.3.935,2.53,3.739a101.345,101.345,0,0,1,4.076,11.886q2.24,7.7,4.483,18.442t3.617,23.387q1.379,12.637,1.552,26.714a84.61,84.61,0,0,0,1.333,12.054c.022,3.925.022,7.8-.011,11.6-.043,4.529.56,9.2-.026,14.139-.589,4.954-2.466,10.338-3.808,16.034a164.379,164.379,0,0,1-5.91,19.108,87.3,87.3,0,0,1-10.309,20.62,89.11,89.11,0,0,1-10.935,13.076,68.616,68.616,0,0,1-12.066,9.05,24.371,24.371,0,0,1-3.08-5.535,29.23,29.23,0,0,1-1.574-7.038,33.2,33.2,0,0,1,.567-9.93,59.318,59.318,0,0,1,4.211-12.757q3.145-7.108,10.559-16.034.5-.5,2.512-2.324a44.48,44.48,0,0,1,11.947-7.541,25.661,25.661,0,0,1,8.044-2.077c2.685-.247,4.272-.583,4.776-1.007s.272-.774-.691-1.07a17.453,17.453,0,0,0-4.587-.439,24.053,24.053,0,0,0-6.915,1.135,55,55,0,0,0-5.531,1.948,49.553,49.553,0,0,0-6.915,3.515,58.015,58.015,0,0,0-7.417,5.409,44.451,44.451,0,0,0-7.1,7.8,58.157,58.157,0,0,0-5.97,10.5,59.038,59.038,0,0,0-4.025,13.579c0,.079-.145.9-.44,2.445a19.574,19.574,0,0,0,.063,6.039,34.738,34.738,0,0,0,2.452,8.419,32.129,32.129,0,0,0,6.6,9.62,19.433,19.433,0,0,0,2.138,2.076,43.071,43.071,0,0,0,5.154,3.963,27.276,27.276,0,0,0,6.348,3.14,6.162,6.162,0,0,0,5.718-.5q2.392-1.63,6.6-4.146a54.88,54.88,0,0,0,9.3-7.358,85.519,85.519,0,0,0,10.62-12.7,100.561,100.561,0,0,0,10.437-19.93,24.239,24.239,0,0,0,1.635,3.522,71.851,71.851,0,0,0,5.594,8.924,112.633,112.633,0,0,0,9.93,11.879,88.883,88.883,0,0,0,14.645,12.328,101.013,101.013,0,0,0,19.8,10.3,91.66,91.66,0,0,0,23.683,5.649c.167.27.342.546.507.814q3.081,4.968,4.968,8.8c1.253,2.556,1.637,4.293,1.134,5.216-.333.589-.9,1.842-1.7,3.772a44.979,44.979,0,0,1-3.834,6.977c-.595.923-1.279,1.887-2,2.872l-100.2-.331c-.335.079-.522.039-.565-.128a.373.373,0,0,1,.063-.375,49.5,49.5,0,0,0,3.144-4.4q1.886-2.9,3.518-5.656t2.576-4.657c.632-1.255.692-1.677.189-1.255a120.111,120.111,0,0,0-13.324,13.142,116.314,116.314,0,0,0-8.424,11,67.7,67.7,0,0,0-5.656,10.178H2538.4a111.1,111.1,0,0,1-14.18,8.276,137.733,137.733,0,0,1-22.31,8.487,119.891,119.891,0,0,1-16.344,3.6c-1.641-.168-3.343-.282-5.126-.328a58.111,58.111,0,0,0-15.319,1.506,109.175,109.175,0,0,1-13.815-1.257,96.43,96.43,0,0,1-22.565-6.346,76.719,76.719,0,0,1-18.852-11.252,61.557,61.557,0,0,1-13.763-15.777,53.024,53.024,0,0,1-7.11-19.927c0-.168-.039-.189-.12-.065a5.646,5.646,0,0,0-.319.568,5.826,5.826,0,0,0-.313.814,3.018,3.018,0,0,0-.126.691q0,.127.192,2.517a31.861,31.861,0,0,0,1.381,6.346,56.273,56.273,0,0,0,3.834,9.115,58.546,58.546,0,0,0,7.541,10.939,90.748,90.748,0,0,0,12.509,11.879,108.1,108.1,0,0,0,18.795,11.756,167.677,167.677,0,0,0,15.782,6.9A57.258,57.258,0,0,0,2440,1486.6a92.85,92.85,0,0,0-7.523,7.119,46.02,46.02,0,0,0-4.538,5.518c-.44.658-.77,1.164-1,1.532-3.421.05-6.659.094-9.693.135q-11.164.154-18.1.225t-7.969-.075c-1.088-.1-1.637.322-1.637,1.259a8.759,8.759,0,0,0,1.041,3.579,43.594,43.594,0,0,0,2.685,4.695q1.638,2.526,3.2,4.761t2.753,3.729c.795.995,1.141,1.487,1.042,1.487l17.047-.157c-.291,1.1-.564,2.233-.806,3.422a62.252,62.252,0,0,0-1.152,11.836,63.981,63.981,0,0,0,1.552,13.959c-.076.074.041.533.343,1.373s.689,1.767,1.15,2.761a24.681,24.681,0,0,0,1.492,2.759q.806,1.259,1.321,1.38c.346.074.577-.386.689-1.38a24.3,24.3,0,0,0-.517-5.63,58.56,58.56,0,0,1-1.494-8.732,54.755,54.755,0,0,1,.175-9.593,51.03,51.03,0,0,1,2.7-11.894c.038-.106.085-.207.124-.313l76.3-.706a107.091,107.091,0,0,1-1.738,21.528q-2.761,16.145-11.834,37.973-1.265-5.289-2.3-9.361t-2.354-8.965q-1.319-4.885-2.814-9.417t-3.044-8.162a16.7,16.7,0,0,0-3.045-5.113.8.8,0,0,0-.229-.174.944.944,0,0,1-.231-.169,3.223,3.223,0,0,0-1.437-1.437,5.783,5.783,0,0,0-2.413-.4,13.673,13.673,0,0,0-4.192.92c-1.15.381-2.817,1.016-5,1.892a64.471,64.471,0,0,0-7.352,3.62,69.455,69.455,0,0,0-8.5,5.746,54.011,54.011,0,0,0-8.443,8.329,58.242,58.242,0,0,0-7.238,11.436,58.969,58.969,0,0,0-4.826,15.048,47.612,47.612,0,0,0-.69,15.23,39.774,39.774,0,0,0,3.333,11.776,35.91,35.91,0,0,0,5.687,8.673,46.549,46.549,0,0,0,6.318,5.915,32.517,32.517,0,0,0,5.341,3.4q2.3,1.084,2.644,1.2c.386.074,1.167.19,2.354.345a23.624,23.624,0,0,0,4.082.117,32.87,32.87,0,0,0,4.825-.635,15.912,15.912,0,0,0,4.594-1.666,14.233,14.233,0,0,0,2.7-1.956c.422-.453.44-.8.057-1.03a5.758,5.758,0,0,0-2.124-.518c-1.032-.117-2.319-.213-3.852-.285a20.924,20.924,0,0,1-5.569-1.263,16.961,16.961,0,0,1-6.377-4.315,29.292,29.292,0,0,1-5.571-8.732,44.8,44.8,0,0,1-3.159-14.528,88.275,88.275,0,0,1,0-14.253,49.994,49.994,0,0,1,2.524-12.237,33.359,33.359,0,0,1,14.479-17.865c.459-.306,1.3.934,2.53,3.739a101.337,101.337,0,0,1,4.076,11.886q2.24,7.7,4.483,18.443t3.617,23.384q1.379,12.639,1.552,26.717a84.635,84.635,0,0,0,1.333,12.054c.022,3.923.022,7.8-.011,11.6-.043,4.529.56,9.2-.026,14.139-.589,4.953-2.466,10.338-3.808,16.034a164.544,164.544,0,0,1-5.91,19.107,87.24,87.24,0,0,1-10.309,20.618,89.048,89.048,0,0,1-10.935,13.078,68.621,68.621,0,0,1-12.066,9.051,24.375,24.375,0,0,1-3.08-5.535,29.25,29.25,0,0,1-1.574-7.038,33.2,33.2,0,0,1,.567-9.929,59.329,59.329,0,0,1,4.211-12.758q3.145-7.106,10.559-16.034.5-.5,2.512-2.323a44.38,44.38,0,0,1,11.947-7.541,25.675,25.675,0,0,1,8.044-2.077c2.685-.249,4.272-.585,4.776-1.007s.272-.775-.691-1.071a17.521,17.521,0,0,0-4.587-.439,24.137,24.137,0,0,0-6.915,1.134,55.391,55.391,0,0,0-5.531,1.949,49.555,49.555,0,0,0-6.915,3.516,57.729,57.729,0,0,0-7.417,5.407,44.41,44.41,0,0,0-7.1,7.8,58.1,58.1,0,0,0-5.97,10.5,59.04,59.04,0,0,0-4.025,13.579c0,.08-.145.895-.44,2.445a19.574,19.574,0,0,0,.063,6.039,34.739,34.739,0,0,0,2.452,8.419,32.109,32.109,0,0,0,6.6,9.618,18.991,18.991,0,0,0,2.138,2.078,43.211,43.211,0,0,0,5.154,3.961,27.209,27.209,0,0,0,6.348,3.14,6.158,6.158,0,0,0,5.718-.5q2.392-1.632,6.6-4.146a54.88,54.88,0,0,0,9.3-7.358,85.432,85.432,0,0,0,10.62-12.694,100.6,100.6,0,0,0,10.437-19.931,24.2,24.2,0,0,0,1.635,3.523,72.078,72.078,0,0,0,5.594,8.924,112.931,112.931,0,0,0,9.93,11.879A88.872,88.872,0,0,0,2513.919,1756a101.015,101.015,0,0,0,19.8,10.306,91.786,91.786,0,0,0,23.683,5.647c.167.27.342.547.507.814q3.081,4.968,4.968,8.8c1.253,2.558,1.637,4.294,1.134,5.217q-.5.879-1.7,3.769a44.927,44.927,0,0,1-3.834,6.98c-.595.923-1.279,1.887-2,2.872l-100.2-.332c-.335.081-.522.04-.565-.128a.374.374,0,0,1,.063-.375,49.439,49.439,0,0,0,3.144-4.4q1.886-2.9,3.518-5.657t2.576-4.656c.632-1.255.692-1.678.189-1.255a120.109,120.109,0,0,0-13.324,13.14,116.327,116.327,0,0,0-8.424,11,67.636,67.636,0,0,0-5.656,10.178H2538.4a111.1,111.1,0,0,1-14.18,8.276,137.737,137.737,0,0,1-22.31,8.486,117.454,117.454,0,0,1-25.715,4.59,113.661,113.661,0,0,1-24.89-1.071,96.36,96.36,0,0,1-22.565-6.346,76.67,76.67,0,0,1-18.852-11.251,61.608,61.608,0,0,1-13.763-15.779,53.015,53.015,0,0,1-7.11-19.927c0-.167-.039-.188-.12-.064a5.414,5.414,0,0,0-.319.567,5.887,5.887,0,0,0-.313.814,3.014,3.014,0,0,0-.126.692q0,.127.192,2.516a31.87,31.87,0,0,0,1.381,6.348,56.378,56.378,0,0,0,3.834,9.115,58.638,58.638,0,0,0,7.541,10.939,90.908,90.908,0,0,0,12.509,11.879,108,108,0,0,0,18.795,11.755,190.654,190.654,0,0,0,26.274,10.62,265.528,265.528,0,0,0,34.947,8.612q.5,0,3.458-.311" transform="translate(1858.697 -2388.139) rotate(90)" opacity="0.012"/>
</svg>
