[
  {
    "_id": "c9adf633-52c7-4cf1-8a85-7137078f4d4d",
    "colId": "history",
    "containerId": "",
    "name": "http://localhost:8000/api/station",
    "url": "http://localhost:8000/api/station",
    "method": "GET",
    "sortNum": 0,
    "created": "2023-02-21T08:59:48.959Z",
    "modified": "2023-02-21T08:59:48.959Z",
    "headers": [],
    "params": [],
    "tests": []
  },
  {
    "_id": "33772b43-31e4-4108-a01d-93c66100feef",
    "colId": "history",
    "containerId": "",
    "name": "http://localhost:8000/api/station",
    "url": "http://localhost:8000/api/station",
    "method": "POST",
    "sortNum": 0,
    "created": "2023-02-21T09:56:19.585Z",
    "modified": "2023-02-22T11:30:09.224Z",
    "headers": [],
    "params": [],
    "body": {
      "type": "json",
      "raw": "{\n  \"latitude\":4.342134,\n  \"longitude\":32.234234\n}",
      "form": []
    },
    "tests": []
  },
  {
    "_id": "25e571a2-2b9e-4117-8a5f-f75ee013b262",
    "colId": "history",
    "containerId": "",
    "name": "http://localhost:8000/api/station/1",
    "url": "http://localhost:8000/api/station",
    "method": "GET",
    "sortNum": 0,
    "created": "2023-02-21T10:59:43.318Z",
    "modified": "2023-02-23T08:41:06.887Z",
    "headers": [],
    "params": [],
    "tests": []
  },
  {
    "_id": "30e81b9d-168e-4e3d-8489-7e1f9364cb61",
    "colId": "history",
    "containerId": "",
    "name": "http://localhost:8000/api/station/3",
    "url": "http://localhost:8000/api/station/3",
    "method": "DELETE",
    "sortNum": 0,
    "created": "2023-02-21T11:07:01.318Z",
    "modified": "2023-02-21T11:07:01.318Z",
    "headers": [],
    "params": [],
    "tests": []
  },
  {
    "_id": "e2c6b7d5-769b-48be-8273-5f1b3b6a4ff9",
    "colId": "history",
    "containerId": "",
    "name": "http://localhost:8000/api/station/2",
    "url": "http://localhost:8000/api/station/2",
    "method": "PATCH",
    "sortNum": 0,
    "created": "2023-02-21T11:11:38.399Z",
    "modified": "2023-02-21T11:19:44.855Z",
    "headers": [],
    "params": [],
    "body": {
      "type": "json",
      "raw": "{\n  \"slots\": 25\n}",
      "form": []
    },
    "tests": []
  },
  {
    "_id": "36f49e26-dd2b-4c90-9378-4f0a5f1bc9bc",
    "colId": "history",
    "containerId": "",
    "name": "http://localhost:8000/api/station/1/bikes",
    "url": "http://localhost:8000/api/station/11/bikes",
    "method": "GET",
    "sortNum": 0,
    "created": "2023-02-21T11:23:40.170Z",
    "modified": "2023-03-06T12:36:31.471Z",
    "headers": [],
    "params": [],
    "tests": []
  },
  {
    "_id": "0f25d537-61dd-4d92-9d96-df01d95db750",
    "colId": "history",
    "containerId": "",
    "name": "http://localhost:8000/api/bike",
    "url": "http://localhost:8000/api/bike",
    "method": "POST",
    "sortNum": 0,
    "created": "2023-02-21T12:48:39.350Z",
    "modified": "2023-02-22T09:46:44.267Z",
    "headers": [],
    "params": [],
    "body": {
      "type": "json",
      "raw": "{\n  \"electric\":false,\n  \"broken\":false,\n  \"station\": 5\n}",
      "form": []
    },
    "tests": []
  },
  {
    "_id": "462e2d3f-d970-481d-9291-e3f141bf98e8",
    "colId": "history",
    "containerId": "",
    "name": "http://localhost:8000/api/bike/2",
    "url": "http://localhost:8000/api/bike/2",
    "method": "POST",
    "sortNum": 0,
    "created": "2023-02-21T12:55:44.592Z",
    "modified": "2023-02-21T12:55:44.592Z",
    "headers": [],
    "params": [],
    "body": {
      "type": "json",
      "raw": "{\n  \"electric\":false,\n  \"broken\":false\n}",
      "form": []
    },
    "tests": []
  },
  {
    "_id": "cfa5fd2b-0ffc-4e02-b97f-66e2efae924e",
    "colId": "history",
    "containerId": "",
    "name": "http://localhost:8000/api/user",
    "url": "http://localhost:8000/api/user",
    "method": "POST",
    "sortNum": 0,
    "created": "2023-02-27T09:54:08.629Z",
    "modified": "2023-02-27T09:54:08.629Z",
    "headers": [],
    "params": [],
    "body": {
      "type": "json",
      "raw": "{\n  \"email\":\"test@test.com\",\n  \"password\":\"1234\"\n}",
      "form": []
    },
    "tests": []
  },
  {
    "_id": "63f0beff-6444-491e-9d12-2cd0666cd53d",
    "colId": "history",
    "containerId": "",
    "name": "http://localhost:8000/api/login",
    "url": "http://localhost:8000/api/login",
    "method": "POST",
    "sortNum": 0,
    "created": "2023-02-27T11:25:17.917Z",
    "modified": "2023-02-28T09:31:15.886Z",
    "headers": [],
    "params": [],
    "body": {
      "type": "json",
      "raw": "{\n  \"email\":\"test@test.com\",\n  \"password\":\"1234\"\n}",
      "form": []
    },
    "tests": []
  },
  {
    "_id": "4d277b18-b86f-4dd4-863b-e29d6ebdaa27",
    "colId": "history",
    "containerId": "",
    "name": "http://localhost:8000/api/private",
    "url": "http://localhost:8000/api/rental/26",
    "method": "PATCH",
    "sortNum": 0,
    "created": "2023-02-27T11:30:15.642Z",
    "modified": "2023-03-08T10:51:50.282Z",
    "headers": [],
    "params": [],
    "auth": {
      "type": "bearer",
      "bearer": "eyJ0eXAiOiJKV1QiLCJhbGciOiJSUzI1NiJ9.eyJpYXQiOjE2Nzc1NzY2NzUsImV4cCI6MjY3NzU3NjY3NSwicm9sZXMiOlsiUk9MRV9VU0VSIl0sInVzZXJuYW1lIjoidGVzdEB0ZXN0LmNvbSJ9.jkevhcA7crKvXpqYv8uZCgvjEOfB-dVtETSmyW9QtVlKLY1FmgvGtuXdPt8LMG7F2MrRUSM8nFU2jeVxNd7GE5iQvPub4TP_EJB8SIagyACMTvX0rX7Yx4ZGDj0QTcF8s5jD_dEa5h_PantChNopqLM26au4qiwsTfCWdUuqOvVYJtfz5LZLK-ub5llJsm4ly00jdyl4oEu6x12_emkxvpwJH5ztcNc0-kgAZ5F77Aj6SPWVb4atXnxyARnht6UVu7Erv7odQmmiCqQzGEIyqto47lUbtFYSnUZyQnRkiyGU6Ilg9blyviUUQCnb1Ff5i0HsmZpMJ461SXPxut74ow"
    },
    "tests": []
  },
  {
    "_id": "dabeba22-a954-4cac-9899-6916a893226b",
    "colId": "history",
    "containerId": "",
    "name": "http://localhost:8000/api/rental/48",
    "url": "http://localhost:8000/api/rental/48",
    "method": "POST",
    "sortNum": 0,
    "created": "2023-03-06T11:26:31.259Z",
    "modified": "2023-03-06T11:26:40.527Z",
    "headers": [],
    "params": [],
    "auth": {
      "type": "bearer",
      "bearer": "eyJ0eXAiOiJKV1QiLCJhbGciOiJSUzI1NiJ9.eyJpYXQiOjE2NzgxMDE5NDgsImV4cCI6MjY3ODEwMTk0OCwicm9sZXMiOlsiUk9MRV9VU0VSIl0sInVzZXJuYW1lIjoidGVzdEB0ZXN0LmNvbSJ9.VZHz5Cy5lTLAyHenZXfW_sPrLZwf9Qxjw4m8BzXt5cMFekIQbS9StSMS0c_zRIS-h3QZa35QvfYuqlHsZbqx6cu5NOiClHc--gW8qJna9G6vC_qIK78ibifMNOZ-N74_bjGYCTSpt121I4zP_iE6MlnGoFe0rTqm6Cdp-gh5vYdP0wvkAyytt8s2zX0Lx0Nfz0Nk48vgWjEwGTaTSDnl4zuB1O81lVqR9449vC_GryQ3ce2YWjAJdksGD54mjBUl_6rgDOwMwgtW5eoU34c586dpo4zZOSBZKH2KMOmZnWJXuPerG95o03nb-tDcjj8VDI8VS3j31ASY-SCUIdpksg"
    },
    "tests": []
  },
  {
    "_id": "a1f0a35e-1737-4cfb-a689-bc55dcf8e2ee",
    "colId": "history",
    "containerId": "",
    "name": "http://localhost:8000/api/bike/48",
    "url": "http://localhost:8000/api/bike/48",
    "method": "POST",
    "sortNum": 0,
    "created": "2023-03-06T13:07:00.163Z",
    "modified": "2023-03-06T13:07:00.163Z",
    "headers": [],
    "params": [],
    "auth": {
      "type": "bearer",
      "bearer": "eyJ0eXAiOiJKV1QiLCJhbGciOiJSUzI1NiJ9.eyJpYXQiOjE2NzgxMDE5NDgsImV4cCI6MjY3ODEwMTk0OCwicm9sZXMiOlsiUk9MRV9VU0VSIl0sInVzZXJuYW1lIjoidGVzdEB0ZXN0LmNvbSJ9.VZHz5Cy5lTLAyHenZXfW_sPrLZwf9Qxjw4m8BzXt5cMFekIQbS9StSMS0c_zRIS-h3QZa35QvfYuqlHsZbqx6cu5NOiClHc--gW8qJna9G6vC_qIK78ibifMNOZ-N74_bjGYCTSpt121I4zP_iE6MlnGoFe0rTqm6Cdp-gh5vYdP0wvkAyytt8s2zX0Lx0Nfz0Nk48vgWjEwGTaTSDnl4zuB1O81lVqR9449vC_GryQ3ce2YWjAJdksGD54mjBUl_6rgDOwMwgtW5eoU34c586dpo4zZOSBZKH2KMOmZnWJXuPerG95o03nb-tDcjj8VDI8VS3j31ASY-SCUIdpksg"
    },
    "tests": []
  }
]