[
  {
    "_id": "770d5071-e601-41e4-afc5-df6caf253cc8",
    "colId": "history",
    "containerId": "",
    "name": "http://localhost:8080/api/dog",
    "url": "http://localhost:8080/api/dog",
    "method": "GET",
    "sortNum": 0,
    "created": "2022-05-30T09:31:26.116Z",
    "modified": "2022-05-30T11:42:16.642Z",
    "headers": [],
    "params": [],
    "tests": []
  },
  {
    "_id": "494ca91f-489a-4528-927d-4a3f8da01221",
    "colId": "history",
    "containerId": "",
    "name": "http://localhost:8080/api/dog/1",
    "url": "http://localhost:8080/api/dog/2",
    "method": "GET",
    "sortNum": 0,
    "created": "2022-05-30T09:32:41.330Z",
    "modified": "2022-05-31T10:22:11.740Z",
    "headers": [],
    "params": [],
    "tests": []
  },
  {
    "_id": "bf34a0f6-a7f7-4190-852d-f6eddcc1f1a3",
    "colId": "history",
    "containerId": "",
    "name": "http://localhost:8080/api/dog/100",
    "url": "http://localhost:8080/api/dog/100",
    "method": "GET",
    "sortNum": 0,
    "created": "2022-05-30T09:32:49.623Z",
    "modified": "2022-05-30T09:32:49.691Z",
    "headers": [],
    "params": [],
    "tests": []
  },
  {
    "_id": "cf1507e2-e282-45aa-a2af-338b08c86abc",
    "colId": "history",
    "containerId": "",
    "name": "http://localhost:8080/api/dog",
    "url": "http://localhost:8080/api/dog",
    "method": "POST",
    "sortNum": 0,
    "created": "2022-05-30T09:39:21.962Z",
    "modified": "2022-05-31T09:40:45.784Z",
    "headers": [],
    "params": [],
    "body": {
      "type": "json",
      "raw": "{\n    \"name\":\"bloup\",\n    \"breed\":\"blip\",\n    \"birthdate\":\"2022-04-04\",\n    \"trainer\": {\n        \"name\":\"Super trainer\",\n        \"city\":\"Lyon\"\n    }\n}",
      "form": []
    },
    "tests": []
  },
  {
    "_id": "147b5b06-ef6a-46e3-97ba-c225f9204c17",
    "colId": "history",
    "containerId": "",
    "name": "http://localhost:8080/api/dog/2",
    "url": "http://localhost:8080/api/dog/2",
    "method": "DELETE",
    "sortNum": 0,
    "created": "2022-05-30T09:57:40.672Z",
    "modified": "2022-05-30T09:57:40.728Z",
    "headers": [],
    "params": [],
    "tests": []
  },
  {
    "_id": "55edb6e8-e6f5-4cd8-8ce4-06b1e74f2902",
    "colId": "history",
    "containerId": "",
    "name": "http://localhost:8080/api/contest",
    "url": "http://localhost:8080/api/contest",
    "method": "POST",
    "sortNum": 0,
    "created": "2022-06-01T08:54:33.905Z",
    "modified": "2022-06-01T08:54:34.280Z",
    "headers": [],
    "params": [],
    "body": {
      "type": "json",
      "raw": "{\n    \"date\":\"2022-06-06\",\n    \"type\":\"obstacle course\"\n}",
      "form": []
    },
    "tests": []
  },
  {
    "_id": "808029de-17a5-4132-bba5-df8a3cd91dbf",
    "colId": "history",
    "containerId": "",
    "name": "http://localhost:8080/api/dog/1/contest/1",
    "url": "http://localhost:8080/api/dog/1/contest/2",
    "method": "PATCH",
    "sortNum": 0,
    "created": "2022-06-01T09:45:11.962Z",
    "modified": "2022-06-01T11:57:21.700Z",
    "headers": [],
    "params": [],
    "tests": []
  }
]