[
  {
    "_id": "8c98c902-9877-41bc-a212-e3a5de3f3866",
    "colId": "history",
    "containerId": "",
    "name": "http://localhost:8080/api/user",
    "url": "http://localhost:8080/api/user",
    "method": "POST",
    "sortNum": 0,
    "created": "2022-08-12T11:55:19.028Z",
    "modified": "2022-08-12T11:55:20.364Z",
    "headers": [],
    "params": [],
    "body": {
      "type": "json",
      "raw": "{\n  \"email\":\"test@test.com\",\n  \"username\":\"test\",\n  \"password\":\"1234\"\n}",
      "form": []
    },
    "tests": []
  }
]