[
  {
    "_id": "10fb3f9b-862b-4c20-9f29-ad9b4a64a237",
    "colId": "history",
    "containerId": "",
    "name": "http://localhost:3030/user",
    "url": "http://localhost:3030/user",
    "method": "POST",
    "sortNum": 0,
    "created": "2022-09-06T10:15:50.081Z",
    "modified": "2022-09-06T11:53:18.861Z",
    "headers": [],
    "params": [],
    "body": {
      "type": "json",
      "raw": "{\n  \"email\":\"test@test.com\",\n  \"password\":\"1234\"\n}",
      "form": []
    },
    "tests": []
  },
  {
    "_id": "1c498775-b279-434a-bbe2-e0e4c666829d",
    "colId": "history",
    "containerId": "",
    "name": "http://localhost:3030/authentication",
    "url": "http://localhost:3030/authentication",
    "method": "POST",
    "sortNum": 0,
    "created": "2022-09-06T10:20:45.593Z",
    "modified": "2022-09-07T07:54:18.641Z",
    "headers": [],
    "params": [],
    "body": {
      "type": "json",
      "raw": "{\n  \"strategy\":\"local\",\n  \"email\":\"test@test.com\",\n  \"password\":\"1234\"\n}",
      "form": []
    },
    "tests": []
  },
  {
    "_id": "d0a3a7a2-3ae4-4711-9f1a-1889b75e2dc0",
    "colId": "history",
    "containerId": "",
    "name": "http://localhost:3030/offer",
    "url": "http://localhost:3030/offer/5",
    "method": "PATCH",
    "sortNum": 0,
    "created": "2022-09-06T11:54:44.197Z",
    "modified": "2022-09-07T08:09:38.614Z",
    "headers": [],
    "params": [],
    "body": {
      "type": "json",
      "raw": "{\n  \"title\":\"updated\"\n}",
      "form": []
    },
    "auth": {
      "type": "bearer",
      "bearer": "eyJhbGciOiJIUzI1NiIsInR5cCI6ImFjY2VzcyJ9.eyJpYXQiOjE2NjI1MzcyNTgsImV4cCI6MTY2MjYyMzY1OCwiYXVkIjoiaHR0cHM6Ly95b3VyZG9tYWluLmNvbSIsImlzcyI6ImZlYXRoZXJzIiwic3ViIjoiMSIsImp0aSI6IjE2Y2MyYmU0LWFiOTctNGIyNi1iOWMzLTczYTYyMGYxMDdmMCJ9.1Sr3eCTJHhINv_4JUwCGHfP50cPoO-s6Uh5w0yVE3MM"
    },
    "tests": []
  },
  {
    "_id": "fb0487dd-3d26-4ca4-935d-55bdc153f4ef",
    "colId": "history",
    "containerId": "",
    "name": "http://localhostl:3030/offer",
    "url": "http://localhostl:3030/offer",
    "method": "GET",
    "sortNum": 0,
    "created": "2022-09-07T08:10:51.700Z",
    "modified": "2022-09-07T08:10:51.830Z",
    "headers": [],
    "params": [],
    "tests": []
  },
  {
    "_id": "9d743260-f4dc-44c5-bb18-5b89e12cbf5f",
    "colId": "history",
    "containerId": "",
    "name": "http://localhost:3030/offer",
    "url": "http://localhost:3030/offer",
    "method": "GET",
    "sortNum": 0,
    "created": "2022-09-07T08:10:59.490Z",
    "modified": "2022-09-07T08:17:01.301Z",
    "headers": [],
    "params": [],
    "tests": []
  },
  {
    "_id": "fedb2740-8ace-4134-9389-b4a4b052df3c",
    "colId": "history",
    "containerId": "",
    "name": "http://localhost:3030/offer?title=updated",
    "url": "http://localhost:3030/offer?title=updated",
    "method": "GET",
    "sortNum": 0,
    "created": "2022-09-07T08:15:05.797Z",
    "modified": "2022-09-07T08:15:05.837Z",
    "headers": [],
    "params": [
      {
        "name": "title",
        "value": "updated",
        "isPath": false
      }
    ],
    "tests": []
  },
  {
    "_id": "05acac5e-8af0-459c-841e-b38a54f388f3",
    "colId": "history",
    "containerId": "",
    "name": "http://localhost:3030/offer?userId=1",
    "url": "http://localhost:3030/offer?userId=1",
    "method": "GET",
    "sortNum": 0,
    "created": "2022-09-07T08:15:15.539Z",
    "modified": "2022-09-07T08:15:15.571Z",
    "headers": [],
    "params": [
      {
        "name": "userId",
        "value": "1",
        "isPath": false
      }
    ],
    "tests": []
  },
  {
    "_id": "b1a4a83b-9879-4e77-8a66-f6efeba47e03",
    "colId": "history",
    "containerId": "",
    "name": "http://localhost:3030/offer/1",
    "url": "http://localhost:3030/offer/1",
    "method": "GET",
    "sortNum": 0,
    "created": "2022-09-07T08:15:24.862Z",
    "modified": "2022-09-07T08:15:24.882Z",
    "headers": [],
    "params": [],
    "tests": []
  },
  {
    "_id": "b94bbd60-58ae-48cc-ac0b-366b322298fa",
    "colId": "history",
    "containerId": "",
    "name": "http://localhost:3030/offer?$skip=2",
    "url": "http://localhost:3030/offer?$skip=2",
    "method": "GET",
    "sortNum": 0,
    "created": "2022-09-07T08:15:53.169Z",
    "modified": "2022-09-07T08:16:30.369Z",
    "headers": [],
    "params": [
      {
        "name": "$skip",
        "value": "2",
        "isPath": false
      }
    ],
    "tests": []
  },
  {
    "_id": "328840e7-8282-4718-9f3e-aab9fe98c327",
    "colId": "history",
    "containerId": "",
    "name": "http://localhost:3030/offer?skip=2",
    "url": "http://localhost:3030/offer?skip=2",
    "method": "GET",
    "sortNum": 0,
    "created": "2022-09-07T08:16:09.879Z",
    "modified": "2022-09-07T08:16:10.190Z",
    "headers": [],
    "params": [
      {
        "name": "skip",
        "value": "2",
        "isPath": false
      }
    ],
    "tests": []
  }
]