{
  "dog": [
    {
      "id": 1,
      "name": "Fido",
      "breed": "corgi",
      "age": 1
    },
    {
      "id": 2,
      "name": "Rex",
      "breed": "poodle",
      "age": 10
    },
    {
      "id": 3,
      "name": "Clifford",
      "breed": "daschund",
      "age": 5
    }
  ]
}