{
"title":
"Machine learning-aided engineering of hydrolases for PET depolymerization",
"link":
"https://www.nature.com/articles/s41586-022-04599-z",
"source":
"Nature",
"date":
"21 hours ago",
"thumbnail":
"https://encrypted-tbn0.gstatic.com/images?q=tbn:ANd9GcQfCeTDlFqJtyhFCMpNFl6U07XgGdCdYfBsyClYcGbG5Jw02To75WQLT_o&usqp=CAI&s"
},
{
"title":
"Pentagon Taps Lyft’s Machine-Learning Chief",
"link":
"https://www.wsj.com/articles/pentagon-taps-lyfts-machine-learning-chief-11651008407",
"source":
"Wall Street Journal",
"date":
"1 day ago",
"thumbnail":
"https://encrypted-tbn0.gstatic.com/images?q=tbn:ANd9GcTdBu7Sc3bptTVf55fPa6OSDLiYodX6FaEXMtAKFMM&usqp=CAI&s"
},
{
"title":
"Which Animal Viruses Could Infect People? Computers Are Racing to Find Out.",
"link":
"https://www.nytimes.com/2022/04/27/science/pandemic-viruses-machine-learning.html",
"source":
"The New York Times",
"date":
"22 hours ago",
"thumbnail":
"https://encrypted-tbn0.gstatic.com/images?q=tbn:ANd9GcS5cfZiDdKZ2p_IkMNP7ykbD9AyMhBVmC8M_L8Hl6IqvKVZR0-BuAudVF0&usqp=CAI&s"
},
{
"title":
"Machine learning, harnessed to extreme computing, aids fusion energy development",
"link":
"https://phys.org/news/2022-04-machine-harnessed-extreme-aids-fusion.html",
"source":
"Phys.org",
"date":
"17 hours ago",
"thumbnail":
"https://encrypted-tbn0.gstatic.com/images?q=tbn:ANd9GcSvAmFYZszDwQ_4mQXvwNnoib-gJqxpFRLM9rrEf_0Xw3RTtGFr5aWKw2A&usqp=CAI&s"
}
],