"ID","Nom","Prénom","Date de naissance","Latitude ville d’habitation","Longitude ville d’habitation","Temps de trajet"
,"Atta","khalid","25/12/1976",45.1667,5.7167,12
,"Stacchetti","Julien","09/02/1979",45.1788258,5.74639579999996,35
,"Pieczara","Victor","30/03/1988",45.494761,5.139048,80
