Nom,Prenom,Date de Naissance,Lattitude,Longitude,Nombre de minutes
Boukachab,Nolan, 22/02/1992,45.399,5.672,90
Paradis,Adrien,20/01/1987,45.1445281,5.7280384,15
Chambat,Alexis,06/08/1991,45.4,6.0667,90
