nom;prenom;date_naissance;latitude_ville;longitude_ville;temps_trajet(min)
Kosnar;Jeancharles;15/05/84;45.0759;5.77018;45
Azarual;El Ghazi;01/01/82;45.18756;5.735782;40
Tatin;Dominique;03/08/61;44.9901;5.62071;45
