{
  "lookup" : "restLess",
  "commands" : [ {
    "insert" : {
      "object" : {"scot.dagda.vrm8890DataModel.Vehicle":{
  "vehicleId" : "v1car",
  "firstRegistrationDate" : null,
  "resgistration" : null,
  "capId" : null,
  "vehicleType" : "CAR",
  "originalVehicleCapId" : null,
  "originalVehicleType" : null,
  "condition" : null
}},
      "out-identifier" : null,
      "return-object" : true,
      "entry-point" : "DEFAULT",
      "disconnected" : false
    }
  }, {
    "insert" : {
      "object" : {"scot.dagda.vrm8890DataModel.Vehicle":{
  "vehicleId" : "v2wav",
  "firstRegistrationDate" : null,
  "resgistration" : null,
  "capId" : null,
  "vehicleType" : "WAV",
  "originalVehicleCapId" : null,
  "originalVehicleType" : null,
  "condition" : null
}},
      "out-identifier" : null,
      "return-object" : true,
      "entry-point" : "DEFAULT",
      "disconnected" : false
    }
  }, {
    "insert" : {
      "object" : {"scot.dagda.vrm8890DataModel.Vehicle":{
  "vehicleId" : "v2lcv",
  "firstRegistrationDate" : null,
  "resgistration" : null,
  "capId" : null,
  "vehicleType" : "LCV",
  "originalVehicleCapId" : null,
  "originalVehicleType" : null,
  "condition" : null
}},
      "out-identifier" : null,
      "return-object" : true,
      "entry-point" : "DEFAULT",
      "disconnected" : false
    }
  }, {
    "insert" : {
      "object" : {"scot.dagda.vrm8890DataModel.Vehicle":{
  "vehicleId" : "v1car_30",
  "firstRegistrationDate" : null,
  "resgistration" : null,
  "capId" : null,
  "vehicleType" : "CAR",
  "originalVehicleCapId" : null,
  "originalVehicleType" : null,
  "condition" : null
}},
      "out-identifier" : null,
      "return-object" : true,
      "entry-point" : "DEFAULT",
      "disconnected" : false
    }
  }, {
    "insert" : {
      "object" : {"scot.dagda.vrm8890DataModel.Lease":{
  "vehicleId" : "v1car_30",
  "expiryDate" : [ 2020, 9, 1 ]
}},
      "out-identifier" : null,
      "return-object" : true,
      "entry-point" : "DEFAULT",
      "disconnected" : false
    }
  }, {
    "fire-all-rules" : {
      "max" : -1,
      "out-identifier" : "fireIdentifier"
    }
  }, {
    "query" : {
      "name" : "GET_Audit",
      "arguments" : [ ],
      "out-identifier" : "AUDIT_QUERY"
    }
  }, {
    "query" : {
      "name" : "GET_SalesRecommendation",
      "arguments" : [ ],
      "out-identifier" : "SALES_RECOMMENDATION_QUERY"
    }
  }, {
    "query" : {
      "name" : "queryresponse",
      "arguments" : [ ],
      "out-identifier" : "QUERY_RESPONSE"
    }
  } ]
}