[
    {
        "country": "IT",
        "airport": "MXP"
    },
    {
        "country": "IT",
        "airport": "FCO"
    },
    {
        "country": "IT",
        "airport": "VCE"
    },
    {
        "country": "IT",
        "airport": "BGY"
    },
    {
        "country": "GB",
        "airport": "LHR"
    },
    {
        "country": "GB",
        "airport": "LGW"
    }
]