{
    "shortid": "SJzJyv829e",
    "name": "population-data",
    "folder": {
        "shortid": "0ppeLV"
    },
    "creationDate": {
        "$$date": 1549303043402
    },
    "modificationDate": {
        "$$date": 1549303043402
    },
    "_id": "NSkTzqNB68b4fyNL",
    "$entitySet": "data"
}