{
    "shortid": "SJVbqZr9f",
    "name": "orders-header",
    "recipe": "chrome-pdf",
    "engine": "handlebars",
    "folder": {
        "shortid": "erkLzi"
    },
    "chrome": {
        "printBackground": true,
        "marginTop": "1.5cm",
        "marginRight": "1.5cm",
        "marginLeft": "1.cm"
    },
    "modificationDate": {
        "$$date": 1549303043408
    },
    "_id": "Haq0pwVUFR10BZ6E",
    "$entitySet": "templates"
}