{
    "shortid": "0ppeLV",
    "name": "Population",
    "folder": {
        "shortid": "vDZdo8S"
    },
    "creationDate": {
        "$$date": 1549303043380
    },
    "_id": "0hlgWnP3TAo6EBVV",
    "$entitySet": "folders"
}