<!-- Generated by IcoMoon.io -->
<svg version="1.1" xmlns="http://www.w3.org/2000/svg" width="14" height="14" viewBox="0 0 14 14">
<title>icon-comment</title>
<path d="M14 7c0 2.766-3.133 5-7 5-0.383 0-0.766-0.023-1.133-0.062-1.023 0.906-2.242 1.547-3.594 1.891-0.281 0.078-0.586 0.133-0.891 0.172-0.172 0.016-0.336-0.109-0.375-0.297v-0.008c-0.039-0.195 0.094-0.312 0.211-0.453 0.492-0.555 1.055-1.023 1.422-2.328-1.609-0.914-2.641-2.328-2.641-3.914 0-2.758 3.133-5 7-5s7 2.234 7 5z"></path>
</svg>
