subject	block_num	condition	stim_time	stim_side	response	response_time
Boris	1	hard	1.496	R	R	2.255
Boris	1	hard	4.32	L	R	5.015
Boris	1	hard	6.228	R	R	6.985
Boris	2	easy	1.05	R	L	2.22
Boris	2	easy	4.834	R	R	6.784
Boris	2	easy	8.831	L	L	10.12
