subject	trial_num	stim_time	response_time
Anna	1	1.531	2.015
Anna	2	4.76	4.915
Anna	3	6.855	7.895
Anna	4	1.168	2.437
Anna	5	5.016	6.784
Anna	6	9.122	9.981
Boris	4	1.496	2.255
Boris	5	4.32	5.015
Boris	6	6.228	6.985
Boris	1	1.05	2.22
Boris	2	4.834	6.784
Boris	3	8.831	10.12
