module gitlab.com/yakshaving.art/hurrdurr

require (
	github.com/onrik/logrus v0.2.2 // indirect
	github.com/sirupsen/logrus v1.2.0
	github.com/stretchr/testify v1.2.2
	github.com/xanzy/go-gitlab v0.11.7
	golang.org/x/crypto v0.0.0-20181203042331-505ab145d0a9 // indirect
	golang.org/x/net v0.0.0-20181207154023-610586996380 // indirect
	golang.org/x/oauth2 v0.0.0-20181203162652-d668ce993890 // indirect
	golang.org/x/sys v0.0.0-20181212120007-b05ddf57801d // indirect
	gopkg.in/yaml.v2 v2.2.2
)
