-8 -24 -16 -32 -16 856
-32 -48 -64 -56 -48 -16 680
-800 184
96 -184 696
216 -48 144 -40 -64 440
-8 16 -24 32 -40 48 -56 64 -72 560
328 -32 16 -56 32 -8 -40 -32 -24 352
992
-16 -32 -64 -8 -24 -48 -8 -40 688
992
-80 -48 -32 -24 -16 -8 -16 -24 -32 -40 -48 -56 -64 -72 320
-8 -8 -16 -24 -40 -64 -8 -168 -272 312