{
    "keys": {
        "developer": {},
        "personal": {
            "api_key": "AIzaSyC84cj6jgHy79wQ9cN5r6pfp4ZkMihLeww",
            "client_id": "491423595919-875mipoq38b4c59in9kvkasem3o5t63u",
            "client_secret": "FELA-4w1F10JS6eQHq8jRTyR"
        }
    }
}