
###############################################################################
## Copyright(c) Oracle Corporation 1998,2017. All rights reserved.           ##
##                                                                           ##
## Specify values for the variables listed below to customize                ##
## your installation.                                                        ##
##                                                                           ##
## Each variable is associated with a comment. The comment                   ##
## can help to populate the variables with the appropriate                   ##
## values.							             ##
##                                                                           ##
###############################################################################

#-------------------------------------------------------------------------------
# Do not change the following system generated value. 
#-------------------------------------------------------------------------------
oracle.install.responseFileVersion=/oracle/install/rspfmt_gsminstall_response_schema_v12.2.0

#-------------------------------------------------------------------------------
# Unix group to be set for the inventory directory.  
#-------------------------------------------------------------------------------
UNIX_GROUP_NAME=oinstall
#-------------------------------------------------------------------------------
# Inventory location.
#-------------------------------------------------------------------------------
INVENTORY_LOCATION=/u01/app/oraInventory
#-------------------------------------------------------------------------------
# Complete path of the Oracle Home  
#-------------------------------------------------------------------------------
ORACLE_HOME=/u01/app/oracle/product/12.2.0.1/gsm

#-------------------------------------------------------------------------------
# Complete path of the Oracle Base. 
#-------------------------------------------------------------------------------
ORACLE_BASE=/u01/app/oracle