{
	"info": {
		"_postman_id": "9efde0b5-5b71-8d60-1e9a-5bde9017a653",
		"name": "elasticsearch",
		"schema": "https://schema.getpostman.com/json/collection/v2.1.0/collection.json"
	},
	"item": [
		{
			"name": "get-es-status",
			"request": {
				"method": "GET",
				"header": [],
				"body": {
					"mode": "raw",
					"raw": ""
				},
				"url": {
					"raw": "{{es_address_url}}",
					"host": [
						"{{es_address_url}}"
					]
				}
			},
			"response": []
		},
		{
			"name": "create-index (twitter)",
			"request": {
				"method": "PUT",
				"header": [
					{
						"key": "Content-Type",
						"name": "Content-Type",
						"value": "application/json",
						"type": "text"
					}
				],
				"body": {
					"mode": "raw",
					"raw": "{\n    \"settings\": {\n        \"index\": {\n            \"number_of_shards\": 3,\n            \"number_of_replicas\": 1\n        }\n    },\n    \"mappings\": {\n        \"_doc\": {\n            \"properties\": {\n                \"descript\": {\n                    \"properties\": {\n                        \"last\": {\n                            \"type\": \"text\"\n                        }\n                    }\n                },\n                \"text\": {\n                    \"type\": \"text\"\n                },\n                \"user\": {\n                    \"type\": \"keyword\",\n                    \"ignore_above\": 100\n                },\n                \"author\": {\n                    \"type\": \"keyword\",\n                    \"ignore_above\": 100\n                }\n            }\n        }\n    }\n}"
				},
				"url": {
					"raw": "{{es_url}}/twitter",
					"host": [
						"{{es_url}}"
					],
					"path": [
						"twitter"
					]
				}
			},
			"response": []
		},
		{
			"name": "create-index-dynamic-template",
			"request": {
				"method": "PUT",
				"header": [
					{
						"key": "Content-Type",
						"name": "Content-Type",
						"value": "application/json",
						"type": "text"
					}
				],
				"body": {
					"mode": "raw",
					"raw": "{\n    \"mappings\": {\n        \"_doc\": {\n            \"dynamic\": true,\n            \"dynamic_templates\": [\n                {\n                    \"integers\": {\n                        \"match_mapping_type\": \"long\",\n                        \"mapping\": {\n                            \"type\": \"integer\"\n                        }\n                    }\n                },\n                {\n                    \"strings\": {\n                        \"match_mapping_type\": \"string\",\n                        \"mapping\": {\n                            \"type\": \"text\",\n                            \"fields\": {\n                                \"raw\": {\n                                    \"type\": \"keyword\",\n                                    \"ignore_above\": 256\n                                }\n                            }\n                        }\n                    }\n                }\n            ]\n        }\n    }\n}"
				},
				"url": {
					"raw": "{{es_url}}/twitter",
					"host": [
						"{{es_url}}"
					],
					"path": [
						"twitter"
					]
				}
			},
			"response": []
		},
		{
			"name": "update-index-mapping (twitter)",
			"request": {
				"method": "PUT",
				"header": [
					{
						"key": "Content-Type",
						"name": "Content-Type",
						"type": "text",
						"value": "application/json"
					}
				],
				"body": {
					"mode": "raw",
					"raw": "{\n    \"properties\": {\n        \"descript\": {\n            \"properties\": {\n                \"last\": {\n                    \"type\": \"text\"\n                }\n            }\n        },\n        \"text\": {\n            \"type\": \"text\"\n        },\n        \"user\": {\n            \"type\": \"keyword\",\n            \"ignore_above\": 100\n        },\n        \"author\": {\n            \"type\": \"keyword\",\n            \"ignore_above\": 100\n        }\n    }\n}"
				},
				"url": {
					"raw": "{{es_url}}/twitter/_mapping/_doc",
					"host": [
						"{{es_url}}"
					],
					"path": [
						"twitter",
						"_mapping",
						"_doc"
					]
				}
			},
			"response": []
		},
		{
			"name": "create-doc",
			"request": {
				"method": "PUT",
				"header": [
					{
						"key": "Content-Type",
						"name": "Content-Type",
						"value": "application/json",
						"type": "text"
					}
				],
				"body": {
					"mode": "raw",
					"raw": "\n{\n    \"user\" : \"kimchy\",\n    \"post_date\" : \"2009-11-15T14:12:12\",\n    \"message\" : \"trying out Elasticsearch\"\n}\n\n"
				},
				"url": {
					"raw": "{{es_address_url}}/twitter/_doc/4",
					"host": [
						"{{es_address_url}}"
					],
					"path": [
						"twitter",
						"_doc",
						"4"
					]
				}
			},
			"response": []
		},
		{
			"name": "get-index-status (twitter)",
			"request": {
				"method": "GET",
				"header": [],
				"body": {
					"mode": "raw",
					"raw": ""
				},
				"url": {
					"raw": "{{es_address_url}}/twitter",
					"host": [
						"{{es_address_url}}"
					],
					"path": [
						"twitter"
					]
				}
			},
			"response": []
		},
		{
			"name": "sql-translate",
			"request": {
				"method": "POST",
				"header": [
					{
						"key": "Content-Type",
						"type": "text",
						"value": "application/json"
					}
				],
				"body": {
					"mode": "raw",
					"raw": "{ \n\t\"query\": \"SELECT * FROM twitter where user like '%c%' and user = 'abc' ORDER BY user DESC LIMIT 5\" \n}"
				},
				"url": {
					"raw": "{{es_address_url}}/_xpack/sql/translate",
					"host": [
						"{{es_address_url}}"
					],
					"path": [
						"_xpack",
						"sql",
						"translate"
					]
				}
			},
			"response": []
		},
		{
			"name": "sql-search",
			"request": {
				"method": "POST",
				"header": [
					{
						"key": "Content-Type",
						"value": "application/json",
						"type": "text"
					}
				],
				"body": {
					"mode": "raw",
					"raw": "{ \n\t\"query\": \"SELECT * FROM twitter where user like '%c%' ORDER BY user DESC LIMIT 5\" \n}"
				},
				"url": {
					"raw": "{{es_address_url}}/_xpack/sql?format=json",
					"host": [
						"{{es_address_url}}"
					],
					"path": [
						"_xpack",
						"sql"
					],
					"query": [
						{
							"key": "format",
							"value": "json"
						}
					]
				}
			},
			"response": []
		},
		{
			"name": "sql-search-txt",
			"request": {
				"method": "POST",
				"header": [
					{
						"key": "Content-Type",
						"type": "text",
						"value": "application/json"
					}
				],
				"body": {
					"mode": "raw",
					"raw": "{ \n\t\"query\": \"SELECT * FROM twitter where user like '%c%' ORDER BY user DESC LIMIT 5\" \n}"
				},
				"url": {
					"raw": "{{es_address_url}}/_xpack/sql?format=txt",
					"host": [
						"{{es_address_url}}"
					],
					"path": [
						"_xpack",
						"sql"
					],
					"query": [
						{
							"key": "format",
							"value": "txt"
						}
					]
				}
			},
			"response": []
		},
		{
			"name": "search-explain",
			"request": {
				"method": "POST",
				"header": [
					{
						"key": "Content-Type",
						"type": "text",
						"value": "application/json"
					}
				],
				"body": {
					"mode": "raw",
					"raw": "{\n    \"explain\": true,\n    \"query\" : {\n        \"term\" : { \"name\" : \"abc\" }\n    }\n}"
				},
				"url": {
					"raw": "{{es_address_url}}/_search",
					"host": [
						"{{es_address_url}}"
					],
					"path": [
						"_search"
					]
				}
			},
			"response": []
		},
		{
			"name": "request-body-search-0",
			"request": {
				"method": "POST",
				"header": [
					{
						"key": "Content-Type",
						"value": "application/json",
						"type": "text"
					}
				],
				"body": {
					"mode": "raw",
					"raw": "{\n    \"size\": 5,\n    \"query\": {\n        \"wildcard\": {\n            \"user\": {\n                \"wildcard\": \"*c*\",\n                \"boost\": 1\n            }\n        }\n    },\n    \"_source\": {\n        \"includes\": [\n            \"descript.last\",\n            \"message\",\n            \"text\"\n        ],\n        \"excludes\": []\n    },\n    \"docvalue_fields\": [\n        {\n            \"field\": \"author\",\n            \"format\": \"use_field_mapping\"\n        },\n        {\n            \"field\": \"post_date\",\n            \"format\": \"epoch_millis\"\n        },\n        {\n            \"field\": \"user\",\n            \"format\": \"use_field_mapping\"\n        }\n    ],\n    \"sort\": [\n        {\n            \"user\": {\n                \"order\": \"desc\"\n            }\n        }\n    ]\n}"
				},
				"url": {
					"raw": "{{es_url}}/twitterx/_search",
					"host": [
						"{{es_url}}"
					],
					"path": [
						"twitterx",
						"_search"
					]
				}
			},
			"response": []
		},
		{
			"name": "request-body-search-1",
			"request": {
				"method": "POST",
				"header": [
					{
						"key": "Content-Type",
						"type": "text",
						"value": "application/json"
					}
				],
				"body": {
					"mode": "raw",
					"raw": "{\n    \"size\": 5,\n    \"query\": {\n        \"bool\": {\n            \"must\": [\n                {\n                    \"wildcard\": {\n                        \"user\": {\n                            \"wildcard\": \"*c*\",\n                            \"boost\": 1\n                        }\n                    }\n                },\n                {\n                    \"term\": {\n                        \"user\": {\n                            \"value\": \"abc\",\n                            \"boost\": 1\n                        }\n                    }\n                }\n            ],\n            \"adjust_pure_negative\": true,\n            \"boost\": 1\n        }\n    },\n    \"_source\": {\n        \"includes\": [\n            \"descript.last\",\n            \"message\",\n            \"text\"\n        ],\n        \"excludes\": []\n    },\n    \"docvalue_fields\": [\n        {\n            \"field\": \"author\",\n            \"format\": \"use_field_mapping\"\n        },\n        {\n            \"field\": \"post_date\",\n            \"format\": \"epoch_millis\"\n        },\n        {\n            \"field\": \"user\",\n            \"format\": \"use_field_mapping\"\n        }\n    ],\n    \"sort\": [\n        {\n            \"user\": {\n                \"order\": \"desc\"\n            }\n        }\n    ]\n}"
				},
				"url": {
					"raw": "{{es_address_url}}/twitter/_search",
					"host": [
						"{{es_address_url}}"
					],
					"path": [
						"twitter",
						"_search"
					]
				}
			},
			"response": []
		},
		{
			"name": "request-body-search-2",
			"request": {
				"method": "POST",
				"header": [
					{
						"key": "Content-Type",
						"type": "text",
						"value": "application/json"
					}
				],
				"body": {
					"mode": "raw",
					"raw": "{\n    \"size\": 5,\n    \"query\": {\n        \"wildcard\": {\n            \"user\": {\n                \"wildcard\": \"*c*\",\n                \"boost\": 1\n            }\n        }\n    },\n    \"_source\": {\n        \"includes\": [\n            \"descript.last\",\n            \"message\",\n            \"text\"\n        ],\n        \"excludes\": []\n    },\n    \"docvalue_fields\": [\n        {\n            \"field\": \"author\",\n            \"format\": \"use_field_mapping\"\n        },\n        {\n            \"field\": \"post_date\",\n            \"format\": \"epoch_millis\"\n        },\n        {\n            \"field\": \"user\",\n            \"format\": \"use_field_mapping\"\n        }\n    ],\n    \"sort\": [\n        {\n            \"user\": {\n                \"order\": \"desc\"\n            }\n        }\n    ]\n}"
				},
				"url": {
					"raw": "{{es_address_url}}/twitter/_search",
					"host": [
						"{{es_address_url}}"
					],
					"path": [
						"twitter",
						"_search"
					]
				}
			},
			"response": []
		},
		{
			"name": "request-body-search-3",
			"request": {
				"method": "POST",
				"header": [
					{
						"key": "Content-Type",
						"type": "text",
						"value": "application/json"
					}
				],
				"body": {
					"mode": "raw",
					"raw": "{\n    \"size\": 5,\n    \"query\": {\n        \"wildcard\": {\n            \"user\": {\n                \"wildcard\": \"*c*\",\n                \"boost\": 1\n            }\n        }\n    },\n    \"_source\": {\n        \"includes\": [\n            \"descript.last\",\n            \"message\",\n            \"text\"\n        ],\n        \"excludes\": []\n    },\n    \"docvalue_fields\": [\n        {\n            \"field\": \"author\",\n            \"format\": \"use_field_mapping\"\n        },\n        {\n            \"field\": \"post_date\",\n            \"format\": \"epoch_millis\"\n        },\n        {\n            \"field\": \"user\",\n            \"format\": \"use_field_mapping\"\n        }\n    ],\n    \"sort\": [\n        {\n            \"user\": {\n                \"order\": \"desc\"\n            }\n        }\n    ]\n}"
				},
				"url": {
					"raw": "{{es_address_url}}/twitter/_search",
					"host": [
						"{{es_address_url}}"
					],
					"path": [
						"twitter",
						"_search"
					]
				}
			},
			"response": []
		},
		{
			"name": "request-body-search-4",
			"request": {
				"method": "POST",
				"header": [
					{
						"key": "Content-Type",
						"type": "text",
						"value": "application/json"
					}
				],
				"body": {
					"mode": "raw",
					"raw": "{\n    \"size\": 5,\n    \"query\": {\n        \"wildcard\": {\n            \"user\": {\n                \"wildcard\": \"*c*\",\n                \"boost\": 1\n            }\n        }\n    },\n    \"_source\": {\n        \"includes\": [\n            \"descript.last\",\n            \"message\",\n            \"text\"\n        ],\n        \"excludes\": []\n    },\n    \"docvalue_fields\": [\n        {\n            \"field\": \"author\",\n            \"format\": \"use_field_mapping\"\n        },\n        {\n            \"field\": \"post_date\",\n            \"format\": \"epoch_millis\"\n        },\n        {\n            \"field\": \"user\",\n            \"format\": \"use_field_mapping\"\n        }\n    ],\n    \"sort\": [\n        {\n            \"user\": {\n                \"order\": \"desc\"\n            }\n        }\n    ]\n}"
				},
				"url": {
					"raw": "{{es_address_url}}/twitter/_search",
					"host": [
						"{{es_address_url}}"
					],
					"path": [
						"twitter",
						"_search"
					]
				}
			},
			"response": []
		},
		{
			"name": "request-body-search-all",
			"request": {
				"method": "POST",
				"header": [
					{
						"key": "Content-Type",
						"type": "text",
						"value": "application/json"
					}
				],
				"body": {
					"mode": "raw",
					"raw": "{\n    \"query\": {\n        \"bool\": {\n            \"must\": [\n                {\n                    \"match_all\": {}\n                }\n            ],\n            \"must_not\": [],\n            \"should\": []\n        }\n    },\n    \"from\": 0,\n    \"size\": 10,\n    \"sort\": [],\n    \"aggs\": {}\n}"
				},
				"url": {
					"raw": "{{es_url}}/twitterx/_search",
					"host": [
						"{{es_url}}"
					],
					"path": [
						"twitterx",
						"_search"
					]
				}
			},
			"response": []
		},
		{
			"name": "_analyze",
			"request": {
				"method": "POST",
				"header": [
					{
						"key": "Content-Type",
						"type": "text",
						"value": "application/json"
					}
				],
				"body": {
					"mode": "raw",
					"raw": "{\n  \"analyzer\": \"ik_max_word\",\n  \"text\":\"广东省广州市白云区金围东路5号310房,广东省广州市白云区中八松岗西街三巷8号\"\n}\n\n"
				},
				"url": {
					"raw": "{{es_address_url}}/_analyze",
					"host": [
						"{{es_address_url}}"
					],
					"path": [
						"_analyze"
					]
				}
			},
			"response": []
		},
		{
			"name": "{{es_address_url}}/_search/template",
			"request": {
				"method": "POST",
				"header": [
					{
						"key": "Content-Type",
						"value": "application/json",
						"type": "text"
					}
				],
				"body": {
					"mode": "raw",
					"raw": "{\n    \"source\" : {\n      \"query\": { \"match\" : { \"{{my_field}}\" : \"{{my_value}}\" } },\n      \"size\" : \"{{my_size}}\"\n    },\n    \"params\" : {\n        \"my_field\" : \"name\",\n        \"my_value\" : \"abc\",\n        \"my_size\" : 2\n    }\n}"
				},
				"url": {
					"raw": "{{es_address_url}}/_search/template",
					"host": [
						"{{es_address_url}}"
					],
					"path": [
						"_search",
						"template"
					]
				}
			},
			"response": []
		},
		{
			"name": "{{es_address_url}}/_search/template Copy",
			"request": {
				"method": "POST",
				"header": [
					{
						"key": "Content-Type",
						"value": "application/json",
						"type": "text"
					}
				],
				"body": {
					"mode": "raw",
					"raw": "{\n  \"source\": \"{ \\\"query\\\": { \\\"terms\\\": {{#toJson}}statuses{{/toJson}} }}\",\n  \"params\": {\n    \"statuses\" : {\n        \"status\": [ \"pending\", \"published\" ]\n    }\n  }\n}"
				},
				"url": {
					"raw": "{{es_address_url}}/_search/template",
					"host": [
						"{{es_address_url}}"
					],
					"path": [
						"_search",
						"template"
					]
				}
			},
			"response": []
		},
		{
			"name": "{{es_address_url}}/_search/template Copy Copy",
			"request": {
				"method": "POST",
				"header": [
					{
						"key": "Content-Type",
						"value": "application/json",
						"type": "text"
					}
				],
				"body": {
					"mode": "raw",
					"raw": "{\n    \"source\" : {\n      \"query\": { \"match\" : { \"{{my_field}}\" : \"{{my_value}}\" } },\n      \"size\" : \"{{my_size}}\"\n    },\n    \"params\" : {\n        \"my_field\" : \"name\",\n        \"my_value\" : \"abc\",\n        \"my_size\" : 2\n    }\n}"
				},
				"url": {
					"raw": "{{es_address_url}}/_search/template",
					"host": [
						"{{es_address_url}}"
					],
					"path": [
						"_search",
						"template"
					]
				}
			},
			"response": []
		}
	]
}