1154.xml,1941,09,01,3,24,7
127.xml,1940,10,25,6,34,16
745.xml,1944,11,30,2,10,10
638.xml,1942,11,23,4,8,9
1096.xml,1943,07,05,9,26,6
287.xml,1941,11,11,4,16,6
829.xml,1941,08,30,5,20,8
124.xml,1941,12,22,8,29,17
156.xml,1941,11,11,1,17,10
85.xml,1941,01,26,4,25,6
901.xml,1944,12,24,0,9,4
616.xml,1942,11,14,5,19,11
893.xml,1944,07,30,4,30,12
1228.xml,1942,11,01,5,33,7
832.xml,1944,07,20,1,5,4
1154.xml,1941,09,01,3,24,7
127.xml,1940,10,25,6,34,16
745.xml,1944,11,30,2,10,10
638.xml,1942,11,23,4,8,9
1096.xml,1943,07,05,9,26,6
287.xml,1941,11,11,4,16,6
829.xml,1941,08,30,5,20,8
124.xml,1941,12,22,8,29,17
156.xml,1941,11,11,1,17,10
85.xml,1941,01,26,4,25,6
901.xml,1944,12,24,0,9,4
616.xml,1942,11,14,5,19,11
893.xml,1944,07,30,4,30,12
1228.xml,1942,11,01,5,33,7
832.xml,1944,07,20,1,5,4
35.xml,1941,07,13,3,9,15
1359.xml,1943,08,07,1,11,5
960.xml,1940,04,09,1,24,2
1377.xml,1939,10,02,2,18,5
1424.xml,1941,10,12,3,10,6
1295.xml,1940,11,11,5,32,19
1064.xml,1945,03,21,5,6,8
554.xml,1939,10,24,1,10,2
933.xml,1941,10,18,3,58,7
1484.xml,1944,10,10,3,22,5
1256.xml,1944,09,10,4,8,5
545.xml,1942,11,25,2,44,11
589.xml,1940,12,25,9,23,8
973.xml,1941,06,08,0,25,4
1078.xml,1940,07,07,10,26,13
759.xml,1943,10,13,1,16,5
913.xml,1942,07,20,1,7,3
187.xml,1941,12,17,3,11,4
685.xml,1942,12,25,2,21,11
1575.xml,1941,02,07,2,11,2
750.xml,1944,11,30,4,12,4
678.xml,1942,12,25,6,62,10
334.xml,1940,10,25,4,32,8
364.xml,1943,12,11,0,14,5
1244.xml,1944,02,22,2,10,7
1408.xml,1943,11,30,2,18,5
1010.xml,1941,07,08,2,11,11
895.xml,1944,09,20,3,29,7
1306.xml,1944,08,01,4,6,3
1061.xml,1945,02,24,10,30,11
197.xml,1940,10,25,7,22,4
1017.xml,1942,02,21,17,55,24
550.xml,1943,10,18,0,5,1
908.xml,1940,09,19,1,10,0
719.xml,1941,12,21,0,1,0
818.xml,1940,06,03,2,12,6
846.xml,1942,01,25,12,45,23
1169.xml,1942,12,17,2,11,5
1014.xml,1941,12,25,11,38,10
800.xml,1945,12,16,10,31,11
768.xml,1943,10,13,3,12,3
1340.xml,1939,09,03,3,14,8
677.xml,1942,12,25,3,30,11
450.xml,1944,10,30,2,15,5
1066.xml,1943,12,21,10,9,6
1128.xml,1940,06,13,1,13,8
529.xml,1939,12,14,6,33,18
1094.xml,1943,02,06,2,12,7
1411.xml,1944,02,04,8,12,7
1589.xml,1944,06,10,13,63,19
604.xml,1945,03,03,1,12,11
1370.xml,1944,04,16,2,21,7
1354.xml,1941,06,20,3,12,5
876.xml,1944,11,13,2,5,1
383.xml,1943,11,21,1,4,11
968.xml,1940,07,19,3,109,13
1415.xml,1941,10,12,4,13,3
317.xml,1942,11,11,14,60,34
841.xml,1941,11,16,26,45,24
985.xml,1941,09,28,7,71,15
1455.xml,1945,04,06,2,24,11
590.xml,1940,12,25,14,74,36
647.xml,1942,11,23,6,28,13
617.xml,1940,10,28,6,27,12
1365.xml,1943,09,30,2,13,8
1465.xml,1941,03,19,2,18,3
1033.xml,1944,07,09,8,25,14
409.xml,1943,11,21,5,13,8
871.xml,1941,08,01,9,25,14
1141.xml,1941,07,15,0,14,6
1225.xml,1945,01,01,19,69,17
828.xml,1941,08,24,7,14,7
365.xml,1941,10,24,6,24,10
1355.xml,1941,10,19,2,9,6
1357.xml,1943,05,08,9,19,8
599.xml,1945,01,22,8,16,9
738.xml,1943,12,19,3,20,9
575.xml,1941,11,13,3,25,8
1374.xml,1939,09,11,1,13,8
1075.xml,1940,05,05,5,53,34
643.xml,1942,11,23,3,13,17
528.xml,1943,11,21,1,6,4
70.xml,1940,11,16,2,16,2
78.xml,1940,11,28,9,6,10
592.xml,1941,10,30,10,52,18
1495.xml,1945,03,23,6,22,12
1190.xml,1942,08,11,2,32,11
956.xml,1945,05,06,2,4,3
1402.xml,1944,05,20,1,12,14
746.xml,1944,11,30,4,9,7
971.xml,1940,11,22,1,38,6
984.xml,1941,09,29,4,64,17
243.xml,1941,12,22,7,22,7
1348.xml,1939,09,30,9,21,6
198.xml,1941,12,13,11,31,2
1475.xml,1942,11,22,16,83,49
1148.xml,1941,11,22,0,24,6
1052.xml,1944,01,27,9,33,21
833.xml,1945,01,02,3,17,5
849.xml,1943,02,05,6,31,15
1032.xml,1943,04,23,6,30,4
1012.xml,1941,07,21,3,10,10
1043.xml,1943,09,05,4,26,6
1421.xml,1941,10,12,3,5,6
621.xml,1940,10,12,5,11,8
1069.xml,1944,09,23,9,9,2
1153.xml,1941,08,19,1,17,17
584.xml,1940,12,25,4,25,15
670.xml,1942,12,25,2,22,8
942.xml,1941,10,18,0,1,0
1558.xml,1941,10,12,1,9,4
872.xml,1941,08,14,9,47,14
704.xml,1940,10,27,8,22,6
736.xml,1943,12,19,0,1,0
571.xml,1939,10,24,8,25,14
1570.xml,1944,09,08,10,34,10
812.xml,1940,02,25,4,18,5
377.xml,1944,10,19,6,35,18
1539.xml,1945,03,21,1,1,4
1322.xml,1940,11,11,3,23,8
1156.xml,1941,12,02,3,21,23
1110.xml,1943,12,19,10,31,20
905.xml,1945,02,08,4,6,5
967.xml,1940,07,17,9,59,10
1568.xml,1944,07,08,15,52,13
543.xml,1942,11,25,6,24,6
672.xml,1942,12,25,5,21,11
1457.xml,1943,07,22,1,15,4
1216.xml,1945,02,11,1,16,2
248.xml,1941,11,11,8,45,20
387.xml,1943,11,21,3,20,7
164.xml,1941,10,13,11,30,7
1152.xml,1941,08,02,1,17,9
144.xml,1941,11,11,5,13,21
1089.xml,1941,09,08,6,21,12
948.xml,1941,10,30,4,13,11
659.xml,1943,10,13,4,10,6
1283.xml,1939,11,11,3,46,20
1510.xml,1943,11,28,2,8,0
926.xml,1939,12,26,2,54,17
1252.xml,1944,07,23,1,18,7
1598.xml,1945,04,29,6,62,23
989.xml,1941,11,28,3,82,5
957.xml,1939,10,01,0,41,7
1041.xml,1943,07,27,8,27,30
830.xml,1941,10,21,3,23,14
183.xml,1940,11,16,1,18,2
630.xml,1940,10,12,1,33,3
215.xml,1942,11,11,17,77,60
770.xml,1943,10,13,1,22,7
761.xml,1943,10,13,2,11,1
966.xml,1940,07,13,6,69,20
1488.xml,1944,06,21,5,30,11
857.xml,1940,04,25,6,32,13
1489.xml,1944,08,31,4,29,14
1591.xml,1944,07,19,9,57,7
1020.xml,1942,04,21,3,25,5
702.xml,1940,10,27,4,13,3
109.xml,1939,10,15,3,15,6
804.xml,1941,08,02,3,21,15
758.xml,1943,10,13,2,17,6
1272.xml,1944,01,09,0,11,7
969.xml,1940,09,10,13,168,34
597.xml,1940,10,28,4,18,11
1396.xml,1943,01,09,8,24,11
1063.xml,1945,03,02,3,43,12
1241.xml,1944,02,11,5,13,11
676.xml,1942,12,25,7,27,19
1253.xml,1944,08,10,2,18,9
1394.xml,1942,12,26,5,32,14
1305.xml,1944,02,27,3,27,9
762.xml,1943,10,13,4,28,9
1312.xml,1945,02,19,7,45,13
766.xml,1943,10,13,5,11,2
683.xml,1942,12,25,5,17,9
343.xml,1943,11,16,1,18,5
1207.xml,1944,07,26,3,15,9
551.xml,1942,12,23,1,7,3
986.xml,1941,10,28,10,70,17
1356.xml,1943,04,21,5,32,11
25.xml,1939,12,14,5,23,15
277.xml,1941,11,11,1,17,10
1059.xml,1944,07,22,6,15,11
1381.xml,1940,02,07,4,24,6
1449.xml,1941,11,24,7,58,24
983.xml,1941,09,14,3,41,15
1486.xml,1944,10,22,1,25,9
1024.xml,1942,08,13,6,20,11
994.xml,1942,11,16,7,44,16
1328.xml,1942,04,18,6,14,8
1025.xml,1942,08,19,1,28,10
669.xml,1942,12,25,0,1,0
86.xml,1940,10,25,5,44,10
1445.xml,1941,09,14,12,66,35
1453.xml,1941,12,06,5,34,14
652.xml,1943,10,13,4,7,3
1240.xml,1942,02,10,2,9,15
441.xml,1943,12,11,1,28,2
1425.xml,1941,10,12,0,20,4
923.xml,1939,12,26,4,20,14
401.xml,1943,10,20,6,30,18
1578.xml,1942,09,19,1,10,2
928.xml,1942,12,24,8,61,13
1508.xml,1943,07,06,4,7,7
1200.xml,1943,07,24,4,26,3
1124.xml,1940,03,27,7,22,13
1172.xml,1943,02,25,6,32,13
352.xml,1943,12,22,7,29,15
667.xml,1942,12,25,4,45,11
223.xml,1941,12,22,8,26,10
3.xml,1940,11,16,0,19,7
1542.xml,1939,09,09,2,39,18
1503.xml,1942,10,25,4,22,7
870.xml,1941,07,30,8,32,6
1109.xml,1943,12,19,2,17,4
1178.xml,1939,09,17,6,23,15
1070.xml,1939,08,10,4,17,4
1338.xml,1943,01,24,5,25,6
1011.xml,1941,07,13,7,41,8
1371.xml,1945,01,11,3,6,6
1159.xml,1941,12,28,9,28,9
1254.xml,1944,08,25,4,39,26
1329.xml,1942,04,18,3,25,16
730.xml,1943,12,19,0,1,0
1074.xml,1939,11,20,6,43,19
803.xml,1941,07,11,7,34,31
787.xml,1943,10,13,1,11,4
1388.xml,1939,12,19,0,9,1
196.xml,1941,11,11,8,10,6
1335.xml,1940,10,12,9,35,9
1472.xml,1942,06,25,6,12,14
701.xml,1940,10,27,1,15,4
146.xml,1943,11,28,2,11,3
353.xml,1943,12,11,1,12,5
1476.xml,1943,06,09,8,27,18
598.xml,1945,02,12,8,32,17
610.xml,1940,10,28,17,33,10
1171.xml,1943,02,10,0,24,12
1418.xml,1941,10,20,3,42,40
1183.xml,1941,08,19,1,30,7
666.xml,1942,12,25,5,14,8
940.xml,1941,10,18,2,56,13
782.xml,1943,10,13,5,18,9
157.xml,1941,11,11,9,35,18
697.xml,1940,12,29,9,37,9
978.xml,1941,07,20,6,80,13
975.xml,1941,06,26,3,48,10
1372.xml,1945,01,19,2,9,4
774.xml,1943,10,13,8,23,21
648.xml,1942,11,23,4,19,7
1214.xml,1944,09,17,1,17,6
569.xml,1939,10,24,4,23,10
432.xml,1944,10,19,5,37,9
1007.xml,1941,06,23,1,13,2
932.xml,1941,10,18,0,39,8
680.xml,1942,12,25,4,72,27
1561.xml,1940,06,03,6,30,6
1008.xml,1941,06,16,4,10,2
1181.xml,1940,05,19,20,183,56
1498.xml,1942,05,27,1,13,8
386.xml,1943,10,20,5,9,7
20.xml,1939,10,15,4,23,8
883.xml,1944,05,13,0,27,12
1257.xml,1944,10,02,3,8,10
1482.xml,1944,08,09,2,12,8
651.xml,1943,10,13,3,31,17
442.xml,1944,10,11,1,12,6
662.xml,1943,10,13,5,10,3
771.xml,1943,10,13,4,21,9
991.xml,1941,12,06,3,49,12
686.xml,1942,12,25,5,20,15
1399.xml,1943,09,19,0,28,23
814.xml,1940,05,14,3,10,4
827.xml,1941,08,12,5,16,7
875.xml,1944,10,17,3,20,4
280.xml,1942,12,22,3,15,10
907.xml,1944,02,12,28,135,52
1036.xml,1944,10,24,5,46,4
1318.xml,1940,07,26,5,24,14
67.xml,1939,10,15,5,12,12
1513.xml,1944,06,07,1,8,3
230.xml,1942,11,11,15,56,26
1284.xml,1939,10,19,0,3,0
1297.xml,1941,03,29,3,20,5
235.xml,1942,11,11,25,70,52
642.xml,1942,11,23,11,36,13
1302.xml,1941,09,23,3,59,20
1580.xml,1943,01,12,5,30,5
1563.xml,1942,07,03,5,25,8
1237.xml,1943,07,18,9,40,8
987.xml,1941,10,29,4,86,11
1238.xml,1943,09,14,2,30,4
693.xml,1940,10,27,7,15,9
1337.xml,1942,11,25,3,19,10
706.xml,1942,11,20,3,14,7
110.xml,1939,10,15,1,6,5
1219.xml,1941,08,18,9,24,6
518.xml,1943,12,11,7,38,21
313.xml,1940,10,25,6,28,5
1285.xml,1940,01,20,6,29,17
1336.xml,1942,11,25,1,28,4
1346.xml,1939,09,22,4,29,8
422.xml,1944,11,25,0,16,8
1286.xml,1940,02,15,3,24,5
406.xml,1944,10,11,5,21,11
1588.xml,1944,03,03,2,12,3
1294.xml,1940,10,19,7,18,6
626.xml,1940,10,12,3,48,18
1436.xml,1940,08,09,6,35,12
1529.xml,1941,02,08,1,6,5
1434.xml,1940,05,13,9,22,17
531.xml,1941,10,24,1,21,9
733.xml,1943,12,19,1,12,3
56.xml,1940,11,16,5,17,1
548.xml,1942,12,23,2,6,1
418.xml,1944,10,11,10,107,52
1349.xml,1939,10,05,8,34,10
1101.xml,1944,01,31,6,12,14
1398.xml,1943,02,28,8,38,23
1246.xml,1944,02,18,7,19,15
1174.xml,1943,08,04,1,7,10
1218.xml,1941,08,14,5,13,12
922.xml,1939,12,26,1,20,6
281.xml,1942,12,24,6,17,5
1026.xml,1942,08,31,12,30,20
1564.xml,1942,07,22,3,7,2
851.xml,1943,03,15,5,34,3
1303.xml,1941,10,08,3,26,8
579.xml,1942,12,31,8,39,7
546.xml,1942,11,25,11,71,20
253.xml,1942,11,11,28,109,67
1432.xml,1940,03,11,8,64,19
1076.xml,1940,05,20,3,1,1
131.xml,1941,11,11,6,20,10
1276.xml,1944,03,20,1,9,8
886.xml,1944,05,27,3,25,17
769.xml,1943,10,13,4,12,6
1102.xml,1944,02,17,3,12,9
1001.xml,1943,05,03,6,75,11
574.xml,1939,10,24,10,46,13
806.xml,1941,08,31,2,29,14
1044.xml,1943,09,10,5,27,14
665.xml,1942,12,25,1,19,6
1273.xml,1944,02,05,2,11,4
836.xml,1941,04,10,4,15,10
1229.xml,1942,11,22,3,44,7
1270.xml,1943,12,12,2,5,3
1579.xml,1942,10,08,9,36,8
542.xml,1942,11,25,3,26,4
1376.xml,1939,09,29,5,20,13
1487.xml,1944,05,30,6,23,8
1173.xml,1943,04,24,3,14,10
1515.xml,1944,06,19,2,14,5
1188.xml,1942,03,13,10,59,23
1189.xml,1942,05,21,4,52,11
1289.xml,1939,10,19,0,3,0
95.xml,1941,12,22,15,130,61
1212.xml,1944,11,09,2,13,4
138.xml,1941,11,11,4,10,10
247.xml,1941,12,22,25,70,30
791.xml,1943,10,13,4,13,6
1440.xml,1941,07,26,7,84,30
778.xml,1940,10,25,1,27,14
576.xml,1939,10,24,4,33,4
1478.xml,1943,08,10,1,29,23
346.xml,1943,11,28,3,12,4
193.xml,1941,12,13,4,24,2
393.xml,1943,10,20,6,16,8
1366.xml,1943,10,12,5,45,15
644.xml,1942,11,23,7,33,24
1500.xml,1942,07,04,2,9,11
1389.xml,1940,01,11,2,23,4
588.xml,1940,12,25,17,43,19
959.xml,1940,02,13,5,40,10
1120.xml,1939,08,31,3,14,4
717.xml,1941,12,21,33,69,17
389.xml,1941,10,24,12,35,28
1018.xml,1942,03,26,2,18,4
1149.xml,1942,02,23,5,22,3
1514.xml,1944,06,09,3,13,2
214.xml,1941,11,11,10,47,28
1309.xml,1944,11,14,3,48,15
1222.xml,1942,11,27,10,38,23
1315.xml,1939,10,27,4,30,17
727.xml,1943,12,19,0,1,0
10.xml,1939,11,13,3,14,3
1224.xml,1943,12,10,10,58,12
1105.xml,1945,03,31,2,1,2
744.xml,1944,11,30,2,16,8
1122.xml,1939,09,17,3,15,8
862.xml,1940,07,10,6,24,16
732.xml,1943,12,19,0,1,0
593.xml,1940,12,25,26,81,41
786.xml,1943,10,13,1,17,8
802.xml,1941,07,06,9,68,31
674.xml,1942,12,25,3,36,15
709.xml,1942,11,20,3,9,7
1023.xml,1942,07,28,3,19,13
563.xml,1939,10,24,4,13,12
1577.xml,1942,06,18,1,23,0
747.xml,1944,11,30,0,14,5
583.xml,1940,12,25,8,57,17
700.xml,1940,10,27,2,14,2
897.xml,1944,12,04,1,7,9
1013.xml,1941,07,23,4,16,7
1079.xml,1940,09,15,3,25,7
930.xml,1941,10,18,6,55,15
1202.xml,1943,11,25,2,12,1
1263.xml,1941,09,10,1,18,6
798.xml,1945,03,25,6,23,4
1099.xml,1943,01,21,3,16,13
1314.xml,1939,10,19,6,46,18
632.xml,1940,10,12,3,37,16
943.xml,1945,03,02,2,28,8
1301.xml,1941,05,16,6,36,18
950.xml,1942,06,02,3,13,5
1400.xml,1943,10,10,5,22,30
845.xml,1942,01,02,9,27,17
188.xml,1941,12,20,3,7,16
1195.xml,1945,02,10,3,40,5
920.xml,1939,12,26,2,13,2
1379.xml,1939,10,22,7,13,10
41.xml,1941,07,13,2,14,7
1206.xml,1944,02,13,9,43,7
927.xml,1939,12,26,2,47,10
1245.xml,1944,06,17,10,19,5
1458.xml,1945,02,07,16,36,17
202.xml,1941,12,13,1,23,6
634.xml,1941,11,23,8,64,10
779.xml,1943,10,13,2,17,1
1269.xml,1943,11,14,2,24,14
232.xml,1941,10,24,5,60,34
739.xml,1944,11,30,8,34,11
1391.xml,1942,12,13,11,35,30
1416.xml,1941,10,12,5,16,9
1053.xml,1944,01,31,12,39,21
743.xml,1944,11,30,4,21,9
451.xml,1944,11,15,3,14,7
689.xml,1942,12,25,0,1,0
844.xml,1941,12,25,20,39,16
1145.xml,1941,09,02,8,11,17
961.xml,1940,06,03,6,34,9
815.xml,1940,05,18,1,20,9
1556.xml,1941,10,12,0,13,3
716.xml,1941,12,21,4,14,5
964.xml,1940,06,22,4,76,9
260.xml,1939,10,15,7,15,10
624.xml,1940,10,12,11,56,28
1146.xml,1941,09,30,1,15,11
535.xml,1942,12,23,4,18,6
1296.xml,1940,11,18,2,16,15
1104.xml,1946,01,20,7,28,10
1456.xml,1945,04,22,3,28,13
555.xml,1939,10,24,3,27,9
216.xml,1942,11,11,7,24,15
865.xml,1941,04,16,8,28,16
749.xml,1944,11,30,2,18,5
1571.xml,1944,09,11,8,35,20
572.xml,1941,06,21,10,21,9
613.xml,1940,10,28,9,42,14
1566.xml,1942,10,18,4,30,8
705.xml,1942,11,20,1,9,10
241.xml,1941,10,24,4,24,14
655.xml,1943,10,14,4,12,9
1048.xml,1943,11,04,10,94,28
182.xml,1941,11,26,10,30,26
1081.xml,1941,03,08,7,24,10
452.xml,1944,11,18,1,39,10
1444.xml,1941,08,28,6,69,27
1339.xml,1939,09,01,2,33,8
1519.xml,1945,04,15,2,21,13
949.xml,1942,04,10,8,21,9
1593.xml,1944,08,05,7,28,8
578.xml,1942,10,20,7,38,8
618.xml,1940,10,28,4,21,10
274.xml,1942,10,30,4,20,3
91.xml,1941,12,22,6,89,20
1097.xml,1944,03,08,6,32,14
660.xml,1943,10,13,2,7,11
1199.xml,1944,06,20,4,7,3
1235.xml,1943,05,30,10,42,19
169.xml,1941,10,24,4,25,13
1427.xml,1941,10,12,4,32,18
636.xml,1940,10,12,0,1,0
1531.xml,1942,02,22,0,15,4
1021.xml,1942,06,21,14,81,38
980.xml,1941,08,21,3,27,6
824.xml,1940,12,19,3,29,5
330.xml,1942,11,11,13,50,17
1213.xml,1944,11,22,6,26,3
1562.xml,1940,06,29,3,10,7
322.xml,1942,11,11,5,78,25
1114.xml,1942,01,12,2,10,11
430.xml,1944,10,11,7,29,18
1247.xml,1944,03,25,6,17,13
76.xml,1940,11,16,0,19,3
915.xml,1939,12,26,8,39,19
580.xml,1940,12,25,15,77,28
864.xml,1940,08,30,13,60,32
176.xml,1941,10,24,5,37,21
947.xml,1941,10,10,4,13,8
1363.xml,1943,08,30,5,21,8
403.xml,1943,10,20,8,42,19
838.xml,1941,06,11,12,58,16
611.xml,1940,10,28,6,19,9
615.xml,1940,10,28,7,25,7
724.xml,1943,12,19,0,1,0
74.xml,1940,10,25,9,26,16
1080.xml,1940,09,24,4,34,5
133.xml,1941,10,24,8,13,17
1327.xml,1942,04,18,2,29,10
1187.xml,1942,02,18,4,37,11
664.xml,1943,10,13,12,10,9
1459.xml,1944,08,04,2,7,7
1481.xml,1944,04,17,18,59,39
122.xml,1939,12,14,3,20,9
675.xml,1942,12,25,7,90,26
12.xml,1939,12,12,7,36,17
1261.xml,1948,04,27,3,21,17
944.xml,1945,03,10,5,27,13
1176.xml,1944,06,22,3,6,7
361.xml,1943,11,21,1,8,5
656.xml,1943,10,24,8,23,11
1323.xml,1940,11,18,7,23,16
1310.xml,1944,12,17,5,10,7
1113.xml,1942,01,06,6,17,12
1576.xml,1941,02,10,7,18,9
1150.xml,1942,04,08,1,8,6
637.xml,1942,11,23,4,16,3
866.xml,1941,05,09,25,67,69
1039.xml,1943,06,31,3,20,12
240.xml,1942,11,11,16,68,31
859.xml,1940,06,12,7,31,7
995.xml,1942,12,11,3,40,8
560.xml,1939,10,24,7,35,13
1569.xml,1944,08,06,4,31,9
860.xml,1940,07,04,8,38,19
175.xml,1940,10,25,3,29,15
285.xml,1941,12,13,4,17,5
1412.xml,1944,03,13,4,13,15
457.xml,1944,11,26,3,16,9
1134.xml,1940,09,11,1,8,5
826.xml,1941,07,16,1,12,9
953.xml,1944,12,14,3,17,11
1443.xml,1941,08,25,12,108,33
889.xml,1944,06,26,4,21,5
1035.xml,1944,10,16,1,28,10
1560.xml,1941,10,12,0,5,2
485.xml,1943,12,11,2,20,10
742.xml,1944,11,30,1,10,2
1390.xml,1942,11,08,5,20,18
785.xml,1943,10,13,2,8,6
817.xml,1940,05,26,1,18,3
113.xml,1939,12,14,19,97,44
936.xml,1941,10,18,5,45,13
423.xml,1944,10,30,1,14,5
1140.xml,1941,06,26,7,14,5
1345.xml,1939,09,16,3,15,9
861.xml,1940,07,08,7,26,19
1342.xml,1939,09,05,0,2,2
1470.xml,1941,09,04,6,15,3
443.xml,1944,10,11,5,17,2
191.xml,1941,12,24,2,28,11
262.xml,1941,12,20,2,19,10
888.xml,1944,06,03,2,20,4
427.xml,1941,10,24,8,24,10
1316.xml,1939,12,02,9,63,37
1480.xml,1943,10,02,5,47,15
160.xml,1941,07,13,8,16,8
179.xml,1941,11,23,3,21,13
342.xml,1943,11,12,1,21,7
795.xml,1945,01,15,1,15,11
1597.xml,1945,04,17,1,28,7
1574.xml,1940,06,04,1,26,3
1208.xml,1944,10,14,1,9,5
557.xml,1939,10,24,6,43,7
1544.xml,1939,12,11,3,31,11
1319.xml,1940,08,07,3,8,9
858.xml,1940,06,04,4,43,17
1092.xml,1941,11,30,3,29,17
1331.xml,1942,07,26,0,3,0
225.xml,1940,10,25,6,35,10
278.xml,1942,12,10,4,16,12
1483.xml,1944,08,17,2,22,7
992.xml,1942,10,26,8,98,22
1596.xml,1945,01,18,2,11,3
692.xml,1942,12,25,0,1,0
691.xml,1942,12,25,6,19,8
1446.xml,1941,09,30,6,77,22
1003.xml,1943,04,23,2,53,9
1143.xml,1941,07,31,2,11,6
1095.xml,1943,05,04,2,28,6
848.xml,1942,03,17,6,16,5
1002.xml,1943,03,11,13,51,14
807.xml,1944,10,18,6,18,4
1378.xml,1939,10,10,2,13,5
1347.xml,1939,09,26,5,67,27
1582.xml,1943,02,20,0,15,3
1325.xml,1943,09,24,2,29,12
1177.xml,1939,09,04,5,13,4
181.xml,1941,11,24,7,17,12
868.xml,1941,07,01,10,23,13
1071.xml,1939,09,18,2,18,4
390.xml,1943,11,21,1,8,4
1121.xml,1939,09,12,3,15,7
1429.xml,1940,01,02,6,30,14
734.xml,1943,12,19,12,31,12
7.xml,1939,10,27,3,13,9
587.xml,1940,12,25,2,11,6
1058.xml,1944,03,27,4,18,12
695.xml,1940,10,27,3,14,6
1437.xml,1940,09,19,12,69,22
1182.xml,1940,05,28,6,61,17
1268.xml,1943,11,10,1,7,5
221.xml,1940,10,25,3,8,1
335.xml,1943,11,21,1,10,3
799.xml,1945,06,16,1,3,4
710.xml,1943,09,30,6,14,8
684.xml,1942,12,25,0,1,0
1258.xml,1944,10,18,1,9,8
741.xml,1944,11,30,3,24,9
781.xml,1943,10,13,3,15,6
276.xml,1942,11,29,7,4,6
1375.xml,1939,09,26,4,12,3
1090.xml,1941,09,27,1,42,27
1499.xml,1942,06,12,4,7,5
696.xml,1940,12,12,6,11,8
1073.xml,1939,11,16,13,60,29
73.xml,1939,10,15,8,9,9
1530.xml,1942,07,04,5,11,6
703.xml,1941,10,19,3,21,7
180.xml,1941,11,24,1,34,5
924.xml,1939,12,26,1,22,3
1497.xml,1941,12,25,8,28,5
1248.xml,1944,04,13,2,25,7
174.xml,1941,10,24,4,17,9
725.xml,1943,12,19,0,1,0
885.xml,1944,05,21,2,38,10
316.xml,1942,11,11,13,106,25
547.xml,1942,12,23,1,51,9
224.xml,1942,11,11,4,30,12
777.xml,1940,10,25,7,24,13
1506.xml,1945,05,12,3,10,8
1136.xml,1941,02,19,5,18,5
1501.xml,1942,08,04,1,5,0
151.xml,1941,12,22,8,18,12
1127.xml,1940,05,28,1,14,7
999.xml,1943,02,16,6,65,10
1332.xml,1945,04,08,7,34,30
600.xml,1945,01,29,4,17,6
566.xml,1940,12,10,3,13,9
903.xml,1941,07,21,10,14,12
790.xml,1943,10,13,3,15,2
1401.xml,1942,11,08,1,11,12
116.xml,1939,10,15,5,8,6
1083.xml,1941,04,24,12,44,14
108.xml,1941,12,22,2,17,7
1111.xml,1944,01,30,2,15,9
837.xml,1941,05,11,6,26,17
134.xml,1939,12,14,3,13,13
793.xml,1942,11,11,11,63,53
1088.xml,1941,08,28,7,39,14
1249.xml,1944,04,24,9,39,17
954.xml,1945,01,09,1,8,5
1242.xml,1944,02,14,9,27,17
601.xml,1940,10,28,9,20,8
558.xml,1939,12,26,10,41,6
1504.xml,1942,12,24,0,11,1
1383.xml,1940,03,17,4,14,5
783.xml,1943,10,13,5,16,9
391.xml,1943,10,20,3,22,9
918.xml,1939,12,26,8,94,26
1438.xml,1940,10,06,6,23,21
679.xml,1942,12,25,4,6,3
1125.xml,1940,04,19,4,10,13
1022.xml,1942,06,25,10,54,24
1186.xml,1942,02,06,1,8,6
1380.xml,1939,12,25,1,11,2
1317.xml,1940,02,15,0,36,11
816.xml,1940,05,22,1,20,7
96.xml,1940,11,16,3,24,4
264.xml,1941,11,11,3,3,6
1139.xml,1941,06,24,2,14,3
549.xml,1942,12,23,2,11,4
627.xml,1940,10,12,5,11,7
1477.xml,1943,07,15,7,27,19
625.xml,1940,10,12,9,39,11
397.xml,1943,10,20,6,37,28
884.xml,1944,05,19,2,15,2
257.xml,1942,11,11,6,26,9
220.xml,1939,12,14,4,13,20
37.xml,1941,07,13,6,11,8
1557.xml,1941,10,12,1,7,5
1384.xml,1940,04,23,4,13,18
1221.xml,1942,09,04,11,99,34
1223.xml,1942,12,12,26,109,51
1280.xml,1944,04,20,1,27,9
1439.xml,1941,04,13,3,29,12
154.xml,1941,09,13,8,31,13
1307.xml,1944,08,12,6,23,16
682.xml,1942,12,25,9,54,17
976.xml,1941,07,02,1,45,9
83.xml,1941,01,13,13,26,8
606.xml,1945,03,06,5,31,7
881.xml,1944,04,01,1,8,3
1387.xml,1939,09,30,1,11,3
1234.xml,1943,05,07,14,65,19
1192.xml,1943,06,04,0,5,0
350.xml,1942,11,11,25,117,64
946.xml,1945,03,30,9,39,9
581.xml,1940,12,25,6,25,4
454.xml,1944,11,24,3,25,4
1142.xml,1941,07,23,1,7,7
1334.xml,1940,11,29,2,48,7
1116.xml,1942,01,24,5,14,8
1179.xml,1940,05,04,4,9,2
1231.xml,1943,01,08,9,23,9
1343.xml,1939,09,13,6,40,13
117.xml,1939,10,15,6,21,4
1047.xml,1943,10,22,2,12,4
1479.xml,1943,09,27,7,41,21
1243.xml,1944,02,15,5,9,4
594.xml,1940,12,25,15,59,31
796.xml,1945,02,27,4,10,6
426.xml,1944,10,11,7,41,16
843.xml,1941,12,21,20,37,11
776.xml,1943,10,13,2,12,2
1138.xml,1941,06,21,6,10,9
1586.xml,1943,12,05,2,6,2
1373.xml,1945,02,20,0,15,5
1203.xml,1943,12,15,2,16,3
1534.xml,1940,02,25,4,10,2
788.xml,1943,10,13,1,13,4
708.xml,1942,11,20,1,10,3
748.xml,1944,11,30,5,30,15
242.xml,1942,06,20,4,19,9
623.xml,1940,10,12,1,13,6
1155.xml,1941,11,07,1,13,9
1279.xml,1944,04,02,3,14,7
527.xml,1940,11,16,5,25,6
1281.xml,1939,10,19,5,25,10
161.xml,1941,12,22,3,14,15
1448.xml,1941,11,19,9,74,29
1082.xml,1941,03,18,12,80,22
963.xml,1940,06,21,11,42,11
1057.xml,1944,03,06,7,20,5
200.xml,1941,11,11,2,17,9
1452.xml,1941,12,03,11,125,33
639.xml,1942,12,22,4,16,10
279.xml,1943,12,11,0,10,4
737.xml,1943,12,19,3,25,9
1226.xml,1945,02,15,25,85,36
1430.xml,1940,02,29,6,35,13
1426.xml,1941,10,12,2,12,7
1344.xml,1939,09,14,11,64,21
822.xml,1940,07,21,6,17,7
1054.xml,1944,03,30,6,11,3
382.xml,1943,10,20,9,11,12
1526.xml,1945,02,22,5,32,11
852.xml,1943,03,29,3,4,1
1433.xml,1940,03,26,10,34,14
1042.xml,1943,07,27,1,15,10
1201.xml,1943,08,09,0,17,10
699.xml,1940,10,27,5,8,4
1533.xml,1939,09,21,3,7,10
1166.xml,1942,08,29,4,17,19
728.xml,1943,12,19,0,1,0
721.xml,1943,12,19,12,48,6
993.xml,1942,11,12,8,54,8
1204.xml,1943,07,24,4,39,8
229.xml,1939,10,15,6,18,9
1512.xml,1944,02,04,4,28,15
1517.xml,1944,11,12,1,9,9
1313.xml,1945,03,09,0,3,0
1442.xml,1941,08,18,5,29,11
633.xml,1941,10,11,5,18,9
155.xml,1941,07,13,2,21,11
13.xml,1939,12,14,4,20,17
538.xml,1942,11,25,1,18,10
1293.xml,1940,08,20,0,19,6
874.xml,1943,10,30,7,57,23
603.xml,1945,02,17,1,12,11
466.xml,1944,12,26,0,16,1
269.xml,1942,09,06,1,21,9
1027.xml,1942,10,29,2,16,12
654.xml,1943,10,13,6,12,9
1162.xml,1942,07,06,1,8,5
641.xml,1942,11,23,8,22,9
879.xml,1945,04,07,1,2,3
595.xml,1940,12,25,15,79,34
938.xml,1941,10,18,0,9,3
977.xml,1941,07,09,6,71,16
5.xml,1939,10,15,3,14,16
453.xml,1944,11,20,4,39,10
1502.xml,1942,10,06,2,13,4
1536.xml,1945,03,15,1,6,2
1386.xml,1939,09,06,0,1,0
919.xml,1939,12,26,6,65,24
275.xml,1942,11,11,25,149,73
789.xml,1943,10,13,0,10,2
172.xml,1941,10,30,4,17,10
640.xml,1942,11,23,4,18,10
449.xml,1944,10,21,4,10,0
1298.xml,1941,04,06,8,29,11
1527.xml,1945,03,03,3,25,9
811.xml,1939,09,07,4,5,9
1160.xml,1942,01,16,1,15,7
904.xml,1942,03,13,5,14,4
1288.xml,1940,03,22,2,21,11
855.xml,1943,08,31,6,21,10
605.xml,1940,10,28,3,21,8
1516.xml,1944,11,09,2,52,16
539.xml,1942,11,25,6,28,13
1417.xml,1941,10,12,0,10,9
880.xml,1944,01,11,0,9,1
1151.xml,1939,08,31,3,16,3
1490.xml,1943,07,24,4,28,4
326.xml,1942,11,11,4,56,13
1034.xml,1944,09,06,2,23,9
1291.xml,1940,07,26,4,23,17
723.xml,1943,12,19,0,1,0
1463.xml,1940,09,02,5,22,2
1037.xml,1943,03,24,2,28,15
282.xml,1942,12,26,2,18,15
847.xml,1942,02,19,12,33,18
1028.xml,1942,12,28,5,24,4
1038.xml,1943,04,08,9,36,27
909.xml,1942,09,20,7,21,12
1126.xml,1940,05,26,0,4,1
1161.xml,1942,05,01,0,27,8
1414.xml,1944,05,20,7,2,5
429.xml,1944,10,11,12,50,12
1369.xml,1944,03,24,4,22,14
1194.xml,1943,08,26,5,54,16
1191.xml,1943,01,22,0,12,4
1454.xml,1941,12,14,2,23,6
1308.xml,1944,08,13,4,68,6
646.xml,1942,11,23,5,25,21
890.xml,1944,07,22,2,11,5
99.xml,1943,11,28,3,10,6
114.xml,1941,11,11,2,17,8
965.xml,1940,07,12,1,35,10
894.xml,1944,08,02,2,27,10
988.xml,1941,11,23,0,36,3
900.xml,1945,03,19,4,37,16
628.xml,1940,10,12,11,23,10
775.xml,1943,10,13,1,19,10
1300.xml,1941,04,30,1,37,16
951.xml,1944,10,22,4,20,17
412.xml,1943,10,20,12,45,17
668.xml,1942,12,25,6,50,21
1184.xml,1941,11,16,9,77,24
192.xml,1941,12,31,3,4,5
1473.xml,1942,12,28,4,12,3
596.xml,1940,10,28,7,19,15
559.xml,1939,12,31,5,81,28
44.xml,1939,12,14,9,48,25
1507.xml,1944,07,23,5,13,9
726.xml,1943,12,19,0,1,0
392.xml,1943,11,12,0,18,7
1108.xml,1943,12,19,2,7,7
246.xml,1942,11,11,25,88,49
1233.xml,1943,04,07,6,23,6
1540.xml,1939,09,02,3,31,6
820.xml,1940,06,17,8,16,11
567.xml,1939,10,24,0,27,26
1019.xml,1942,04,16,3,22,4
1420.xml,1941,12,11,4,20,8
152.xml,1940,10,25,4,33,11
863.xml,1940,08,04,10,35,34
1167.xml,1942,09,23,6,10,13
1131.xml,1940,07,18,1,18,7
226.xml,1939,12,14,5,26,19
681.xml,1942,12,25,1,32,7
1333.xml,1945,04,30,0,10,3
159.xml,1941,09,27,1,7,2
780.xml,1943,10,13,1,13,2
185.xml,1941,07,13,1,13,13
929.xml,1942,12,29,4,24,11
784.xml,1943,10,13,0,13,3
1197.xml,1940,03,14,4,16,5
1060.xml,1944,12,30,9,9,8
30.xml,1941,07,13,5,24,11
126.xml,1941,07,13,4,12,4
1367.xml,1943,11,17,6,27,12
561.xml,1939,10,24,14,33,5
794.xml,1942,11,11,0,1,0
82.xml,1941,11,11,7,18,11
163.xml,1941,10,11,2,20,9
1385.xml,1939,03,08,0,1,0
173.xml,1941,07,13,8,23,10
671.xml,1942,12,25,1,9,2
1321.xml,1940,10,19,4,21,6
1168.xml,1942,10,20,4,19,14
1350.xml,1940,11,29,2,28,7
1180.xml,1940,05,11,5,25,7
1030.xml,1943,01,31,4,39,12
972.xml,1941,02,12,4,102,11
720.xml,1941,12,21,13,24,7
1282.xml,1939,11,11,0,3,0
153.xml,1941,10,24,3,24,18
541.xml,1942,11,25,8,20,10
840.xml,1941,10,09,11,25,12
931.xml,1941,10,18,0,1,0
1537.xml,1945,03,15,1,6,2
607.xml,1940,10,28,2,18,7
1205.xml,1944,01,18,2,16,4
340.xml,1943,10,20,2,17,6
1123.xml,1939,10,18,3,13,11
902.xml,1945,01,28,0,5,5
990.xml,1941,12,02,4,17,6
1259.xml,1944,10,25,9,40,28
1163.xml,1942,07,14,3,21,12
455.xml,1944,11,25,0,31,2
463.xml,1944,12,18,3,30,8
4.xml,1939,10,27,11,40,13
715.xml,1941,12,21,18,25,3
540.xml,1942,11,25,8,22,8
821.xml,1940,06,30,6,35,9
534.xml,1942,12,23,2,6,2
400.xml,1943,10,20,8,54,47
1107.xml,1945,04,16,1,2,2
1496.xml,1945,04,15,0,3,2
1085.xml,1941,07,21,0,1,0
132.xml,1941,11,11,9,6,9
831.xml,1944,05,10,2,15,1
1006.xml,1941,06,16,7,17,10
1170.xml,1943,02,02,2,12,16
1251.xml,1944,07,01,1,5,9
318.xml,1941,10,24,5,32,18
1509.xml,1943,07,19,3,11,12
171.xml,1941,10,27,1,5,6
573.xml,1939,10,24,4,26,8
718.xml,1941,12,21,0,1,0
414.xml,1943,11,21,2,9,3
1330.xml,1942,06,15,5,17,3
467.xml,1944,12,27,1,6,1
1431.xml,1940,03,05,9,51,21
1051.xml,1944,01,17,6,29,30
760.xml,1943,10,13,6,28,11
1050.xml,1943,12,24,3,18,11
1130.xml,1940,07,03,3,13,6
1469.xml,1941,09,03,6,11,6
1594.xml,1944,07,01,2,31,6
925.xml,1939,12,26,0,43,3
1362.xml,1943,08,15,3,29,14
1583.xml,1943,04,18,6,44,6
1055.xml,1942,03,10,3,3,2
835.xml,1939,09,07,1,10,0
1262.xml,1941,07,12,6,17,10
14.xml,1939,10,15,9,11,5
1585.xml,1943,11,19,1,17,5
1129.xml,1940,06,21,2,8,2
1004.xml,1944,07,06,2,27,6
15.xml,1939,10,15,2,14,8
1211.xml,1944,11,08,2,9,2
1230.xml,1942,12,03,4,13,3
1541.xml,1939,09,05,6,20,10
1464.xml,1940,09,03,2,24,7
244.xml,1941,10,24,2,40,8
917.xml,1939,12,26,5,47,5
1132.xml,1940,08,28,4,10,13
1326.xml,1944,12,17,2,35,13
892.xml,1944,07,29,8,24,6
707.xml,1942,11,20,2,12,9
1595.xml,1942,06,03,5,14,14
1068.xml,1944,03,15,7,10,5
1435.xml,1940,05,28,6,57,25
867.xml,1941,05,14,1,32,11
1217.xml,1945,03,28,1,12,1
405.xml,1943,11,12,4,23,12
190.xml,1941,12,22,9,75,24
577.xml,1939,10,24,15,31,11
896.xml,1944,11,25,2,10,3
213.xml,1940,10,25,9,41,16
1210.xml,1944,10,26,1,14,2
1419.xml,1941,11,13,6,27,19
996.xml,1943,01,21,2,60,7
823.xml,1940,11,30,5,25,9
1087.xml,1941,08,15,0,1,0
891.xml,1944,07,23,4,26,12
869.xml,1941,07,07,8,55,36
1236.xml,1943,06,01,7,19,0
1112.xml,1944,05,29,0,12,0
1351.xml,1940,11,29,3,15,2
935.xml,1941,10,18,3,21,8
1117.xml,1942,01,31,9,19,15
425.xml,1944,10,11,2,25,9
609.xml,1940,10,28,9,33,7
764.xml,1943,10,13,1,10,5
105.xml,1941,12,22,8,76,26
1382.xml,1940,02,27,8,11,6
1410.xml,1944,01,04,1,14,14
958.xml,1939,11,22,2,23,13
1590.xml,1944,07,05,8,46,7
962.xml,1940,06,18,8,45,16
473.xml,1944,10,30,2,8,4
1492.xml,1944,10,11,5,17,11
1447.xml,1941,10,05,8,63,21
955.xml,1945,01,14,0,7,1
1098.xml,1940,09,15,8,30,2
1005.xml,1941,04,13,2,45,8
898.xml,1945,03,12,9,38,4
1016.xml,1942,02,15,10,35,17
69.xml,1939,10,15,12,4,11
661.xml,1943,10,13,5,7,4
1106.xml,1945,04,03,1,2,3
231.xml,1940,10,25,9,40,5
688.xml,1942,12,25,1,8,8
650.xml,1943,10,13,13,30,14
1353.xml,1941,06,15,1,16,2
914.xml,1939,12,26,11,66,14
1067.xml,1944,01,10,7,12,7
1062.xml,1945,02,27,6,67,25
1164.xml,1942,07,20,1,15,15
649.xml,1943,10,13,7,19,9
1364.xml,1943,09,20,0,6,5
265.xml,1942,11,11,21,52,33
772.xml,1943,10,13,1,14,6
208.xml,1943,02,28,3,15,8
526.xml,1944,10,22,7,33,16
21.xml,1939,10,15,4,20,7
934.xml,1941,10,18,1,43,10
1093.xml,1942,07,12,7,27,9
945.xml,1945,03,21,3,17,10
882.xml,1944,05,05,2,9,2
17.xml,1940,11,16,3,12,8
1227.xml,1942,08,27,14,47,16
694.xml,1940,10,27,4,15,2
570.xml,1939,10,24,7,28,13
916.xml,1939,12,26,2,37,13
970.xml,1940,11,17,19,162,40
1086.xml,1941,07,28,4,51,17
376.xml,1944,05,28,2,23,10
1358.xml,1943,05,20,5,24,12
1395.xml,1942,12,29,4,40,13
808.xml,1946,07,28,5,11,3
1147.xml,1941,10,23,2,20,7
1460.xml,1944,11,24,3,17,12
645.xml,1942,11,23,7,35,18
1165.xml,1942,08,23,7,17,10
853.xml,1943,07,24,1,26,11
186.xml,1941,12,14,7,30,6
356.xml,1943,11,21,2,17,4
351.xml,1943,12,17,3,16,6
842.xml,1941,12,02,5,43,25
1341.xml,1939,09,05,1,20,9
982.xml,1941,09,07,3,55,10
614.xml,1940,10,28,4,20,9
629.xml,1940,10,12,3,12,3
612.xml,1940,10,28,6,22,17
440.xml,1944,10,11,1,12,6
1158.xml,1941,12,09,0,13,12
910.xml,1945,05,08,1,11,1
1185.xml,1941,12,03,7,109,38
809.xml,1948,10,08,5,28,14
304.xml,1939,12,14,7,26,24
854.xml,1943,08,01,8,23,4
1000.xml,1943,02,18,3,33,10
1040.xml,1943,07,25,6,24,16
1532.xml,1939,09,08,5,4,8
75.xml,1939,10,15,7,14,8
1535.xml,1940,05,21,5,12,7
673.xml,1942,12,25,3,52,28
1232.xml,1943,04,03,1,39,15
1031.xml,1943,04,17,19,47,12
1538.xml,1945,03,18,1,3,5
1115.xml,1942,01,16,1,13,11
532.xml,1941,10,24,4,18,19
420.xml,1943,10,20,8,24,10
877.xml,1944,11,30,0,6,2
349.xml,1942,11,11,8,68,22
64.xml,1939,10,15,9,13,15
1239.xml,1943,09,18,7,39,11
631.xml,1940,10,12,4,34,8
1077.xml,1940,05,30,5,12,7
825.xml,1941,06,28,3,13,14
167.xml,1941,10,21,6,26,16
355.xml,1943,12,11,2,18,10
763.xml,1943,10,13,5,41,5
979.xml,1941,07,22,3,22,3
1271.xml,1943,12,17,1,6,6
974.xml,1941,06,23,10,42,8
290.xml,1942,11,11,14,62,39
663.xml,1943,10,13,6,21,11
544.xml,1942,11,25,4,22,2
797.xml,1945,03,21,4,14,12
582.xml,1940,12,25,7,46,20
839.xml,1941,06,27,3,18,5
6.xml,1939,10,15,3,17,17
1045.xml,1943,09,29,7,58,42
690.xml,1942,12,25,0,1,0
165.xml,1941,10,16,8,15,6
336.xml,1943,10,20,4,11,3
1260.xml,1944,11,04,4,24,17
834.xml,1945,01,27,3,19,8
1311.xml,1944,12,21,2,10,4
88.xml,1943,11,28,0,11,2
203.xml,1939,12,14,2,22,16
873.xml,1943,08,17,8,67,22
201.xml,1941,10,24,10,51,20
1559.xml,1941,10,12,0,8,3
1175.xml,1943,09,03,6,24,23
1511.xml,1943,12,09,4,28,6
564.xml,1939,10,24,5,37,10
729.xml,1943,12,29,0,1,0
1157.xml,1941,12,07,3,20,12
170.xml,1941,10,26,6,14,11
1409.xml,1944,01,02,11,17,10
115.xml,1941,12,22,4,29,10
217.xml,1941,12,13,5,15,4
394.xml,1943,10,20,7,22,14
1567.xml,1944,06,16,18,91,24
1193.xml,1943,08,21,0,1,0
129.xml,1943,11,28,3,10,4
556.xml,1939,10,24,2,31,9
62.xml,1939,10,15,3,15,18
464.xml,1944,12,21,2,14,3
735.xml,1943,12,19,0,1,0
525.xml,1944,10,15,2,45,17
1304.xml,1943,09,24,8,25,17
140.xml,1940,10,25,8,18,12
1100.xml,1944,01,25,3,7,7
698.xml,1940,10,27,8,33,8
622.xml,1940,10,12,15,29,13
906.xml,1943,03,15,3,11,3
687.xml,1942,12,25,4,19,8
1292.xml,1940,08,07,1,29,12
921.xml,1941,11,26,6,19,12
227.xml,1941,11,11,8,19,10
801.xml,1940,06,23,3,26,6
1352.xml,1941,05,06,1,11,4
142.xml,1941,11,11,3,16,8
65.xml,1939,12,14,5,13,13
1196.xml,1939,11,20,1,37,11
998.xml,1943,01,29,5,24,1
1049.xml,1943,12,01,6,28,13
1413.xml,1944,03,29,7,25,3
591.xml,1941,10,15,27,89,42
1119.xml,1944,04,17,7,27,13
459.xml,1944,11,27,4,18,10
997.xml,1943,01,28,6,63,20
1255.xml,1944,09,05,2,14,5
1397.xml,1943,02,05,4,20,6
562.xml,1939,10,24,9,31,6
448.xml,1944,10,19,6,38,14
1451.xml,1941,11,30,7,60,29
77.xml,1940,11,24,5,9,11
952.xml,1944,11,01,3,15,10
1528.xml,1940,10,21,8,17,8
205.xml,1940,10,25,3,39,8
1422.xml,1941,10,12,5,72,16
740.xml,1944,11,30,1,10,7
1491.xml,1944,08,27,2,9,8
792.xml,1943,10,13,1,28,10
1009.xml,1941,07,05,8,28,19
1065.xml,1943,10,01,2,12,6
1220.xml,1941,09,10,6,30,12
819.xml,1940,06,15,6,23,5
366.xml,1943,11,21,1,5,4
1274.xml,1944,02,05,6,7,7
731.xml,1943,12,19,0,1,0
1505.xml,1940,11,16,3,11,2
1198.xml,1940,08,18,4,12,8
1525.xml,1945,02,11,1,25,8
362.xml,1943,12,11,5,31,20
1287.xml,1940,03,19,0,3,0
87.xml,1941,02,13,0,41,8
1468.xml,1941,07,18,1,15,6
939.xml,1941,10,28,1,35,10
1250.xml,1944,06,26,3,21,13
1135.xml,1940,09,15,4,12,11
1581.xml,1943,02,01,1,10,2
585.xml,1940,12,25,12,71,32
850.xml,1943,02,19,5,15,7
107.xml,1940,10,25,7,42,6
475.xml,1944,10,11,7,44,16
941.xml,1941,10,18,1,19,5
899.xml,1945,03,16,5,21,7
658.xml,1943,11,21,4,26,9
773.xml,1943,11,21,0,23,10
97.xml,1939,12,14,8,10,6
471.xml,1944,10,11,3,32,14
1467.xml,1941,07,04,5,19,5
657.xml,1943,10,28,2,7,5
586.xml,1940,12,25,6,24,15
1393.xml,1942,12,18,2,22,14
166.xml,1941,10,17,4,22,16
568.xml,1939,10,24,9,24,16
608.xml,1940,10,28,7,12,17
286.xml,1941,10,24,6,25,15
1324.xml,1941,03,29,5,36,15
878.xml,1944,12,31,3,22,7
887.xml,1944,05,31,0,9,7
272.xml,1941,12,13,4,12,4
1368.xml,1944,03,02,3,12,5
1072.xml,1939,10,10,16,51,20
404.xml,1944,10,19,3,36,6
1137.xml,1941,04,10,6,25,8
233.xml,1942,11,11,30,77,57
1046.xml,1943,10,03,6,23,8
565.xml,1940,10,24,7,25,9
1320.xml,1940,08,20,2,23,17
805.xml,1941,08,05,12,57,26
1474.xml,1942,04,21,9,61,24
1084.xml,1941,07,08,4,14,5
27.xml,1939,10,15,6,14,16
1545.xml,1941,01,16,2,32,7
1462.xml,1939,09,02,7,15,6
981.xml,1941,09,02,2,55,9
344.xml,1943,11,21,3,16,8
1518.xml,1945,01,12,2,11,10
937.xml,1941,10,18,1,38,20
1450.xml,1941,11,26,5,64,26
765.xml,1943,10,13,3,17,4
1209.xml,1944,10,24,0,19,1
177.xml,1941,11,11,6,16,8
1361.xml,1943,08,01,6,24,10
1471.xml,1942,05,07,12,33,9
722.xml,1943,12,19,5,26,19
767.xml,1943,10,13,3,9,2
1103.xml,1944,03,19,2,16,12
1543.xml,1939,12,01,4,22,14
1277.xml,1944,03,20,1,10,7
1360.xml,1943,07,30,5,12,5
249.xml,1941,11,11,3,29,25
1144.xml,1941,08,22,3,15,10
1056.xml,1942,03,10,0,1,0
1441.xml,1941,08,12,6,67,24
602.xml,1940,10,28,10,22,17
1572.xml,1940,05,21,4,30,5
1133.xml,1940,09,08,1,11,3
