NOTA= 4,81


==================================
1.
5.0
BUEN TRABAJO!!
==================================
2.
----------------------------------
p1
5.0
BUEN TRABAJO!!

----------------------------------
p2

-4.5

- Para ciertos valores como l=o, no funciona


==================================
3.

----------------------------------
p1
5.0
BUEN TRABAJO!!
----------------------------------
p2
4.7
- Documentar los atributos 

==================================
4.
5
- BUEN TRABAJO!!