%!PS-Adobe-3.0 EPSF-3.0
%%Creator: MATLAB, The MathWorks, Inc. Version 8.2.0.701 (R2013b). Operating System: Linux 3.8.0-44-generic #66~precise1-Ubuntu SMP Tue Jul 15 04:01:04 UTC 2014 x86_64.
%%Title: /media/Transcend/DATA/drafts/2015/ARCH2015_Cora/figures/bouncingBall_Geometric.eps
%%CreationDate: 03/10/2015  20:11:28
%%DocumentNeededFonts: Helvetica
%%DocumentProcessColors: Cyan Magenta Yellow Black
%%LanguageLevel: 2
%%Pages: 1
%%BoundingBox:    81   227   529   564
%%EndComments

%%BeginProlog
% MathWorks dictionary
/MathWorks 160 dict begin
% definition operators
/bdef {bind def} bind def
/ldef {load def} bind def
/xdef {exch def} bdef
/xstore {exch store} bdef
% operator abbreviations
/c  /clip ldef
/cc /concat ldef
/cp /closepath ldef
/gr /grestore ldef
/gs /gsave ldef
/mt /moveto ldef
/np /newpath ldef
/cm /currentmatrix ldef
/sm /setmatrix ldef
/rm /rmoveto ldef
/rl /rlineto ldef
/s {show newpath} bdef
/sc {setcmykcolor} bdef
/sr /setrgbcolor ldef
/sg /setgray ldef
/w /setlinewidth ldef
/j /setlinejoin ldef
/cap /setlinecap ldef
/rc {rectclip} bdef
/rf {rectfill} bdef
% page state control
/pgsv () def
/bpage {/pgsv save def} bdef
/epage {pgsv restore} bdef
/bplot /gsave ldef
/eplot {stroke grestore} bdef
% orientation switch
/portraitMode 0 def /landscapeMode 1 def /rotateMode 2 def
% coordinate system mappings
/dpi2point 0 def
% font control
/FontSize 0 def
/FMS {/FontSize xstore findfont [FontSize 0 0 FontSize neg 0 0]
  makefont setfont} bdef
/reencode {exch dup where {pop load} {pop StandardEncoding} ifelse
  exch dup 3 1 roll findfont dup length dict begin
  { 1 index /FID ne {def}{pop pop} ifelse } forall
  /Encoding exch def currentdict end definefont pop} bdef
/isroman {findfont /CharStrings get /Agrave known} bdef
/FMSR {3 1 roll 1 index dup isroman {reencode} {pop pop} ifelse
  exch FMS} bdef
/csm {1 dpi2point div -1 dpi2point div scale neg translate
 dup landscapeMode eq {pop -90 rotate}
  {rotateMode eq {90 rotate} if} ifelse} bdef
% line types: solid, dotted, dashed, dotdash
/SO { [] 0 setdash } bdef
/DO { [.5 dpi2point mul 4 dpi2point mul] 0 setdash } bdef
/DA { [6 dpi2point mul] 0 setdash } bdef
/DD { [.5 dpi2point mul 4 dpi2point mul 6 dpi2point mul 4
  dpi2point mul] 0 setdash } bdef
% macros for lines and objects
/L {lineto stroke} bdef
/MP {3 1 roll moveto 1 sub {rlineto} repeat} bdef
/AP {{rlineto} repeat} bdef
/PDlw -1 def
/W {/PDlw currentlinewidth def setlinewidth} def
/PP {closepath eofill} bdef
/DP {closepath stroke} bdef
/MR {4 -2 roll moveto dup  0 exch rlineto exch 0 rlineto
  neg 0 exch rlineto closepath} bdef
/FR {MR stroke} bdef
/PR {MR fill} bdef
/L1i {{currentfile picstr readhexstring pop} image} bdef
/tMatrix matrix def
/MakeOval {newpath tMatrix currentmatrix pop translate scale
0 0 1 0 360 arc tMatrix setmatrix} bdef
/FO {MakeOval stroke} bdef
/PO {MakeOval fill} bdef
/PD {currentlinewidth 2 div 0 360 arc fill
   PDlw -1 eq not {PDlw w /PDlw -1 def} if} def
/FA {newpath tMatrix currentmatrix pop translate scale
  0 0 1 5 -2 roll arc tMatrix setmatrix stroke} bdef
/PA {newpath tMatrix currentmatrix pop	translate 0 0 moveto scale
  0 0 1 5 -2 roll arc closepath tMatrix setmatrix fill} bdef
/FAn {newpath tMatrix currentmatrix pop translate scale
  0 0 1 5 -2 roll arcn tMatrix setmatrix stroke} bdef
/PAn {newpath tMatrix currentmatrix pop translate 0 0 moveto scale
  0 0 1 5 -2 roll arcn closepath tMatrix setmatrix fill} bdef
/vradius 0 def /hradius 0 def /lry 0 def
/lrx 0 def /uly 0 def /ulx 0 def /rad 0 def
/MRR {/vradius xdef /hradius xdef /lry xdef /lrx xdef /uly xdef
  /ulx xdef newpath tMatrix currentmatrix pop ulx hradius add uly
  vradius add translate hradius vradius scale 0 0 1 180 270 arc 
  tMatrix setmatrix lrx hradius sub uly vradius add translate
  hradius vradius scale 0 0 1 270 360 arc tMatrix setmatrix
  lrx hradius sub lry vradius sub translate hradius vradius scale
  0 0 1 0 90 arc tMatrix setmatrix ulx hradius add lry vradius sub
  translate hradius vradius scale 0 0 1 90 180 arc tMatrix setmatrix
  closepath} bdef
/FRR {MRR stroke } bdef
/PRR {MRR fill } bdef
/MlrRR {/lry xdef /lrx xdef /uly xdef /ulx xdef /rad lry uly sub 2 div def
  newpath tMatrix currentmatrix pop ulx rad add uly rad add translate
  rad rad scale 0 0 1 90 270 arc tMatrix setmatrix lrx rad sub lry rad
  sub translate rad rad scale 0 0 1 270 90 arc tMatrix setmatrix
  closepath} bdef
/FlrRR {MlrRR stroke } bdef
/PlrRR {MlrRR fill } bdef
/MtbRR {/lry xdef /lrx xdef /uly xdef /ulx xdef /rad lrx ulx sub 2 div def
  newpath tMatrix currentmatrix pop ulx rad add uly rad add translate
  rad rad scale 0 0 1 180 360 arc tMatrix setmatrix lrx rad sub lry rad
  sub translate rad rad scale 0 0 1 0 180 arc tMatrix setmatrix
  closepath} bdef
/FtbRR {MtbRR stroke } bdef
/PtbRR {MtbRR fill } bdef
/stri 6 array def /dtri 6 array def
/smat 6 array def /dmat 6 array def
/tmat1 6 array def /tmat2 6 array def /dif 3 array def
/asub {/ind2 exch def /ind1 exch def dup dup
  ind1 get exch ind2 get sub exch } bdef
/tri_to_matrix {
  2 0 asub 3 1 asub 4 0 asub 5 1 asub
  dup 0 get exch 1 get 7 -1 roll astore } bdef
/compute_transform {
  dmat dtri tri_to_matrix tmat1 invertmatrix 
  smat stri tri_to_matrix tmat2 concatmatrix } bdef
/ds {stri astore pop} bdef
/dt {dtri astore pop} bdef
/db {2 copy /cols xdef /rows xdef mul dup 3 mul string
  currentfile 
  3 index 0 eq {/ASCIIHexDecode filter}
  {/ASCII85Decode filter 3 index 2 eq {/RunLengthDecode filter} if }
  ifelse exch readstring pop
  dup 0 3 index getinterval /rbmap xdef
  dup 2 index dup getinterval /gbmap xdef
  1 index dup 2 mul exch getinterval /bbmap xdef pop pop}bdef
/it {gs np dtri aload pop moveto lineto lineto cp c
  cols rows 8 compute_transform 
  rbmap gbmap bbmap true 3 colorimage gr}bdef
/il {newpath moveto lineto stroke}bdef
currentdict end def
%%EndProlog

%%BeginSetup
MathWorks begin

0 cap

end
%%EndSetup

%%Page: 1 1
%%BeginPageSetup
%%PageBoundingBox:    81   227   529   564
MathWorks begin
bpage
%%EndPageSetup

%%BeginObject: obj1
bplot

/dpi2point 12 def
portraitMode 0972 6768 csm

    0     0  5376  4033 rc
85 dict begin %Colortable dictionary
/c0 { 0.000000 0.000000 0.000000 sr} bdef
/c1 { 1.000000 1.000000 1.000000 sr} bdef
/c2 { 0.900000 0.000000 0.000000 sr} bdef
/c3 { 0.000000 0.820000 0.000000 sr} bdef
/c4 { 0.000000 0.000000 0.800000 sr} bdef
/c5 { 0.910000 0.820000 0.320000 sr} bdef
/c6 { 1.000000 0.260000 0.820000 sr} bdef
/c7 { 0.000000 0.820000 0.820000 sr} bdef
c0
1 j
1 sg
   0    0 5377 4034 rf
6 w
0 3287 4167 0 0 -3287 698 3589 4 MP
PP
-4167 0 0 3287 4167 0 0 -3287 698 3589 5 MP stroke
4 w
DO
SO
6 w
0 sg
 698 3589 mt 4865 3589 L
 698 3589 mt  698  302 L
 698 3589 mt  698 3547 L
%%IncludeResource: font Helvetica
/Helvetica /ISOLatin1Encoding 120 FMSR

 545 3734 mt 
(-0.2) s
1294 3589 mt 1294 3547 L
1261 3734 mt 
(0) s
1889 3589 mt 1889 3547 L
1806 3734 mt 
(0.2) s
2484 3589 mt 2484 3547 L
2401 3734 mt 
(0.4) s
3079 3589 mt 3079 3547 L
2996 3734 mt 
(0.6) s
3674 3589 mt 3674 3547 L
3591 3734 mt 
(0.8) s
4269 3589 mt 4269 3547 L
4236 3734 mt 
(1) s
4865 3589 mt 4865 3547 L
4782 3734 mt 
(1.2) s
 698 3589 mt  740 3589 L
 528 3633 mt 
(-2) s
 698 3119 mt  740 3119 L
 428 3163 mt 
(-1.5) s
 698 2649 mt  740 2649 L
 528 2693 mt 
(-1) s
 698 2180 mt  740 2180 L
 428 2224 mt 
(-0.5) s
 698 1710 mt  740 1710 L
 598 1754 mt 
(0) s
 698 1241 mt  740 1241 L
 498 1285 mt 
(0.5) s
 698  771 mt  740  771 L
 598  815 mt 
(1) s
 698  302 mt  740  302 L
 498  346 mt 
(1.5) s
gs 698 302 4168 3288 rc
/c8 { 0.000000 0.000000 1.000000 sr} bdef
c8
0 141 -318 0 0 -141 318 0 4109 1804 5 MP stroke
-339 0 0 -141 339 0 0 141 4091 1710 5 MP stroke
0 141 -362 0 0 -141 362 0 4065 1898 5 MP stroke
0 141 -384 0 0 -141 384 0 4031 1945 5 MP stroke
0 141 -407 0 0 -141 407 0 3990 1992 5 MP stroke
0 141 -429 0 0 -141 429 0 3942 2039 5 MP stroke
0 141 -451 0 0 -141 451 0 3886 2086 5 MP stroke
0 141 -473 0 0 -141 473 0 3823 2133 5 MP stroke
-496 0 0 -141 496 0 0 141 3752 2039 5 MP stroke
-518 0 0 -141 518 0 0 141 3674 2086 5 MP stroke
-540 0 0 -141 540 0 0 141 3589 2133 5 MP stroke
-562 0 0 -141 562 0 0 141 3496 2180 5 MP stroke
-585 0 0 -141 585 0 0 141 3395 2227 5 MP stroke
-608 0 0 -141 608 0 0 141 3287 2274 5 MP stroke
-630 0 0 -141 630 0 0 141 3172 2321 5 MP stroke
-652 0 0 -140 652 0 0 140 3049 2368 5 MP stroke
-674 0 0 -140 674 0 0 140 2919 2415 5 MP stroke
-697 0 0 -140 697 0 0 140 2781 2462 5 MP stroke
0 -141 719 0 0 141 -719 0 3355 2508 5 MP stroke
0 -141 741 0 0 141 -741 0 3225 2555 5 MP stroke
0 -141 763 0 0 141 -763 0 3087 2602 5 MP stroke
0 -141 785 0 0 141 -785 0 2942 2649 5 MP stroke
0 -141 808 0 0 141 -808 0 2790 2696 5 MP stroke
0 -141 830 0 0 141 -830 0 2630 2743 5 MP stroke
0 -141 853 0 0 141 -853 0 2463 2790 5 MP stroke
0 -141 875 0 0 141 -875 0 2288 2837 5 MP stroke
0 -141 811 0 0 141 -811 0 2105 2884 5 MP stroke
0 -141 622 0 0 141 -622 0 1916 2931 5 MP stroke
0 -141 425 0 0 141 -425 0 1719 2978 5 MP stroke
0 -141 220 0 0 141 -220 0 1514 3025 5 MP stroke
0 -141 8 0 0 141 -8 0 1302 3072 5 MP stroke
159 0 0 99 -159 0 0 -99 1453 787 5 MP stroke
165 0 0 99 -165 0 0 -99 1604 834 5 MP stroke
0 99 -165 0 0 -99 165 0 1582 881 5 MP stroke
0 100 -166 0 0 -100 166 0 1717 928 5 MP stroke
0 100 -167 0 0 -100 167 0 1845 975 5 MP stroke
0 100 -168 0 0 -100 168 0 1965 1022 5 MP stroke
0 100 -168 0 0 -100 168 0 2078 1069 5 MP stroke
0 100 -170 0 0 -100 170 0 2183 1116 5 MP stroke
0 100 -170 0 0 -100 170 0 2281 1163 5 MP stroke
0 100 -172 0 0 -100 172 0 2371 1210 5 MP stroke
0 100 -173 0 0 -100 173 0 2454 1257 5 MP stroke
0 100 -173 0 0 -100 173 0 2530 1304 5 MP stroke
0 100 -174 0 0 -100 174 0 2598 1351 5 MP stroke
0 100 -175 0 0 -100 175 0 2659 1398 5 MP stroke
0 99 -176 0 0 -99 176 0 2712 1444 5 MP stroke
0 99 -177 0 0 -99 177 0 2758 1491 5 MP stroke
0 99 -178 0 0 -99 178 0 2796 1538 5 MP stroke
0 99 -179 0 0 -99 179 0 2827 1585 5 MP stroke
0 99 -179 0 0 -99 179 0 2851 1632 5 MP stroke
0 99 -180 0 0 -99 180 0 2867 1679 5 MP stroke
0 99 -181 0 0 -99 181 0 2875 1726 5 MP stroke
-187 0 0 -99 187 0 0 99 2874 1674 5 MP stroke
-202 0 0 -99 202 0 0 99 2861 1721 5 MP stroke
-217 0 0 -99 217 0 0 99 2840 1768 5 MP stroke
-233 0 0 -99 233 0 0 99 2811 1815 5 MP stroke
-249 0 0 -99 249 0 0 99 2775 1862 5 MP stroke
-265 0 0 -100 265 0 0 100 2732 1908 5 MP stroke
-280 0 0 -100 280 0 0 100 2681 1955 5 MP stroke
-297 0 0 -100 297 0 0 100 2622 2002 5 MP stroke
-312 0 0 -100 312 0 0 100 2557 2049 5 MP stroke
-328 0 0 -100 328 0 0 100 2483 2096 5 MP stroke
-343 0 0 -100 343 0 0 100 2403 2143 5 MP stroke
-359 0 0 -100 359 0 0 100 2315 2190 5 MP stroke
-375 0 0 -100 375 0 0 100 2219 2237 5 MP stroke
-391 0 0 -100 391 0 0 100 2116 2284 5 MP stroke
-407 0 0 -100 407 0 0 100 2006 2331 5 MP stroke
-422 0 0 -100 422 0 0 100 1888 2378 5 MP stroke
-438 0 0 -99 438 0 0 99 1763 2425 5 MP stroke
-454 0 0 -99 454 0 0 99 1630 2472 5 MP stroke
-470 0 0 -99 470 0 0 99 1490 2519 5 MP stroke
0 -99 486 0 0 99 -486 0 1828 2566 5 MP stroke
0 -99 394 0 0 99 -394 0 1688 2613 5 MP stroke
0 -99 248 0 0 99 -248 0 1542 2660 5 MP stroke
0 -99 94 0 0 99 -94 0 1388 2707 5 MP stroke
0 87 -118 0 0 -87 118 0 1294 1030 5 MP stroke
0 87 -121 0 0 -87 121 0 1402 1077 5 MP stroke
0 87 -120 0 0 -87 120 0 1506 1124 5 MP stroke
0 87 -119 0 0 -87 119 0 1602 1171 5 MP stroke
0 87 -118 0 0 -87 118 0 1691 1218 5 MP stroke
0 87 -117 0 0 -87 117 0 1773 1265 5 MP stroke
0 87 -116 0 0 -87 116 0 1847 1312 5 MP stroke
0 87 -115 0 0 -87 115 0 1914 1359 5 MP stroke
0 87 -114 0 0 -87 114 0 1973 1406 5 MP stroke
0 88 -113 0 0 -88 113 0 2025 1453 5 MP stroke
0 88 -112 0 0 -88 112 0 2070 1500 5 MP stroke
0 88 -111 0 0 -88 111 0 2107 1547 5 MP stroke
0 88 -110 0 0 -88 110 0 2136 1594 5 MP stroke
0 88 -109 0 0 -88 109 0 2159 1641 5 MP stroke
0 88 -108 0 0 -88 108 0 2173 1688 5 MP stroke
0 88 -107 0 0 -88 107 0 2180 1735 5 MP stroke
-115 0 0 -88 115 0 0 88 2176 1694 5 MP stroke
-129 0 0 -88 129 0 0 88 2161 1741 5 MP stroke
-143 0 0 -88 143 0 0 88 2138 1788 5 MP stroke
-157 0 0 -88 157 0 0 88 2108 1835 5 MP stroke
-170 0 0 -88 170 0 0 88 2071 1882 5 MP stroke
-184 0 0 -88 184 0 0 88 2026 1929 5 MP stroke
-198 0 0 -88 198 0 0 88 1974 1976 5 MP stroke
-212 0 0 -87 212 0 0 87 1914 2023 5 MP stroke
-226 0 0 -87 226 0 0 87 1847 2070 5 MP stroke
-239 0 0 -87 239 0 0 87 1773 2117 5 MP stroke
-253 0 0 -87 253 0 0 87 1691 2164 5 MP stroke
-268 0 0 -87 268 0 0 87 1601 2211 5 MP stroke
-282 0 0 -87 282 0 0 87 1504 2258 5 MP stroke
-295 0 0 -87 295 0 0 87 1400 2305 5 MP stroke
-303 0 0 -87 303 0 0 87 1294 2352 5 MP stroke
-198 0 0 -87 198 0 0 87 1294 2399 5 MP stroke
-85 0 0 -88 85 0 0 88 1294 2445 5 MP stroke
0 78 -88 0 0 -78 88 0 1294 1212 5 MP stroke
0 78 -88 0 0 -78 88 0 1374 1259 5 MP stroke
0 78 -86 0 0 -78 86 0 1449 1306 5 MP stroke
1 sg
0 94 -297 0 0 -94 297 0 4121 1757 5 MP
PP
0 sg
0 0 0 94 -297 0 0 -94 297 0 4121 1757 6 MP stroke
-200 44 -193 45 -187 44 -180 44 -446 117 -400 118 -353 117 -306 118 
-260 117 -214 117 -167 118 -120 117 -43 59 -31 59 -20 59 -8 59 
0 24 1 12 2 11 0 7 1 3 4418 1663 22 MP stroke
-219 66 -205 66 -191 66 -176 66 -198 82 -176 82 -153 83 -131 82 
-107 82 -85 82 -62 82 -39 82 -17 83 7 82 29 82 52 82 
74 82 98 83 120 82 143 82 166 82 189 82 211 82 234 83 
83 27 84 27 88 27 89 27 19 5 18 6 18 5 19 6 
4 1 3 1 4 1 4 1 1 0 1 1 1 0 1294 689 40 MP stroke
-35 22 -33 23 -32 22 -30 22 -39 31 -36 31 -33 31 -29 31 
-27 31 -23 31 -19 32 -17 31 -13 31 -10 31 -7 31 -3 31 
0 31 3 31 6 31 10 31 13 32 16 31 20 31 22 31 
26 31 30 31 32 31 36 31 39 31 42 32 46 31 49 31 
52 31 55 31 59 31 62 31 65 31 69 31 71 32 75 31 
18 7 18 7 18 7 19 8 4 1 3 1 4 2 4 1 
1 1 1 0 1 1 1294 944 52 MP stroke
-94 21 -94 21 -92 20 -90 21 -483 118 -437 117 -390 117 -344 118 
-297 117 -251 118 -204 117 -157 117 -62 59 -50 59 -38 59 -27 59 
-4 12 -3 12 -3 12 -2 11 -1 3 0 2 -1 2 0 3 
4418 1757 25 MP stroke
-181 55 -172 54 -162 54 -152 54 -217 85 -194 84 -169 85 -145 84 
-121 85 -97 84 -73 85 -48 84 -25 85 0 84 23 85 48 84 
72 85 96 84 120 85 144 84 168 85 192 85 217 84 240 85 
83 27 84 27 88 27 89 27 19 5 18 6 18 5 19 6 
4 1 3 1 4 1 4 1 1 0 1 1 1 0 1294 689 40 MP stroke
-46 25 -44 24 -42 25 -41 24 -51 34 -48 33 -44 34 -41 33 
-36 34 -33 33 -29 33 -25 34 -22 33 -17 34 -14 33 -10 34 
-7 33 -2 34 1 33 5 34 9 33 12 33 16 34 20 33 
24 34 28 33 31 34 36 33 38 34 43 33 47 34 50 33 
54 33 58 34 62 33 65 34 69 33 73 34 77 33 80 34 
18 7 18 7 18 7 19 8 4 1 3 1 4 2 4 1 
1 1 1 0 1 1 1294 944 52 MP stroke
-18 5 -18 4 -18 4 -18 4 -484 118 -436 117 -390 117 -344 118 
-297 117 -251 118 -204 117 -158 117 -62 59 -50 59 -38 59 -26 59 
-4 12 -3 12 -3 12 -3 11 0 3 -1 2 0 2 -1 3 
4121 1757 25 MP stroke
-62 19 -61 20 -60 19 -59 19 -247 86 -223 87 -197 86 -173 86 
-147 86 -122 86 -98 86 -72 87 -47 86 -22 86 3 86 28 86 
53 87 78 86 104 86 128 86 153 86 179 86 203 87 229 86 
81 28 84 29 86 28 89 29 19 6 18 5 18 6 19 6 
4 1 3 1 4 1 4 1 1 0 1 1 1 0 1294 739 40 MP stroke
-39 17 -39 16 -38 16 -37 17 -82 37 -77 38 -72 37 -68 38 
-63 38 -57 37 -54 38 -48 38 -43 37 -39 38 -34 37 -30 38 
-24 38 -20 37 -15 38 -10 37 -5 38 -1 38 4 37 9 38 
14 37 18 38 23 38 28 37 33 38 38 37 42 38 47 38 
52 37 57 38 61 37 66 38 71 38 76 37 80 38 86 37 
17 8 18 8 19 7 18 8 4 1 3 2 4 1 4 2 
1 0 1 1 1 0 1294 982 52 MP stroke
1 1 1 1 1 0 1 1 2 1 2 1 2 2 2 1 
2 1 2 1 2 1 2 1 2 2 2 1 2 1 2 1 
2 1 2 1 3 2 2 1 2 1 2 1 2 1 2 2 
2 1 2 1 2 1 2 1 2 1 2 2 3 1 2 1 
2 1 2 1 2 1 2 2 2 1 2 1 3 1 2 1 
1 1 1 1 1 0 1294 1164 44 MP stroke
-119 28 -117 28 -115 27 -112 28 -446 117 -399 118 -353 117 -307 118 
-260 117 -213 117 -167 118 -121 117 -43 59 -31 59 -19 59 -8 59 
0 24 1 12 1 11 0 3 1 2 0 5 4121 1663 23 MP stroke
-100 31 -96 31 -94 31 -90 31 -228 84 -204 84 -180 84 -157 83 
-133 84 -110 84 -85 84 -62 84 -38 84 -15 83 9 84 33 84 
57 84 80 84 105 84 127 83 152 84 175 84 199 84 223 84 
81 28 84 29 86 28 89 29 19 6 18 5 18 6 19 6 
4 1 3 1 4 1 4 1 1 0 1 1 1 0 1294 739 40 MP stroke
-59 26 -55 26 -54 25 -52 26 -66 35 -63 36 -58 35 -54 35 
-50 35 -46 36 -42 35 -37 35 -33 36 -29 35 -25 35 -20 35 
-17 36 -12 35 -8 35 -4 35 0 36 5 35 9 35 13 35 
17 36 21 35 26 35 30 35 33 36 39 35 42 35 46 35 
51 36 55 35 59 35 63 35 68 36 72 35 75 35 81 35 
17 8 18 8 19 7 18 8 4 1 3 2 4 1 4 2 
1 0 1 1 1 0 1294 982 52 MP stroke
-119 28 -117 28 -115 27 -112 28 -446 117 -399 118 -353 117 -307 118 
-260 117 -213 117 -167 118 -121 117 -43 59 -31 59 -19 59 -8 59 
0 24 1 12 1 11 0 3 1 2 0 5 4121 1663 23 MP stroke
-100 31 -96 31 -94 31 -90 31 -228 84 -204 84 -180 84 -157 83 
-133 84 -110 84 -85 84 -62 84 -38 84 -15 83 9 84 33 84 
57 84 80 84 105 84 127 83 152 84 175 84 199 84 223 84 
81 28 84 29 86 28 89 29 19 6 18 5 18 6 19 6 
4 1 3 1 4 1 4 1 1 0 1 1 1 0 1294 739 40 MP stroke
-59 26 -55 26 -54 25 -52 26 -66 35 -63 36 -58 35 -54 35 
-50 35 -46 36 -42 35 -37 35 -33 36 -29 35 -25 35 -20 35 
-17 36 -12 35 -8 35 -4 35 0 36 5 35 9 35 13 35 
17 36 21 35 26 35 30 35 33 36 39 35 42 35 46 35 
51 36 55 35 59 35 63 35 68 36 72 35 75 35 81 35 
17 8 18 8 19 7 18 8 4 1 3 2 4 1 4 2 
1 0 1 1 1 0 1294 982 52 MP stroke
-290 68 -276 68 -260 67 -244 68 -386 118 -340 117 -293 117 -246 118 
-199 116 -154 117 -107 117 -61 117 -7 23 -5 23 -3 24 -1 23 
0 21 1 1 4165 1692 19 MP stroke
-105 33 -102 32 -98 32 -95 33 -229 84 -206 85 -181 84 -158 84 
-133 84 -110 85 -85 84 -62 84 -38 85 -13 84 10 84 34 85 
59 84 82 84 106 84 130 85 155 84 178 84 202 85 226 84 
81 28 84 29 87 28 89 28 19 6 18 6 18 5 19 6 
4 1 3 1 4 1 4 1 1 1 1 0 1 0 1294 732 40 MP stroke
-59 26 -56 26 -54 26 -52 26 -66 35 -63 35 -58 36 -54 35 
-50 36 -46 35 -41 35 -38 36 -33 35 -28 35 -25 36 -20 35 
-16 36 -12 35 -8 35 -3 36 1 35 5 35 9 36 13 35 
18 36 22 35 26 35 30 36 35 35 39 35 43 36 47 35 
51 36 56 35 60 35 64 36 68 35 73 35 76 36 81 35 
18 8 18 7 19 8 18 7 4 2 3 1 4 2 4 1 
1 1 1 0 1 1 1294 976 52 MP stroke
-223 51 -215 52 -205 51 -197 51 -419 117 -372 118 -326 117 -279 117 
-233 118 -186 117 -140 118 -93 117 -23 42 -16 43 -10 42 -4 43 
0 25 1 9 0 3 1 2 0 2 4233 1676 22 MP stroke
-139 43 -133 43 -127 42 -121 43 -219 83 -196 84 -172 83 -149 84 
-125 83 -102 84 -78 83 -54 84 -31 83 -8 84 16 84 40 83 
63 84 87 83 110 84 134 83 157 84 181 83 204 84 228 83 
82 28 84 28 87 28 89 28 19 6 18 5 18 6 19 6 
4 1 3 1 4 1 4 1 1 0 1 1 1 0 1294 720 40 MP stroke
-51 25 -48 24 -46 25 -45 25 -57 34 -54 34 -50 34 -46 34 
-42 34 -38 34 -34 34 -30 34 -27 34 -22 34 -19 34 -15 34 
-10 34 -7 34 -3 34 1 34 5 34 8 34 13 34 17 34 
20 34 24 34 29 34 32 34 36 34 40 34 44 34 48 34 
51 34 56 34 59 34 64 34 67 34 71 34 75 34 79 34 
18 8 18 7 19 8 18 7 4 2 3 1 4 2 4 1 
1 0 1 1 1 0 -1 0 1295 968 53 MP stroke
-163 37 -160 36 -155 37 -150 36 -454 117 -408 118 -361 117 -315 118 
-269 117 -222 117 -175 118 -129 117 -44 55 -35 55 -23 56 -14 55 
-2 11 -1 11 0 11 -1 11 0 11 4375 1701 22 MP stroke
-185 56 -175 56 -164 55 -154 56 -211 83 -187 84 -164 83 -140 84 
-117 83 -94 83 -69 84 -47 83 -23 84 0 83 24 83 48 84 
70 83 95 83 117 84 142 83 164 84 188 83 212 83 235 84 
82 27 85 27 87 28 89 27 19 6 18 5 18 5 19 6 
4 1 3 1 4 1 4 1 1 1 1 0 1 0 1294 697 40 MP stroke
-42 23 -41 24 -39 24 -37 23 -49 33 -44 33 -41 32 -38 33 
-34 33 -30 32 -26 33 -23 33 -20 33 -15 32 -13 33 -8 33 
-5 32 -1 33 2 33 6 32 9 33 13 33 17 33 20 32 
24 33 28 33 31 32 35 33 38 33 42 33 46 32 49 33 
53 33 56 32 60 33 64 33 67 32 71 33 74 33 78 33 
18 7 18 7 18 7 19 8 4 1 3 2 4 1 4 2 
1 0 1 0 1 1 1294 950 52 MP stroke
-212 49 -204 48 -197 48 -189 48 -426 118 -380 117 -334 117 -287 118 
-240 117 -194 118 -148 117 -101 117 -27 48 -20 47 -13 47 -5 47 
0 9 1 10 0 9 1 10 0 5 1 2 4268 1673 23 MP stroke
-155 48 -147 47 -140 47 -132 47 -215 84 -192 83 -169 83 -144 83 
-122 84 -98 83 -75 83 -51 83 -29 84 -4 83 19 83 42 83 
65 83 89 84 112 83 136 83 159 83 182 84 206 83 229 83 
82 28 84 28 87 28 89 27 19 6 18 5 18 6 19 6 
4 1 3 1 4 1 4 1 1 0 1 1 1 0 1294 714 40 MP stroke
-47 24 -45 24 -43 25 -41 24 -54 33 -50 34 -46 33 -43 33 
-38 34 -35 33 -31 34 -28 33 -23 34 -20 33 -16 33 -12 34 
-9 33 -5 34 0 33 2 34 7 33 10 33 14 34 18 33 
22 34 25 33 30 33 33 34 36 33 41 34 44 33 48 34 
52 33 56 33 59 34 63 33 67 34 71 33 74 34 78 33 
18 7 18 8 19 7 18 8 4 1 3 2 4 1 4 2 
1 0 1 1 1 0 1294 963 52 MP stroke
-508 117 -462 117 -417 116 -370 117 -327 118 -279 117 -234 117 -187 118 
-106 85 -83 86 -57 85 -33 86 -3 17 -3 17 -2 17 0 33 
4365 1697 17 MP stroke
-183 55 -173 55 -163 55 -153 56 -210 83 -188 83 -164 84 -140 83 
-117 83 -93 84 -71 83 -46 83 -24 84 0 83 24 83 47 84 
70 83 94 83 117 83 141 84 164 83 188 83 211 84 234 83 
82 27 85 28 87 27 89 28 19 5 18 5 18 6 19 5 
4 2 3 1 4 1 4 1 1 0 1 0 1 1 1294 698 40 MP stroke
-43 24 -41 23 -39 24 -37 24 -49 32 -44 33 -42 33 -37 33 
-34 32 -31 33 -26 33 -23 32 -20 33 -16 33 -12 33 -9 32 
-5 33 -2 33 3 32 5 33 10 33 13 33 16 32 20 33 
24 33 28 32 31 33 34 33 38 33 42 32 46 33 49 33 
52 32 57 33 60 33 63 33 67 32 71 33 74 33 78 32 
18 8 18 7 18 7 19 8 4 1 3 2 4 1 4 1 
1 1 1 0 1 1 1294 951 52 MP stroke
gr


end %%Color Dict

eplot
%%EndObject

epage
end

showpage

%%Trailer
%%EOF
