Score	Length
10	10
20	12
32	12
80	16
28	12
10	10
14	10
82	18
26	10
8	8
86	14
8	8
22	10
20	12
8	8
8	8
50	14
22	10
28	12
8	8
20	8
8	8
30	10
16	8
24	12
10	10
10	10
18	10
38	10
12	12
8	8
16	8
18	10
20	8
28	12
8	8
20	8
30	14
22	10
28	10
32	12
20	12
8	8
14	10
16	8
20	8
12	12
26	10
36	12
28	12
8	8
36	12
8	8
12	8
43	11
8	8
44	12
8	8
8	8
30	10
12	12
38	14
10	10
22	10
28	10
10	10
142	18
8	8
18	10
22	14
10	10
20	12
26	10
18	10
18	10
50	14
10	10
22	10
100	16
88	16
38	14
16	8
10	10
22	10
22	10
36	12
28	12
8	8
130	14
10	10
10	10
8	8
8	8
16	8
26	10
8	8
8	8
8	8
35	11
24	12
38	10
20	12
26	10
8	8
38	14
38	12
8	8
18	10
26	10
19	7
12	8
12	12
22	10
10	10
18	10
10	10
20	8
22	14
18	10
12	8
18	10
18	10
10	10
8	8
8	8
8	8
16	8
10	10
8	8
22	10
16	8
42	14
76	20
10	10
18	10
10	10
18	10
18	10
124	20
12	12
20	12
20	8
18	10
19	7
12	8
28	12
10	10
8	8
18	10
8	8
12	8
22	14
30	10
8	8
30	10
10	10
32	12
20	8
22	10
8	8
20	12
8	8
18	10
28	12
8	8
8	8
12	8
12	12
19	7
8	8
19	7
28	12
26	10
20	12
30	10
10	10
26	10
16	8
10	10
19	7
40	12
88	16
18	10
8	8
18	10
8	8
16	8
18	10
38	10
20	8
12	8
16	8
38	10
88	16
8	8
38	14
12	8
8	8
100	20
112	16
8	8
26	10
14	10
10	10
8	8
10	10
80	16
10	10
70	14
8	8
22	10
19	7
14	8
60	16
12	8
16	8
12	8
36	12
8	8
16	8
38	10
12	8
8	8
44	14
8	8
18	10
194	20
36	12
8	8
12	8
8	8
32	12
16	8
26	10
24	12
20	12
30	10
10	10
8	8
8	8
12	8
8	8
44	12
8	8
8	8
38	10
70	14
22	10
19	7
34	12
22	14
8	8
20	12
14	14
8	8
44	12
18	10
22	10
8	8
12	8
22	10
12	8
16	8
10	10
20	12
16	12
42	12
8	8
8	8
8	8
12	8
16	8
8	8
16	8
46	14
18	10
16	8
34	14
44	16
8	8
10	10
10	10
8	8
10	10
80	16
22	10
22	10
10	10
10	10
28	10
40	16
14	10
10	10
8	8
16	8
12	8
22	10
20	8
12	12
12	12
8	8
22	10
12	12
20	12
8	8
22	10
120	16
10	10
8	8
8	8
92	16
12	12
43	11
22	10
16	8
28	12
64	16
28	12
20	8
70	14
20	12
22	14
26	10
80	16
30	14
32	12
8	8
8	8
14	10
8	8
24	12
116	16
22	10
10	10
20	8
10	10
10	10
8	8
43	11
94	18
46	14
16	8
16	8
16	10
20	8
58	16
84	16
26	10
8	8
10	10
12	8
18	10
8	8
22	10
8	8
12	8
20	8
22	10
8	8
22	10
26	10
12	8
18	10
8	8
38	14
16	8
16	8
16	8
16	8
20	8
14	10
16	8
22	10
28	12
8	8
30	10
20	12
16	8
8	8
176	24
8	8
10	10
30	10
20	8
10	10
22	10
18	10
8	8
8	8
12	8
10	10
10	10
16	8
90	18
18	10
19	7
12	8
12	8
10	10
16	8
8	8
18	10
12	8
72	16
12	8
10	10
16	8
19	7
8	8
16	8
30	10
26	10
38	10
12	8
38	10
30	10
8	8
82	14
8	8
8	8
20	8
22	10
22	10
38	14
20	12
22	14
10	10
28	10
12	8
38	14
8	8
12	8
8	8
16	8
38	10
16	12
16	8
28	12
12	8
16	8
8	8
22	14
12	8
40	12
20	12
22	10
38	10
8	8
98	18
26	10
96	16
8	8
92	16
16	8
10	10
86	18
8	8
18	10
48	16
94	18
16	8
10	10
26	10
10	10
128	20
22	10
18	10
18	10
16	12
8	8
26	10
10	10
18	10
10	10
20	8
32	12
18	10
8	8
10	10
19	7
8	8
8	8
8	8
16	8
14	10
132	20
82	14
14	10
20	8
16	8
92	16
8	8
22	10
20	12
8	8
16	8
12	12
16	8
20	8
8	8
14	10
16	8
8	8
124	18
20	8
19	7
28	10
10	10
38	10
86	18
38	10
16	8
22	14
14	14
18	10
22	10
22	10
28	10
20	12
16	8
8	8
16	8
8	8
22	10
16	8
20	8
82	14
19	7
20	12
22	10
30	10
8	8
24	12
16	8
10	10
34	14
18	10
8	8
12	8
26	10
16	8
26	10
12	8
20	12
8	8
38	10
22	14
18	10
8	8
72	16
16	8
16	8
46	14
12	8
19	7
18	10
18	10
18	10
22	10
38	10
30	14
8	8
12	8
12	8
20	8
22	10
20	12
16	8
26	10
28	12
12	8
12	8
10	10
8	8
22	14
8	8
110	18
44	12
12	8
22	10
20	8
38	12
12	8
10	10
18	10
8	8
20	8
16	8
10	10
22	10
10	10
28	12
8	8
8	8
22	10
8	8
8	8
30	10
22	10
19	7
92	16
19	7
22	10
16	8
20	8
20	8
82	18
12	8
19	7
16	8
16	8
16	8
19	7
20	8
18	10
16	8
12	8
80	16
18	10
26	10
82	14
26	10
18	10
14	10
16	8
22	10
76	16
22	10
10	10
38	10
12	8
38	10
8	8
30	10
30	10
22	10
10	10
22	10
10	10
18	10
8	8
8	8
8	8
22	10
8	8
18	10
43	11
8	8
10	10
8	8
56	16
26	10
70	14
19	7
10	10
14	10
19	7
8	8
72	16
20	8
40	14
28	12
12	8
10	10
24	12
20	12
80	16
20	8
28	12
22	10
8	8
18	10
12	12
10	10
12	8
8	8
16	8
16	8
44	12
18	10
12	8
20	12
22	10
8	8
8	8
12	8
14	10
12	8
16	8
10	10
16	8
38	10
12	12
14	10
19	7
16	8
10	10
8	8
20	8
16	8
8	8
8	8
18	10
8	8
92	16
20	12
10	10
26	10
12	8
16	8
16	8
10	10
12	8
28	12
8	8
8	8
8	8
38	10
16	8
16	8
94	18
36	12
22	10
16	8
38	10
8	8
10	10
8	8
8	8
38	10
24	12
19	7
18	10
98	18
16	10
16	8
22	10
16	8
8	8
28	12
10	10
38	10
20	8
8	8
16	8
8	8
14	10
158	22
22	14
8	8
18	10
19	7
38	10
12	12
10	10
16	12
16	8
14	10
8	8
8	8
10	10
44	12
46	14
18	10
22	10
18	10
108	20
38	10
30	10
22	10
8	8
40	12
12	12
16	8
14	10
8	8
108	16
19	7
22	10
8	8
12	8
88	20
8	8
30	10
38	12
10	10
20	8
10	10
108	20
18	10
32	12
8	8
8	8
32	12
8	8
10	10
26	10
16	8
12	8
16	8
10	10
8	8
24	12
10	10
8	8
114	18
26	10
20	12
8	8
20	8
38	14
20	8
44	12
34	14
8	8
10	10
44	12
22	10
20	12
22	14
10	10
22	10
12	12
10	10
38	10
22	10
22	10
8	8
76	16
36	12
32	12
16	8
12	8
8	8
18	10
16	8
10	10
18	10
76	16
8	8
14	10
18	10
8	8
18	10
8	8
36	12
28	12
38	10
10	10
43	11
72	16
8	8
8	8
19	7
28	12
22	14
12	8
20	12
8	8
22	14
22	10
30	10
8	8
16	8
36	12
16	8
20	8
14	10
10	10
24	12
20	8
16	8
16	8
70	14
16	8
16	8
49	13
12	8
10	10
26	10
10	10
8	8
22	10
20	8
12	12
30	10
14	10
54	12
8	8
18	10
20	8
28	12
12	12
10	10
18	10
8	8
26	10
8	8
64	16
28	12
8	8
16	8
36	12
28	12
156	20
8	8
12	8
32	12
18	10
12	8
76	16
8	8
8	8
20	8
20	8
16	12
22	10
8	8
8	8
22	14
10	10
26	10
10	10
140	16
20	12
38	10
16	8
38	14
20	8
8	8
22	14
42	14
22	14
18	10
8	8
8	8
8	8
16	8
19	7
26	10
8	8
8	8
22	14
30	10
12	8
26	10
19	7
18	10
16	8
12	8
120	16
82	18
40	12
19	7
8	8
22	10
16	8
16	8
38	14
16	8
20	12
8	8
16	8
96	16
26	14
16	8
26	10
16	8
12	8
8	8
22	10
30	10
18	10
20	8
26	10
20	8
8	8
12	8
28	12
20	8
18	10
30	10
22	14
18	10
28	12
10	10
12	12
8	8
30	10
18	10
18	10
62	14
22	10
48	16
10	10
10	10
12	8
18	10
80	16
10	10
8	8
20	12
12	12
8	8
26	10
8	8
20	12
30	10
14	8
22	14
20	8
18	10
8	8
43	11
8	8
8	8
8	8
8	8
44	12
12	8
62	14
10	10
19	7
20	12
18	10
10	10
10	10
8	8
22	10
20	8
132	20
30	14
10	10
20	8
8	8
22	10
118	18
8	8
30	10
22	10
12	12
14	8
26	10
10	10
18	10
19	7
20	12
16	8
20	8
38	10
20	8
10	10
19	7
28	12
8	8
18	10
8	8
20	12
150	22
22	10
18	10
20	12
22	10
24	12
38	14
28	10
72	16
8	8
12	8
26	10
142	18
8	8
16	8
14	8
8	8
10	10
12	8
18	10
8	8
19	7
26	10
96	16
8	8
88	14
80	16
20	12
12	12
16	8
16	8
70	14
19	7
10	10
18	10
156	20
44	12
134	22
28	10
18	10
22	10
20	12
10	10
10	10
90	14
8	8
8	8
24	12
14	10
8	8
14	10
26	10
12	8
10	10
16	8
12	12
18	10
8	8
14	10
8	8
20	8
8	8
8	8
8	8
82	18
130	18
20	12
10	10
20	12
20	8
26	12
70	14
28	12
40	12
12	8
8	8
12	12
16	8
22	14
20	8
8	8
18	10
10	10
8	8
10	10
16	10
26	10
10	10
22	10
20	8
8	8
8	8
20	8
8	8
16	8
16	8
12	12
118	16
10	10
19	7
8	8
8	8
8	8
10	10
16	8
28	10
32	12
8	8
12	8
14	10
8	8
16	8
10	10
8	8
8	8
28	12
16	8
12	8
19	7
18	10
19	7
12	8
8	8
38	12
26	10
8	8
16	8
8	8
18	10
38	10
8	8
16	10
20	12
8	8
18	10
8	8
46	14
20	12
22	14
18	10
12	12
26	10
12	8
8	8
8	8
12	8
8	8
8	8
94	14
10	10
22	10
22	10
19	7
20	12
16	8
20	12
22	10
12	12
10	10
14	8
8	8
10	10
22	14
24	12
10	10
20	8
20	8
16	8
18	10
20	8
10	10
12	8
16	10
22	14
8	8
34	12
14	10
8	8
22	10
30	10
18	10
100	16
30	10
18	10
8	8
44	12
26	10
22	10
20	12
8	8
12	12
36	12
28	12
18	10
18	10
8	8
16	8
26	10
18	10
8	8
12	8
28	10
22	14
16	8
20	12
70	14
28	12
20	12
30	10
16	8
84	16
12	8
8	8
26	10
20	12
10	10
36	12
16	8
8	8
10	10
20	8
20	8
24	12
16	8
20	8
36	12
10	10
8	8
8	8
8	8
32	12
20	8
20	8
40	18
30	10
10	10
8	8
8	8
24	12
10	10
8	8
26	10
22	10
20	8
8	8
10	10
86	18
16	8
14	10
18	10
12	8
30	10
18	10
20	12
20	12
8	8
8	8
20	8
12	8
14	10
8	8
8	8
26	10
8	8
16	8
8	8
24	12
8	8
20	8
43	11
19	7
20	12
30	10
8	8
20	8
10	10
10	10
12	8
8	8
92	16
70	14
19	7
8	8
14	10
30	10
18	10
16	8
18	10
10	10
16	12
16	8
70	14
18	10
152	20
19	7
26	10
102	18
18	10
8	8
38	10
20	12
8	8
30	14
10	10
36	12
19	7
30	14
40	12
20	12
20	8
10	10
12	8
10	10
8	8
18	10
30	10
20	12
16	8
8	8
8	8
8	8
22	10
20	8
16	8
36	12
10	10
140	20
8	8
8	8
8	8
70	14
18	10
16	8
8	8
22	14
18	10
10	10
8	8
140	20
19	7
8	8
22	14
22	10
8	8
80	16
8	8
72	16
8	8
16	8
118	18
14	10
28	12
8	8
8	8
10	10
18	10
14	10
24	12
20	8
8	8
16	8
88	16
16	8
130	18
22	10
16	8
30	10
16	8
8	8
8	8
20	8
12	8
72	16
10	10
38	10
20	8
40	12
10	10
100	18
8	8
22	10
44	12
24	12
8	8
28	10
8	8
10	10
10	10
10	10
26	10
8	8
44	12
10	10
8	8
8	8
16	8
18	10
8	8
20	8
10	10
16	8
20	8
8	8
20	8
108	20
20	8
22	10
82	18
18	10
12	12
10	10
18	10
8	8
8	8
10	10
10	10
8	8
10	10
20	8
120	16
20	12
8	8
8	8
84	16
12	8
12	8
8	8
46	14
20	12
28	12
19	7
43	11
8	8
36	12
19	7
12	12
8	8
22	10
16	8
18	10
10	10
8	8
78	14
8	8
20	8
16	8
84	16
28	10
8	8
8	8
20	12
8	8
10	10
36	12
22	10
16	8
12	8
12	12
22	10
18	10
10	10
72	16
24	12
18	10
20	8
8	8
18	10
26	14
12	12
16	8
22	10
12	8
16	8
36	12
8	8
8	8
22	14
36	12
16	8
42	14
8	8
162	18
18	10
12	12
20	12
22	10
8	8
19	7
28	12
16	8
22	14
32	12
30	10
28	12
19	7
26	10
16	8
8	8
24	12
30	10
72	16
16	8
12	8
16	8
10	10
16	8
20	8
142	22
92	16
12	8
16	8
16	8
48	16
8	8
38	10
16	8
20	8
8	8
8	8
8	8
98	18
30	10
30	10
62	14
48	16
10	10
12	8
18	10
64	16
8	8
106	16
18	10
8	8
18	10
16	8
46	14
18	10
8	8
18	10
20	8
12	8
20	8
16	8
20	8
10	10
8	8
18	10
8	8
26	10
10	10
16	8
8	8
22	10
16	8
10	10
8	8
116	16
18	10
12	12
20	8
20	8
14	10
82	14
10	10
38	10
22	10
30	10
20	12
70	14
10	10
8	8
22	10
10	10
8	8
10	10
8	8
19	7
14	10
8	8
14	10
8	8
43	11
26	10
20	8
14	10
28	12
40	12
10	10
10	10
8	8
22	14
20	12
8	8
20	8
20	8
16	8
8	8
8	8
8	8
20	12
32	12
36	12
36	12
36	12
19	7
8	8
20	8
28	12
12	8
12	8
22	10
8	8
50	14
8	8
8	8
8	8
34	14
10	10
8	8
30	10
10	10
30	10
22	10
12	12
22	10
42	14
12	8
12	8
22	10
8	8
8	8
16	8
30	10
40	12
8	8
10	10
40	12
38	10
22	10
19	7
43	11
8	8
52	16
38	14
16	8
22	10
18	10
8	8
10	10
16	8
12	8
24	12
8	8
30	10
8	8
30	10
12	8
18	10
32	12
10	10
30	10
18	10
14	10
110	14
30	10
10	10
84	16
20	8
16	8
130	22
26	10
8	8
10	10
32	12
18	10
20	12
30	10
26	14
26	10
90	14
20	12
10	10
16	8
100	16
12	8
8	8
10	10
22	10
8	8
8	8
100	16
8	8
22	10
18	10
26	10
10	10
28	10
8	8
8	8
38	10
22	10
102	22
8	8
8	8
8	8
18	10
8	8
10	10
8	8
100	16
18	10
40	12
10	10
70	14
22	14
18	10
20	12
24	12
22	10
12	8
20	8
40	12
20	8
10	10
18	10
18	10
18	10
32	14
14	10
12	8
10	10
8	8
28	10
38	10
18	10
22	10
54	12
16	8
38	10
8	8
16	8
72	16
26	10
28	12
18	10
26	10
10	10
8	8
30	10
18	10
20	8
22	10
22	10
18	10
8	8
22	10
16	8
30	10
8	8
16	8
20	8
38	10
38	10
96	16
20	8
12	8
16	8
8	8
44	12
8	8
96	16
40	12
56	14
20	12
38	10
30	10
16	8
22	10
20	8
8	8
116	16
100	20
18	10
36	12
14	10
12	12
8	8
32	12
26	10
16	8
16	8
18	10
22	10
22	10
19	7
10	10
44	16
96	16
22	10
32	12
36	12
8	8
12	8
38	10
20	8
26	10
140	20
16	8
20	12
12	12
10	10
16	8
8	8
16	8
10	10
8	8
100	16
22	14
22	10
28	12
132	16
8	8
20	12
18	10
44	12
18	10
8	8
36	12
20	12
18	10
10	10
12	12
8	8
8	8
10	10
16	8
20	8
16	8
12	8
20	8
16	10
36	12
8	8
8	8
8	8
8	8
30	14
8	8
20	12
70	14
10	10
20	12
10	10
18	10
82	14
8	8
8	8
22	10
22	10
8	8
16	8
20	8
18	10
38	10
12	8
19	7
70	14
8	8
16	8
20	8
30	10
38	10
18	10
20	12
8	8
36	12
22	10
16	8
26	10
30	10
30	10
14	10
30	10
18	10
12	8
22	10
18	10
8	8
12	8
18	10
18	10
8	8
8	8
10	10
28	12
16	8
38	12
26	10
16	8
12	8
22	14
8	8
14	10
8	8
16	8
50	14
12	12
12	12
20	8
12	12
22	10
18	10
12	12
22	10
14	10
22	10
8	8
8	8
8	8
20	8
20	8
20	8
16	8
10	10
38	10
8	8
36	12
8	8
10	10
8	8
22	10
16	8
22	10
70	14
22	10
30	10
26	10
8	8
22	10
8	8
30	14
20	8
16	8
22	10
12	8
8	8
8	8
22	10
76	16
22	10
10	10
12	12
24	12
96	16
10	10
36	12
32	12
164	16
30	10
18	10
20	8
36	12
20	8
22	10
10	10
10	10
16	8
10	10
148	20
16	10
30	10
8	8
10	10
8	8
38	10
10	10
18	10
18	10
18	10
30	10
36	12
26	10
16	8
30	10
18	10
22	10
26	12
32	12
8	8
20	8
70	14
20	8
8	8
18	10
48	12
12	8
18	10
20	8
20	8
18	10
12	12
16	8
16	8
14	10
10	10
16	8
10	10
28	10
16	8
14	10
8	8
12	8
8	8
16	8
8	8
14	10
8	8
30	10
8	8
22	10
10	10
14	10
10	10
28	10
16	8
22	10
18	14
12	12
80	16
92	16
10	10
10	10
8	8
8	8
28	12
8	8
70	14
14	10
72	16
8	8
20	8
26	10
16	8
20	12
26	14
8	8
130	18
12	8
12	8
22	10
54	12
8	8
40	12
50	14
16	8
10	10
30	10
40	12
10	10
26	10
8	8
12	12
8	8
24	12
22	14
26	10
22	10
26	10
96	16
10	10
62	14
16	8
8	8
43	11
118	18
19	7
18	10
20	12
28	10
8	8
38	14
16	8
18	10
8	8
26	10
10	10
26	10
20	8
8	8
70	14
20	12
8	8
20	8
19	7
10	10
20	8
36	12
10	10
70	14
12	8
64	16
50	14
8	8
8	8
8	8
18	10
20	8
16	8
8	8
20	8
80	16
30	10
8	8
20	12
18	10
43	11
16	8
70	14
8	8
8	8
8	8
8	8
112	18
16	8
30	14
19	7
8	8
22	10
12	8
112	16
70	14
20	12
8	8
76	16
22	10
80	16
38	10
20	8
8	8
10	10
12	8
28	12
12	12
22	10
19	7
18	10
12	8
30	10
12	8
14	10
28	10
8	8
8	8
12	8
12	12
10	10
19	7
26	10
26	10
78	14
8	8
20	12
10	10
20	8
22	10
8	8
10	10
16	8
14	10
8	8
18	10
18	10
8	8
16	8
12	12
8	8
20	8
36	12
8	8
10	10
8	8
18	10
8	8
20	8
36	12
20	12
18	10
84	16
10	10
130	18
18	10
22	10
12	8
10	10
18	10
10	10
8	8
8	8
24	12
8	8
16	8
82	14
38	10
12	8
10	10
18	10
18	10
8	8
36	12
10	10
22	10
22	10
19	7
22	14
20	8
62	18
18	10
20	12
16	8
10	10
22	10
74	18
36	12
16	8
10	10
12	12
8	8
8	8
8	8
14	10
16	10
10	10
18	10
112	20
36	12
48	16
24	12
16	8
30	10
16	8
8	8
12	8
30	10
8	8
19	7
12	8
26	10
18	10
19	7
8	8
36	12
48	12
30	14
18	10
8	8
16	8
8	8
20	8
30	10
18	10
38	14
19	7
38	10
8	8
18	10
8	8
8	8
44	12
26	14
32	12
12	8
44	12
22	10
14	8
12	8
44	12
26	10
26	10
8	8
54	12
19	7
22	10
12	12
16	8
18	10
16	8
20	8
22	10
8	8
18	10
20	12
8	8
10	10
20	12
16	8
20	12
10	10
12	8
26	10
12	8
10	10
10	10
18	10
8	8
24	12
16	8
18	10
26	10
8	8
20	8
38	10
64	16
28	12
10	10
8	8
12	8
12	8
40	12
36	12
8	8
56	16
8	8
43	11
35	11
10	10
38	10
8	8
22	10
8	8
16	8
32	12
44	12
20	12
28	14
8	8
8	8
18	10
22	10
16	8
20	8
18	10
30	10
22	14
12	12
12	8
8	8
18	10
22	10
46	14
8	8
8	8
8	8
20	12
18	10
12	8
18	10
8	8
8	8
92	16
10	10
10	10
22	10
8	8
18	10
19	7
14	10
22	10
22	14
12	8
38	10
20	8
40	12
8	8
100	16
18	10
16	8
38	10
22	10
18	10
8	8
14	10
90	14
18	10
8	8
16	8
12	12
18	10
20	8
10	10
22	10
10	10
24	12
26	10
8	8
22	10
8	8
8	8
8	8
18	10
8	8
8	8
20	12
8	8
18	10
36	12
20	12
18	10
26	10
8	8
20	12
8	8
20	12
20	8
16	8
22	10
12	12
8	8
18	10
22	14
22	10
34	14
18	10
30	10
8	8
22	10
10	10
10	10
8	8
19	7
54	12
8	8
43	11
26	10
16	8
22	10
8	8
18	10
26	10
20	12
124	20
8	8
8	8
8	8
84	16
116	16
42	14
8	8
22	10
18	10
16	8
36	12
16	8
26	10
12	8
10	10
20	8
18	10
8	8
26	10
20	8
32	12
19	7
8	8
38	10
28	12
10	10
38	10
16	8
30	14
10	10
8	8
18	10
18	10
16	8
8	8
98	18
12	8
10	10
18	10
22	14
8	8
24	12
16	8
8	8
20	8
10	10
10	10
18	10
22	10
40	12
28	12
28	12
28	10
10	10
18	10
22	10
8	8
16	8
12	12
12	8
18	10
8	8
10	10
82	14
18	10
18	10
8	8
20	8
16	8
10	10
36	12
20	12
8	8
8	8
26	10
26	10
12	8
10	10
8	8
70	14
18	10
8	8
18	10
8	8
72	16
192	28
22	14
26	10
8	8
40	12
10	10
10	10
18	10
82	14
8	8
8	8
16	8
20	8
8	8
8	8
22	10
8	8
26	10
10	10
22	10
12	12
28	12
10	10
20	8
8	8
64	16
18	10
16	8
8	8
8	8
8	8
10	10
22	10
18	10
8	8
22	10
20	12
20	12
180	24
8	8
8	8
16	8
42	14
10	10
106	18
160	16
14	10
30	10
16	10
8	8
14	10
18	10
10	10
18	10
26	10
16	8
46	14
18	10
8	8
19	7
8	8
10	10
8	8
50	18
18	10
20	12
19	7
20	8
22	14
26	10
56	16
12	8
8	8
20	12
10	10
18	10
10	10
8	8
26	10
30	10
20	12
16	8
70	14
84	16
20	8
74	14
18	10
26	10
20	8
12	8
134	18
22	10
38	10
22	10
8	8
10	10
8	8
8	8
8	8
44	12
20	8
20	8
30	14
10	10
28	12
38	10
98	18
18	10
8	8
19	7
10	10
8	8
10	10
8	8
12	8
16	8
8	8
70	14
8	8
16	8
80	16
16	8
16	8
8	8
18	10
8	8
16	8
12	8
10	10
10	10
8	8
19	7
30	14
80	16
10	10
10	10
16	8
10	10
16	8
26	10
18	10
8	8
8	8
18	10
20	8
20	8
8	8
18	10
20	8
20	8
8	8
20	8
12	8
20	8
12	8
20	12
10	10
8	8
24	12
22	10
30	10
8	8
46	14
28	12
8	8
18	10
8	8
20	12
16	8
19	7
18	10
19	7
26	10
20	8
18	10
12	8
20	12
30	10
22	10
118	18
20	12
16	8
18	10
19	7
10	10
28	12
10	10
10	10
8	8
19	7
18	10
20	8
10	10
26	10
18	10
8	8
14	8
8	8
72	16
18	10
38	10
40	12
8	8
64	16
38	12
30	14
8	8
18	10
108	20
19	7
19	7
8	8
26	10
19	7
46	18
8	8
26	10
16	8
44	12
138	18
8	8
8	8
36	12
12	8
19	7
8	8
20	8
20	12
18	10
30	10
16	8
14	10
32	12
12	8
16	10
50	14
16	10
8	8
24	12
8	8
18	10
26	10
20	8
19	7
44	12
38	10
19	7
20	8
76	16
8	8
30	10
8	8
26	10
22	10
8	8
43	11
8	8
20	12
8	8
12	8
106	18
22	10
19	7
84	20
10	10
32	12
16	10
55	13
12	8
22	10
22	10
20	8
10	10
20	8
18	10
32	12
19	7
16	8
8	8
24	12
18	10
12	8
18	10
68	16
8	8
10	10
16	8
16	8
20	12
20	8
22	10
22	10
18	10
70	14
18	10
100	20
38	10
12	8
8	8
8	8
8	8
10	10
18	10
8	8
16	8
28	12
22	10
12	8
20	8
20	12
8	8
8	8
36	12
20	8
8	8
22	10
12	8
20	8
110	22
19	7
8	8
30	10
18	10
8	8
18	10
10	10
16	8
20	12
16	8
20	12
48	12
18	10
14	8
8	8
16	8
22	10
20	8
28	12
10	10
8	8
14	10
110	14
12	12
26	10
16	8
12	12
8	8
14	10
22	10
8	8
8	8
10	10
16	8
20	8
30	10
22	10
18	10
32	12
8	8
18	10
36	12
14	8
16	8
20	8
10	10
26	10
20	12
26	10
12	8
20	8
18	10
44	12
8	8
8	8
36	12
12	8
16	8
19	7
163	19
100	16
10	10
90	14
28	10
19	7
26	10
19	7
8	8
20	8
10	10
16	8
44	12
8	8
18	10
8	8
24	12
8	8
20	12
8	8
104	16
22	10
8	8
24	12
8	8
20	8
10	10
30	10
32	12
20	8
8	8
8	8
22	10
44	12
14	10
16	8
28	12
30	10
60	16
22	10
14	10
20	8
12	8
110	18
8	8
62	14
10	10
16	8
38	10
14	10
32	12
16	8
102	18
10	10
16	8
20	8
22	10
10	10
8	8
16	8
26	10
14	10
36	12
8	8
16	8
16	12
22	10
8	8
8	8
28	12
12	8
30	10
106	18
8	8
8	8
10	10
38	10
20	8
22	14
84	16
30	10
16	8
8	8
20	12
18	10
16	8
16	8
8	8
16	8
10	10
20	8
28	12
10	10
20	12
22	10
14	10
8	8
8	8
26	10
19	7
8	8
18	10
20	8
8	8
26	10
22	10
20	8
10	10
10	10
10	10
86	18
80	16
16	8
10	10
10	10
24	12
22	10
10	10
8	8
10	10
10	10
106	18
8	8
18	10
10	10
19	7
30	10
8	8
18	10
28	10
18	10
38	12
16	8
16	8
16	8
20	12
10	10
10	10
8	8
16	8
20	12
18	10
8	8
16	8
72	16
38	10
30	10
10	10
43	11
8	8
18	12
26	10
20	12
8	8
10	10
20	12
8	8
16	8
8	8
10	10
8	8
14	10
22	10
16	8
16	8
18	10
16	8
8	8
18	10
26	10
8	8
58	14
26	10
18	10
20	8
20	12
26	10
10	10
38	12
8	8
8	8
18	10
8	8
8	8
18	10
20	12
18	10
86	14
14	10
8	8
20	12
12	8
12	8
26	10
90	18
16	8
66	18
10	10
10	10
28	14
43	11
74	18
12	8
20	8
14	10
20	8
30	10
8	8
16	8
18	10
18	10
8	8
22	10
80	16
19	7
12	12
22	10
28	12
8	8
18	10
22	10
10	10
12	8
8	8
8	8
18	10
8	8
19	7
10	10
8	8
30	14
72	16
40	12
26	10
18	10
8	8
22	10
10	10
8	8
24	12
19	7
18	10
16	8
42	14
82	18
22	10
8	8
22	14
16	8
46	14
16	12
18	10
8	8
36	12
8	8
8	8
16	8
26	12
30	10
12	8
8	8
18	10
18	10
20	12
18	10
18	10
10	10
8	8
8	8
10	10
28	10
12	8
48	14
20	12
20	8
38	10
10	10
19	7
8	8
26	10
18	10
8	8
90	18
8	8
10	10
10	10
28	12
18	10
20	12
20	8
8	8
20	8
20	12
10	10
16	8
18	10
72	16
34	14
28	12
16	8
18	10
22	10
24	12
8	8
16	8
16	8
8	8
8	8
22	10
8	8
10	10
20	12
20	12
44	12
26	10
92	20
28	12
10	10
16	8
20	8
12	8
20	8
44	12
8	8
10	10
16	8
26	10
26	10
57	13
18	10
19	7
19	7
18	10
38	10
100	16
22	10
8	8
18	12
38	10
20	8
80	16
20	12
22	10
40	14
32	12
8	8
20	8
16	8
14	8
20	12
104	16
8	8
40	12
26	10
20	8
22	10
8	8
18	10
22	10
38	10
10	10
12	12
12	12
34	14
70	14
8	8
10	10
16	8
42	12
18	10
10	10
12	8
30	10
22	14
22	10
8	8
8	8
42	14
8	8
38	10
26	10
12	8
10	10
10	10
20	8
20	8
22	10
16	8
22	10
78	18
136	20
8	8
16	8
8	8
104	16
8	8
18	10
26	14
8	8
120	16
16	8
8	8
80	16
10	10
104	18
10	10
28	10
12	8
16	12
26	10
26	10
76	16
19	7
18	10
22	14
20	8
10	10
16	8
28	12
26	10
8	8
204	24
40	12
16	8
8	8
8	8
70	14
40	12
8	8
18	10
16	8
38	10
20	12
12	8
18	10
14	10
22	10
8	8
26	14
18	10
18	10
8	8
22	10
8	8
8	8
8	8
8	8
18	10
22	10
18	10
20	8
8	8
12	12
20	12
22	14
124	18
18	10
12	8
14	10
12	8
150	18
8	8
12	8
152	20
8	8
126	16
30	10
10	10
18	10
14	8
16	8
8	8
8	8
16	8
20	8
8	8
26	10
26	10
8	8
14	8
8	8
8	8
68	16
20	8
26	10
8	8
8	8
16	8
16	8
46	14
8	8
8	8
10	10
22	10
8	8
44	12
8	8
10	10
84	16
10	10
46	14
28	12
166	22
8	8
16	8
10	10
18	10
38	10
108	20
19	7
50	14
12	8
10	10
70	14
20	8
30	10
20	8
16	12
8	8
8	8
8	8
34	14
20	8
32	12
18	10
8	8
16	8
22	10
16	8
8	8
20	8
22	10
60	16
222	30
44	12
38	10
16	8
30	14
8	8
8	8
54	12
20	12
8	8
16	12
24	12
14	10
20	12
8	8
18	10
10	10
10	10
22	14
22	10
38	14
70	14
10	10
22	10
8	8
18	10
80	16
20	8
12	8
26	10
20	12
8	8
30	10
8	8
10	10
8	8
50	14
72	16
10	10
20	12
8	8
26	10
16	8
22	10
16	8
90	18
196	24
36	12
20	12
8	8
8	8
72	16
12	8
22	14
80	16
48	12
30	10
14	10
20	8
20	12
26	10
8	8
20	12
16	8
10	10
8	8
32	12
36	12
40	12
16	8
114	18
10	10
80	16
19	7
18	10
10	10
32	12
8	8
8	8
164	16
32	12
16	8
10	10
18	10
56	14
26	10
24	12
26	10
26	10
18	10
18	10
44	12
20	8
8	8
16	8
16	8
16	8
20	12
26	10
28	12
38	14
16	8
28	12
8	8
16	8
16	12
32	16
18	10
8	8
20	12
98	18
8	8
36	12
22	10
10	10
20	8
42	14
100	14
10	10
36	12
32	12
8	8
20	8
8	8
10	10
8	8
20	12
26	10
26	10
20	8
20	12
22	10
88	16
18	10
20	8
26	10
8	8
20	8
22	10
8	8
20	12
26	10
8	8
8	8
22	10
22	10
10	10
28	10
14	10
12	8
68	16
36	12
22	10
8	8
8	8
10	10
220	22
8	8
22	14
72	16
8	8
20	12
10	10
16	8
20	8
8	8
8	8
18	10
38	10
18	10
12	12
8	8
12	12
12	8
64	16
38	10
8	8
8	8
16	8
18	10
16	8
20	8
18	10
19	7
16	8
8	8
8	8
8	8
18	10
8	8
8	8
8	8
8	8
8	8
20	12
20	8
8	8
40	12
12	12
88	16
8	8
8	8
44	12
8	8
20	8
14	8
12	8
44	12
10	10
14	10
80	16
20	8
8	8
8	8
30	10
22	10
8	8
16	8
8	8
8	8
16	12
12	8
8	8
12	8
12	8
24	12
36	12
20	12
20	8
8	8
20	8
70	14
140	20
12	8
8	8
38	10
26	10
26	10
8	8
8	8
8	8
24	12
18	10
16	8
38	12
36	12
8	8
16	8
8	8
44	12
28	12
76	16
16	8
18	10
8	8
18	10
18	10
8	8
12	8
22	10
16	8
30	10
80	16
8	8
8	8
12	8
80	16
106	18
22	14
8	8
8	8
26	10
18	10
8	8
16	12
20	8
10	10
20	12
90	16
28	12
19	7
30	10
10	10
80	16
96	16
44	12
14	10
16	8
19	7
8	8
12	8
8	8
16	8
14	10
16	8
12	8
8	8
19	7
30	10
110	18
84	16
28	12
32	16
28	12
24	12
43	11
22	14
16	8
19	7
20	8
10	10
28	10
20	8
70	14
24	12
116	16
16	8
38	10
74	18
26	10
26	10
8	8
16	8
16	8
16	8
20	8
12	12
12	8
8	8
12	8
20	8
16	8
8	8
8	8
8	8
82	18
18	10
8	8
38	14
22	10
30	14
8	8
38	10
10	10
22	14
46	14
30	10
42	14
8	8
16	8
34	14
82	14
20	12
8	8
10	10
8	8
8	8
22	10
10	10
19	7
8	8
8	8
8	8
19	7
12	12
62	14
10	10
12	12
12	8
30	10
28	12
19	7
19	7
18	10
10	10
12	12
30	10
22	10
8	8
10	10
140	20
16	10
8	8
8	8
20	12
8	8
28	12
8	8
16	8
118	16
18	10
178	22
8	8
12	8
8	8
12	8
32	12
142	18
20	12
8	8
18	10
12	8
8	8
26	10
8	8
38	10
8	8
70	14
8	8
54	12
8	8
16	8
16	8
30	14
16	8
20	8
88	16
28	12
18	10
22	10
8	8
10	10
22	10
38	14
12	8
8	8
12	8
110	18
22	10
8	8
22	14
12	8
10	10
22	10
19	7
8	8
26	10
16	8
10	10
18	10
8	8
18	10
19	7
20	12
16	8
30	10
8	8
26	10
16	8
20	8
194	22
30	10
28	12
14	10
36	12
8	8
28	12
20	8
16	8
8	8
30	10
16	8
16	8
8	8
8	8
8	8
8	8
10	10
10	10
8	8
30	10
20	8
19	7
12	12
30	10
70	14
28	12
8	8
10	10
20	12
22	10
8	8
82	14
8	8
12	8
8	8
44	12
43	11
166	22
16	8
16	8
16	8
12	12
10	10
16	8
96	16
152	20
110	16
70	14
28	10
8	8
16	8
20	12
10	10
8	8
8	8
18	10
12	8
14	10
8	8
16	8
20	12
10	10
30	10
16	8
16	8
30	10
20	8
22	10
26	10
10	10
20	12
8	8
70	14
8	8
14	10
10	10
72	16
19	7
70	14
8	8
70	14
16	8
96	16
44	12
12	8
12	12
8	8
22	10
20	12
20	12
40	12
22	10
30	10
16	8
8	8
36	12
22	10
34	12
84	16
20	12
18	10
16	8
10	10
16	8
48	16
16	8
12	8
8	8
12	8
30	10
10	10
12	12
68	16
20	8
16	8
26	14
10	10
20	12
43	11
32	12
12	8
20	12
10	10
18	10
12	12
22	10
30	14
8	8
46	14
8	8
16	10
16	8
32	12
20	8
26	10
16	8
88	16
8	8
10	10
8	8
8	8
26	10
10	10
14	10
8	8
38	10
32	12
10	10
8	8
18	10
74	14
18	10
10	10
18	10
22	14
18	10
16	8
20	8
19	7
8	8
26	10
16	8
12	8
8	8
28	12
20	12
22	10
22	10
16	8
22	10
10	10
26	10
10	10
16	8
12	8
12	8
20	8
10	10
8	8
18	10
18	10
16	8
8	8
22	10
24	12
19	7
38	10
18	10
18	10
14	10
18	10
28	12
8	8
20	12
80	16
32	12
12	8
36	12
20	8
8	8
10	10
32	12
44	12
19	7
20	8
26	10
8	8
20	12
26	14
20	8
8	8
16	8
10	10
18	10
8	8
16	8
10	10
22	10
32	12
8	8
20	12
8	8
16	8
16	8
12	12
8	8
16	8
40	12
20	12
22	10
26	10
26	10
14	10
12	12
8	8
20	12
8	8
44	12
10	10
20	8
12	8
8	8
20	8
20	8
8	8
28	10
10	10
10	10
18	10
8	8
20	8
8	8
96	20
8	8
20	8
20	8
18	10
12	8
26	10
84	16
18	10
16	8
22	10
30	10
20	8
28	12
18	10
10	10
8	8
8	8
18	10
20	8
10	10
19	7
22	10
24	12
18	10
10	10
30	10
12	8
43	11
12	8
96	16
18	10
10	10
44	12
20	8
20	8
32	12
18	10
18	10
12	8
19	7
20	12
8	8
26	10
26	10
154	18
16	8
80	16
22	10
12	8
104	14
20	8
20	8
12	12
36	12
18	10
108	16
36	12
8	8
20	8
100	16
10	10
20	8
80	16
12	8
12	12
8	8
22	10
8	8
8	8
20	8
8	8
28	12
26	10
18	10
8	8
22	10
12	8
84	16
20	12
26	10
20	12
8	8
16	8
12	8
22	10
8	8
43	11
18	10
8	8
20	12
48	16
22	10
8	8
22	14
56	16
8	8
8	8
16	8
28	10
12	8
12	8
28	12
12	8
38	10
10	10
80	16
26	10
18	10
26	10
8	8
16	8
22	14
10	10
28	12
16	8
22	10
22	10
20	8
18	10
19	7
10	10
12	8
8	8
38	10
10	10
10	10
8	8
18	10
26	10
16	8
10	10
10	10
8	8
84	20
18	10
35	11
10	10
16	8
8	8
8	8
18	10
38	10
16	8
10	10
26	10
16	8
20	8
38	10
8	8
26	10
22	10
24	12
72	16
8	8
10	10
8	8
12	8
16	8
26	10
44	12
8	8
20	8
20	8
8	8
22	10
20	12
14	8
20	8
30	10
30	10
10	10
10	10
16	8
20	12
10	10
30	10
18	10
26	10
90	16
10	10
19	7
16	8
10	10
12	8
10	10
26	14
14	10
8	8
22	14
10	10
20	8
20	8
10	10
8	8
16	8
19	7
8	8
8	8
16	8
10	10
18	10
16	10
22	10
52	16
22	14
28	12
36	12
104	16
20	8
22	10
38	10
8	8
44	12
20	8
14	10
10	10
112	16
16	8
10	10
8	8
28	12
20	8
38	10
10	10
26	10
30	10
10	10
14	10
8	8
20	12
20	8
8	8
30	10
16	8
22	14
12	8
10	10
32	12
80	16
86	18
18	10
70	14
8	8
8	8
12	8
30	14
32	12
80	16
12	8
20	12
26	10
16	8
12	8
32	12
16	8
10	10
8	8
10	10
8	8
18	10
16	8
70	14
10	10
224	28
10	10
16	8
20	8
24	12
20	12
22	10
8	8
18	10
8	8
8	8
30	14
32	12
8	8
16	8
20	12
16	8
46	14
48	16
8	8
12	12
10	10
10	10
70	14
8	8
10	10
20	8
28	12
16	8
44	12
20	8
18	10
8	8
20	8
44	12
24	12
30	10
22	14
18	10
36	12
16	8
30	12
18	10
8	8
20	12
8	8
20	12
8	8
8	8
48	12
92	16
30	10
22	10
18	10
22	10
20	8
14	8
30	10
48	16
18	10
18	10
8	8
10	10
8	8
72	16
18	10
18	10
16	8
10	10
8	8
8	8
12	12
8	8
10	10
16	8
70	14
16	8
80	16
30	14
58	14
18	10
18	10
18	10
16	8
47	13
28	12
16	8
26	10
10	10
22	10
19	7
16	8
26	10
8	8
12	8
8	8
18	10
8	8
82	14
22	10
30	10
8	8
26	10
18	10
8	8
80	16
10	10
8	8
212	22
30	10
28	12
19	7
16	8
20	12
18	10
19	7
16	8
20	8
16	8
10	10
14	8
16	8
10	10
18	10
32	12
88	16
8	8
38	10
22	10
16	12
12	8
8	8
18	10
16	8
26	10
8	8
43	11
8	8
58	18
16	8
18	10
18	10
20	12
8	8
20	12
16	8
88	16
92	20
28	10
144	20
10	10
20	8
10	10
36	12
8	8
12	12
18	10
16	8
20	12
16	8
26	10
10	10
8	8
26	10
20	8
8	8
20	8
10	10
10	10
12	8
70	14
10	10
12	12
16	8
18	10
10	10
30	10
8	8
26	10
20	12
40	12
12	12
26	14
26	10
18	10
22	10
10	10
8	8
8	8
19	7
8	8
82	18
104	16
8	8
22	10
76	16
22	14
92	16
10	10
10	10
8	8
8	8
12	8
20	12
18	10
30	14
18	10
20	8
80	16
16	8
22	10
16	8
20	8
14	10
38	10
72	16
8	8
38	10
20	8
18	10
8	8
8	8
8	8
30	10
22	14
18	10
38	10
18	10
84	16
8	8
8	8
16	8
18	10
22	10
8	8
19	7
8	8
16	8
8	8
8	8
16	8
18	10
80	16
16	8
34	14
20	8
42	14
42	14
12	8
30	14
10	10
144	20
84	16
8	8
8	8
22	10
8	8
78	14
8	8
10	10
10	10
19	7
126	22
20	12
8	8
10	10
8	8
8	8
20	12
80	16
12	8
18	12
166	18
8	8
8	8
18	10
20	8
80	16
12	12
18	10
16	8
36	12
20	8
16	8
12	8
28	12
8	8
10	10
16	8
44	12
8	8
8	8
16	8
10	10
24	12
72	16
26	10
20	8
16	8
8	8
36	12
26	10
8	8
8	8
8	8
20	12
43	11
14	10
20	12
22	10
8	8
18	10
22	10
18	10
14	10
18	10
30	10
20	12
20	12
12	8
30	10
18	10
10	10
20	8
22	10
22	10
26	10
14	10
16	8
8	8
20	8
8	8
8	8
8	8
32	12
18	10
22	14
10	10
12	8
26	10
16	8
30	10
20	8
8	8
16	8
10	10
74	14
16	8
10	10
12	8
8	8
38	10
30	10
10	10
10	10
14	10
8	8
8	8
18	10
12	12
30	10
12	8
158	22
18	10
30	12
22	10
26	10
12	8
16	8
22	14
32	12
55	13
8	8
16	8
8	8
10	10
22	10
22	10
22	10
14	10
22	10
8	8
8	8
46	16
18	10
22	10
20	12
18	10
18	10
36	12
8	8
8	8
18	10
22	10
74	14
19	7
8	8
82	18
22	10
30	14
92	16
16	8
10	10
8	8
12	12
36	12
18	10
24	12
16	8
8	8
16	8
30	10
10	10
20	8
12	8
38	12
120	16
8	8
40	12
8	8
22	10
80	16
16	8
8	8
22	10
12	12
22	10
20	12
20	8
8	8
18	10
16	8
8	8
40	12
32	12
22	10
10	10
36	12
16	8
12	8
84	16
16	8
8	8
20	8
16	8
22	10
8	8
22	10
10	10
36	12
18	10
8	8
18	10
8	8
36	16
10	10
10	10
30	14
18	10
38	10
44	12
194	22
8	8
28	12
20	8
16	8
20	8
20	12
10	10
16	8
36	12
18	10
20	12
18	10
12	8
10	10
8	8
30	10
12	8
10	10
18	10
12	8
76	14
8	8
10	10
18	10
8	8
10	10
20	8
18	10
18	10
28	12
10	10
18	10
90	14
80	16
20	8
18	10
8	8
8	8
10	10
10	10
8	8
16	8
10	10
36	12
16	8
14	8
20	8
16	8
8	8
22	10
18	10
12	8
28	12
12	12
80	16
8	8
22	10
10	10
44	12
16	8
16	8
10	10
10	10
10	10
84	16
8	8
34	14
16	8
10	10
40	12
12	8
20	8
10	10
22	10
12	12
8	8
10	10
12	8
8	8
20	8
10	10
16	8
26	10
44	12
28	12
30	14
22	10
22	10
14	10
82	14
100	14
56	14
12	8
18	10
8	8
16	8
28	12
70	14
8	8
40	12
16	8
14	10
32	12
36	12
26	10
20	8
8	8
8	8
8	8
10	10
22	10
30	10
22	10
92	16
20	8
22	10
8	8
8	8
14	10
8	8
28	12
8	8
22	10
8	8
82	18
22	10
38	14
12	8
8	8
84	16
8	8
8	8
26	10
20	8
14	10
18	10
20	12
16	8
8	8
12	8
28	12
22	10
22	10
80	16
18	10
10	10
8	8
20	12
70	14
40	12
16	8
78	14
76	16
32	12
110	14
16	8
38	10
16	8
18	10
10	10
8	8
8	8
8	8
22	14
20	8
20	12
8	8
46	12
26	10
22	10
20	8
16	8
22	10
22	14
8	8
8	8
22	10
8	8
18	10
18	10
16	8
8	8
8	8
12	8
10	10
18	10
18	10
16	8
28	12
160	16
8	8
26	10
32	12
16	8
20	8
10	10
36	12
14	10
106	18
8	8
8	8
14	10
8	8
22	10
10	10
16	8
20	12
12	12
36	12
8	8
30	10
10	10
8	8
8	8
8	8
16	8
22	10
44	12
8	8
10	10
20	8
10	10
12	8
38	10
12	8
90	14
30	10
44	12
18	10
8	8
16	8
20	8
70	14
8	8
38	10
16	8
80	16
20	12
90	16
18	10
8	8
19	7
8	8
30	12
8	8
12	12
35	11
10	10
16	8
16	8
8	8
18	10
20	12
38	10
22	10
10	10
19	7
16	8
22	10
12	8
110	14
32	12
150	20
26	10
36	12
20	8
20	8
8	8
10	10
22	14
14	10
18	10
8	8
8	8
20	8
30	10
16	8
20	8
20	8
44	12
12	8
19	7
10	10
8	8
12	8
18	10
18	10
34	14
26	10
16	8
18	10
92	16
8	8
30	10
8	8
26	10
16	10
12	8
8	8
8	8
8	8
18	10
10	10
124	20
8	8
16	8
8	8
18	10
16	8
20	12
8	8
8	8
20	8
58	14
30	10
16	8
20	12
26	10
8	8
26	10
8	8
30	10
8	8
8	8
10	10
8	8
18	10
26	10
8	8
16	12
10	10
20	8
19	7
16	8
28	12
8	8
16	8
18	10
20	8
16	8
10	10
8	8
16	8
18	10
20	8
12	12
8	8
22	10
8	8
28	12
20	8
12	8
20	8
16	12
26	10
10	10
18	10
70	14
8	8
44	12
8	8
80	16
8	8
40	12
26	10
14	10
8	8
12	8
58	14
10	10
8	8
46	14
38	10
30	10
12	8
8	8
8	8
10	10
19	7
8	8
8	8
142	18
18	10
12	8
16	8
10	10
22	10
12	12
22	10
28	12
8	8
12	8
10	10
70	14
8	8
10	10
8	8
22	10
20	12
74	14
10	10
8	8
8	8
8	8
18	10
10	10
18	10
36	12
32	12
80	16
28	12
20	8
16	8
16	8
26	10
8	8
8	8
14	10
8	8
12	12
16	8
8	8
10	10
8	8
22	10
26	10
10	10
26	10
16	8
18	10
58	14
8	8
16	8
18	10
30	10
28	12
20	8
8	8
18	10
22	10
8	8
20	8
12	8
124	16
22	10
16	8
44	12
34	14
16	8
26	10
19	7
130	14
22	10
22	10
96	16
18	10
26	10
22	10
10	10
44	12
12	8
18	10
26	10
8	8
8	8
32	12
8	8
10	10
8	8
10	10
12	8
26	10
19	7
18	10
98	14
10	10
10	10
8	8
30	10
8	8
8	8
18	10
8	8
35	11
30	10
12	8
26	10
10	10
20	12
10	10
10	10
36	12
18	10
20	8
114	18
22	10
20	8
22	10
8	8
18	10
12	8
18	10
20	12
22	10
18	10
12	8
22	10
8	8
10	10
20	12
12	12
16	8
10	10
12	12
8	8
22	10
19	7
16	8
20	12
19	7
20	8
8	8
8	8
8	8
8	8
28	12
8	8
8	8
20	8
10	10
8	8
19	7
22	10
10	10
19	7
70	14
10	10
18	10
28	12
18	10
16	8
8	8
18	10
10	10
19	7
34	14
8	8
38	10
12	12
19	7
10	10
28	12
10	10
14	8
8	8
18	10
8	8
20	12
8	8
126	18
16	8
18	10
12	12
24	12
26	10
22	10
8	8
8	8
20	8
12	8
18	10
44	12
28	10
8	8
8	8
12	8
10	10
40	12
8	8
19	7
10	10
22	10
8	8
8	8
20	12
8	8
156	20
74	18
22	10
28	12
18	10
98	18
8	8
20	12
10	10
12	8
26	10
88	16
146	22
8	8
12	8
16	12
12	8
10	10
16	8
82	16
38	10
16	8
8	8
26	10
8	8
22	10
8	8
30	10
10	10
22	10
20	8
12	8
19	7
20	12
20	8
16	8
20	8
20	12
8	8
44	12
18	10
10	10
120	16
20	8
18	10
10	10
30	10
22	14
26	10
20	12
20	8
8	8
8	8
20	12
10	10
10	10
22	14
18	10
12	8
16	8
12	12
10	10
100	18
70	14
20	8
16	8
46	12
30	10
16	8
124	18
34	12
36	12
22	10
12	8
19	7
10	10
18	10
26	10
10	10
28	12
24	12
70	14
36	12
26	10
18	10
26	10
50	14
19	7
26	10
16	8
22	10
8	8
28	12
16	8
18	10
26	10
12	12
26	10
28	10
98	18
8	8
8	8
20	8
20	8
16	8
10	10
8	8
16	8
18	10
10	10
8	8
16	8
18	10
24	12
8	8
55	13
8	8
18	10
70	14
20	12
90	18
86	18
16	8
18	10
22	10
18	10
28	10
10	10
16	8
18	10
82	14
20	8
22	10
22	10
10	10
26	14
28	12
22	10
26	10
18	10
8	8
8	8
22	14
20	8
8	8
16	8
10	10
22	10
14	10
8	8
8	8
18	10
16	8
30	14
22	14
86	18
8	8
8	8
8	8
36	12
20	8
10	10
40	16
22	10
8	8
28	12
16	12
8	8
20	8
10	10
18	10
8	8
10	10
16	8
10	10
19	7
18	10
26	10
8	8
8	8
14	10
36	12
18	10
30	10
40	12
12	8
22	10
18	10
14	10
30	10
8	8
8	8
10	10
58	14
20	8
12	12
8	8
8	8
38	10
18	10
10	10
8	8
44	12
8	8
12	8
10	10
10	10
28	12
54	12
8	8
43	11
20	8
44	12
19	7
10	10
8	8
144	20
26	10
8	8
14	10
10	10
20	8
18	10
8	8
18	10
16	8
20	12
30	14
8	8
160	16
20	12
18	10
8	8
92	16
8	8
22	10
8	8
8	8
8	8
8	8
38	10
10	10
94	18
20	8
10	10
12	12
10	10
8	8
36	12
16	8
8	8
18	10
8	8
8	8
20	8
30	10
10	10
16	8
14	10
26	10
16	8
18	10
8	8
8	8
16	8
38	10
20	8
22	10
20	8
20	8
8	8
16	8
19	7
8	8
8	8
26	10
8	8
26	10
152	20
38	12
18	10
8	8
28	12
8	8
8	8
120	16
90	14
30	10
12	8
18	10
8	8
8	8
18	10
20	12
19	7
38	10
20	12
10	10
8	8
10	10
12	8
16	8
28	12
44	12
76	16
8	8
12	8
26	10
22	10
190	22
19	7
20	8
12	8
22	10
20	8
28	14
8	8
10	10
18	10
8	8
16	8
172	20
12	8
8	8
46	14
18	10
10	10
18	10
10	10
28	12
8	8
80	16
18	10
16	8
16	8
36	12
16	8
8	8
176	24
16	8
8	8
8	8
30	10
12	12
10	10
8	8
26	10
12	8
10	10
8	8
10	10
20	8
16	8
8	8
30	10
8	8
84	16
8	8
20	8
20	12
8	8
12	8
30	10
26	10
24	12
12	8
16	8
10	10
20	8
20	8
12	12
8	8
18	10
22	10
20	8
10	10
10	10
12	8
8	8
8	8
14	10
18	10
22	10
8	8
20	8
12	8
18	10
100	16
30	14
46	12
43	11
10	10
20	12
80	16
8	8
26	10
8	8
19	7
18	10
14	14
18	10
28	12
38	10
19	7
14	10
80	16
12	12
12	8
18	10
44	16
22	10
30	10
8	8
16	8
20	12
120	16
8	8
24	16
40	12
8	8
18	10
28	12
30	10
10	10
66	14
16	8
36	12
18	10
8	8
10	10
20	12
28	12
18	10
43	11
20	8
20	12
80	16
18	10
8	8
18	10
8	8
10	10
20	8
26	10
32	12
16	8
20	8
14	10
8	8
22	10
16	8
30	10
38	14
20	12
24	12
18	10
8	8
22	10
18	10
22	10
88	16
8	8
10	10
10	10
14	10
18	10
26	10
8	8
46	14
26	10
8	8
19	7
18	10
10	10
22	10
12	8
26	10
38	14
18	10
22	10
20	8
16	8
26	10
10	10
20	8
22	10
12	12
38	10
110	18
12	8
12	8
40	12
18	10
10	10
24	12
43	11
78	14
19	7
26	14
8	8
10	10
12	8
19	7
20	12
10	10
28	10
20	8
10	10
18	10
16	8
16	8
16	8
16	8
130	14
38	10
19	7
8	8
20	12
30	10
8	8
8	8
16	8
8	8
18	10
30	10
104	16
38	12
8	8
20	12
8	8
12	12
16	10
18	10
28	10
19	7
48	12
12	12
12	12
10	10
30	10
8	8
16	8
8	8
20	12
8	8
19	7
8	8
38	10
28	12
38	10
8	8
16	8
8	8
42	14
20	12
16	8
18	10
18	10
8	8
18	10
118	18
8	8
20	12
8	8
8	8
18	10
20	12
42	12
16	8
14	8
20	12
28	10
42	14
8	8
94	18
12	12
20	8
19	7
8	8
12	8
12	8
100	16
8	8
10	10
10	10
20	8
10	10
8	8
19	7
28	12
80	16
18	10
14	10
28	12
18	10
20	12
18	10
20	8
16	8
18	10
22	10
110	14
22	10
18	10
10	10
10	10
18	10
22	14
16	8
70	14
22	10
20	8
8	8
8	8
8	8
12	12
8	8
8	8
8	8
20	12
8	8
8	8
14	10
26	10
38	10
14	10
16	8
22	10
12	8
22	10
124	20
16	8
19	7
22	14
26	10
8	8
22	10
18	10
16	8
10	10
54	18
8	8
22	10
20	12
18	10
42	12
18	10
30	10
16	8
20	8
12	12
8	8
10	10
16	8
18	10
8	8
8	8
8	8
19	7
34	14
46	14
16	8
19	7
18	10
8	8
20	12
16	8
10	10
28	12
48	14
80	16
10	10
22	10
20	8
26	10
144	20
26	10
20	8
8	8
8	8
26	10
22	10
20	8
22	10
26	10
18	10
38	10
30	10
22	10
10	10
16	8
8	8
20	8
18	10
16	8
30	10
48	14
16	8
32	12
8	8
16	8
8	8
16	8
10	10
8	8
32	12
28	12
26	10
38	14
24	12
10	10
18	10
22	10
10	10
26	10
10	10
8	8
32	12
19	7
76	16
20	8
10	10
16	8
8	8
16	10
8	8
8	8
18	10
8	8
70	14
8	8
8	8
38	10
8	8
26	10
8	8
8	8
12	8
18	10
30	10
12	8
8	8
19	7
18	10
8	8
10	10
10	10
18	10
10	10
35	11
8	8
8	8
30	10
10	10
22	10
38	10
10	10
72	16
8	8
28	12
8	8
8	8
100	20
8	8
22	14
8	8
16	8
26	10
16	8
10	10
16	8
10	10
10	10
32	12
16	8
16	8
36	12
10	10
8	8
12	8
8	8
36	12
8	8
22	10
22	10
88	16
10	10
20	12
36	12
14	8
20	8
8	8
26	10
8	8
16	8
46	14
8	8
8	8
8	8
20	8
16	8
19	7
16	8
8	8
108	16
18	10
16	8
8	8
10	10
18	10
26	10
8	8
16	8
10	10
8	8
30	10
36	12
20	8
10	10
8	8
26	10
