Score	Length
260	48
232	32
84	32
414	48
264	40
70	30
194	30
198	42
152	28
518	58
836	66
1150	62
122	22
240	44
144	32
184	28
70	18
120	24
96	32
344	40
534	46
272	32
142	46
96	24
406	36
502	50
144	24
1545	88
78	30
212	30
110	30
100	32
100	28
148	24
220	28
142	30
1048	70
176	32
232	48
554	52
92	32
56	20
294	34
474	54
832	60
82	30
204	40
574	48
442	48
770	66
672	50
588	64
1052	68
158	30
254	26
426	42
542	42
320	44
934	52
176	32
700	52
192	36
332	36
104	28
196	32
1406	74
108	20
124	36
580	54
328	36
100	24
920	56
176	20
990	66
108	32
320	32
410	42
560	48
784	58
478	54
778	62
614	54
272	40
590	52
224	32
904	60
498	48
36	24
494	34
118	34
316	56
136	32
502	50
90	30
504	54
160	40
180	36
752	56
520	44
588	56
28	24
76	28
688	68
690	54
902	64
226	34
72	32
452	48
234	34
536	62
328	40
350	34
170	26
96	34
772	48
162	30
590	48
162	42
1314	66
292	32
150	34
118	22
836	72
192	34
862	64
636	60
378	44
894	66
320	52
74	32
596	48
596	60
298	44
118	26
442	54
232	40
382	46
138	30
106	26
84	24
204	48
74	26
96	28
284	36
138	20
904	60
646	44
406	46
172	32
1164	88
180	40
62	26
230	36
196	32
198	42
364	48
206	28
422	46
470	52
248	44
250	40
314	30
436	48
632	60
222	28
430	44
410	38
928	66
86	26
124	28
252	46
72	24
174	26
19	7
602	50
314	48
224	28
84	32
22	14
524	54
644	56
294	42
422	46
1178	56
506	54
362	42
402	48
244	36
304	36
644	52
180	40
70	26
1062	68
504	52
538	62
122	30
154	26
250	34
484	52
426	50
518	50
258	42
240	38
216	36
282	30
198	34
402	38
148	22
668	62
182	38
196	24
694	70
366	38
372	44
248	38
1270	66
238	40
118	18
1150	76
142	38
312	36
186	38
368	36
424	36
134	34
128	24
552	48
92	32
376	48
256	36
206	34
1064	64
450	50
116	20
22	22
384	30
188	36
364	48
114	34
92	28
348	36
320	48
374	54
138	30
172	36
508	48
178	26
130	30
472	54
102	26
406	46
634	56
510	46
324	36
378	50
618	46
252	36
4014	106
430	62
248	40
19	7
700	60
390	50
266	42
142	42
86	22
272	40
1476	74
94	26
280	48
718	62
116	28
396	38
306	46
38	26
228	40
672	48
566	46
226	30
212	46
1704	86
128	32
278	38
824	60
152	32
272	40
814	70
432	48
98	34
114	22
132	24
934	76
548	52
318	34
756	60
710	46
458	50
592	48
592	60
506	50
126	26
458	46
2342	92
124	36
206	34
254	42
396	40
266	34
246	38
46	18
19	7
114	30
1544	70
130	30
120	32
720	44
126	30
280	48
240	24
192	36
80	20
204	40
134	22
502	48
126	30
222	38
426	38
586	46
940	48
494	50
272	38
226	30
1330	82
228	24
374	42
110	26
1006	74
142	22
404	32
432	36
1016	72
552	48
204	24
156	44
132	36
204	36
184	32
328	40
54	26
88	40
348	44
476	60
328	28
582	46
444	48
494	58
266	46
986	76
782	56
298	34
34	14
182	26
1292	66
354	32
108	28
144	32
420	40
164	28
138	30
108	28
200	24
270	44
548	48
124	32
322	42
108	36
278	46
464	48
90	30
136	32
794	64
210	38
164	40
172	28
934	58
454	42
142	42
102	22
86	26
38	22
342	30
228	44
62	22
660	56
190	38
424	44
238	30
144	24
188	26
310	46
246	44
264	36
300	36
226	36
1954	94
848	60
430	54
244	28
162	30
622	48
200	34
556	52
242	26
96	28
152	40
220	32
390	38
168	36
312	40
174	40
1400	60
236	32
184	26
654	66
222	36
418	34
114	30
52	28
210	42
650	46
80	28
76	24
100	36
274	34
44	28
100	40
2422	99
390	34
880	52
656	44
336	42
82	34
568	54
514	44
38	30
88	28
62	18
466	40
490	50
606	50
206	38
488	64
1042	66
112	28
176	28
552	52
226	26
76	28
88	28
772	64
166	34
146	28
568	68
692	60
414	54
374	50
1160	80
84	24
156	32
218	36
452	52
146	30
130	30
330	42
340	44
140	24
548	50
704	60
406	46
1738	76
432	48
188	32
792	60
1416	68
50	22
1698	98
322	38
562	52
302	44
304	32
268	40
2446	90
448	48
178	26
84	16
150	30
384	44
208	44
680	58
92	28
118	34
136	32
306	48
322	50
1276	76
322	50
430	42
592	56
42	18
106	26
370	46
168	28
322	38
206	26
192	28
516	46
82	22
220	28
134	34
128	24
116	28
368	42
66	26
96	32
306	40
310	30
78	38
120	28
212	36
230	22
164	28
172	40
88	20
130	30
624	52
316	44
394	38
542	46
188	24
2576	76
238	30
28	24
504	48
136	24
106	30
1078	62
108	32
4952	112
530	58
212	40
190	26
62	26
98	26
424	52
354	34
82	38
318	38
266	30
436	48
262	42
2388	90
242	38
402	38
372	48
356	44
62	26
200	32
108	32
656	50
254	30
274	38
140	32
96	32
186	26
1370	70
1748	86
190	34
162	34
278	26
530	50
204	32
156	36
100	28
424	48
472	48
1290	62
72	28
186	30
344	44
360	48
564	60
174	38
456	46
196	32
1116	60
462	46
234	22
194	32
816	64
236	36
34	22
344	48
934	58
634	48
196	36
392	48
1632	84
226	40
398	46
170	34
24	24
340	44
176	32
408	46
1490	64
136	34
146	34
256	40
356	44
110	30
410	50
1308	78
442	48
1876	78
354	44
148	32
664	64
88	24
288	36
154	34
142	30
160	32
206	34
236	40
36	28
262	46
114	30
470	50
34	14
142	34
750	52
1496	78
30	14
236	32
542	50
120	24
226	38
182	26
88	20
450	52
264	32
120	28
100	34
562	62
274	26
2868	94
206	26
110	26
270	42
266	42
94	18
294	50
100	20
526	58
510	58
68	14
256	32
316	42
1010	66
66	22
354	46
1110	78
180	40
106	22
236	36
1044	66
894	50
92	20
240	36
30	14
308	52
536	40
116	24
74	22
468	32
400	44
306	48
212	40
196	36
112	24
166	30
628	56
696	58
560	48
864	64
146	38
372	52
96	28
116	40
376	40
224	48
582	50
62	22
130	26
1142	66
456	40
602	50
100	28
272	40
70	30
234	56
134	34
438	54
98	26
794	60
138	30
188	24
294	38
68	24
406	42
368	44
70	18
172	32
770	70
414	56
516	46
302	42
78	26
378	46
504	40
150	26
234	26
192	36
266	42
66	30
574	48
102	26
518	46
342	46
192	28
208	36
342	26
242	46
228	36
224	48
436	52
248	48
262	34
186	40
712	64
476	40
2834	100
588	56
386	50
900	52
306	38
118	30
642	48
314	42
294	50
138	30
222	36
182	30
88	24
118	38
236	32
22	14
388	40
142	30
162	34
654	62
786	62
212	28
334	56
152	32
220	40
300	48
352	44
706	44
586	62
226	34
366	40
19	7
234	28
184	28
122	26
360	40
182	38
238	38
482	48
484	48
244	32
148	40
584	44
296	38
120	44
536	50
300	28
350	50
462	52
258	34
830	60
72	20
98	22
1100	52
744	40
446	34
280	38
110	26
44	24
152	32
158	26
666	66
580	44
426	38
550	50
224	28
178	34
280	40
172	28
588	70
144	28
602	54
422	50
1150	70
370	38
300	36
1106	64
144	28
362	50
310	38
74	30
1250	64
112	28
144	28
1114	54
164	36
114	26
124	36
862	58
833	62
116	24
620	56
78	18
19	7
100	24
578	58
582	50
760	60
54	30
322	38
104	24
634	58
118	38
426	46
284	32
64	28
252	34
218	42
120	28
126	30
338	50
718	52
488	54
400	52
36	24
570	52
372	48
110	22
158	34
1314	82
156	24
542	52
140	28
214	26
478	46
218	42
430	38
172	36
1048	72
116	32
112	30
60	28
200	32
172	24
56	24
482	46
1284	82
242	46
92	28
164	24
432	52
230	32
60	20
156	36
498	46
612	56
208	44
510	52
58	28
94	26
370	36
334	38
332	38
206	42
10542	184
504	56
254	42
288	36
252	58
224	34
140	24
68	16
188	28
246	34
124	24
926	60
180	30
1032	70
198	42
300	40
262	30
342	38
150	26
940	44
162	30
288	42
254	46
334	46
288	52
156	28
322	42
334	30
19	7
498	38
242	38
516	50
120	28
196	44
124	32
2434	104
408	34
308	40
90	26
158	26
228	34
226	46
128	28
178	34
360	38
256	36
260	44
288	40
146	38
552	56
132	32
368	36
584	40
272	40
182	30
562	56
70	22
130	26
806	56
388	48
286	46
46	14
110	18
248	36
112	28
352	52
480	44
104	26
1176	64
208	36
19	7
682	54
90	26
92	30
510	40
410	44
570	46
224	52
270	38
918	62
676	42
160	32
246	40
518	50
202	38
340	56
1138	76
310	50
336	42
292	44
190	34
962	56
154	34
316	32
120	36
328	52
114	22
114	30
112	28
390	50
170	22
390	42
496	48
248	36
108	28
248	44
438	42
356	36
124	24
30	14
78	30
266	34
288	40
68	20
120	28
304	52
238	30
50	22
378	44
1040	50
290	34
280	40
148	32
60	20
174	42
250	34
56	16
306	34
1408	72
674	62
266	30
572	52
192	32
138	34
492	48
300	48
102	30
842	62
246	34
318	48
1494	70
216	32
152	28
796	60
166	34
124	24
1294	66
1270	76
110	26
496	48
1922	78
356	40
390	38
368	48
154	30
82	22
432	48
422	50
328	44
168	40
350	44
332	44
224	42
100	24
646	60
352	52
334	46
160	36
126	30
356	50
138	34
74	30
214	38
366	42
820	60
1010	66
368	44
172	40
258	46
1098	56
104	24
616	50
332	44
114	30
888	68
608	56
1004	60
730	66
126	34
340	30
238	30
19	7
410	44
342	34
398	30
120	32
864	70
42	26
706	58
1328	70
144	32
872	60
340	44
644	48
624	52
918	58
480	38
324	44
334	34
244	46
312	36
496	52
928	70
114	22
226	42
304	36
774	50
68	24
372	40
466	46
134	34
78	22
112	24
272	44
344	36
198	38
1762	94
118	38
414	46
104	36
298	42
58	26
220	32
484	44
484	40
424	36
102	22
130	22
98	30
292	40
142	34
226	34
454	54
174	38
746	46
282	38
700	62
346	46
19	7
458	50
954	78
900	56
376	40
522	44
2350	84
226	46
410	38
196	28
160	36
276	32
630	42
654	50
124	32
356	40
90	22
332	48
276	38
232	40
576	48
222	42
298	48
362	38
798	52
224	48
1520	80
224	44
146	30
332	46
124	24
178	38
198	30
568	58
298	34
60	16
238	38
3418	120
74	26
170	30
68	20
92	36
298	34
64	24
392	52
268	40
562	56
82	26
1060	76
552	48
250	34
330	34
236	36
30	22
86	30
330	38
278	54
194	18
492	52
910	62
236	36
574	48
476	56
482	46
480	56
314	42
244	48
162	34
1048	70
154	34
204	32
2658	114
556	60
104	28
172	36
590	54
272	36
74	26
386	50
498	42
258	46
134	38
1144	80
218	46
446	38
368	46
94	34
116	28
184	28
234	30
738	60
164	32
170	50
1188	62
92	24
480	52
126	26
714	62
246	26
166	34
158	26
588	64
206	30
330	36
2360	82
496	42
100	32
2304	96
46	22
622	60
236	44
1248	78
250	30
128	32
1344	60
114	26
246	42
560	52
536	56
228	44
330	46
154	26
274	46
541	52
166	38
1340	68
340	42
192	32
108	24
456	48
274	32
350	42
462	54
102	26
386	48
252	32
68	24
86	22
334	38
546	44
46	34
264	40
98	26
198	34
248	36
678	60
396	38
74	22
220	40
164	28
132	24
588	46
772	56
388	44
102	22
388	44
606	56
300	32
292	34
48	32
90	14
112	32
200	36
538	62
134	34
94	26
204	32
570	62
336	34
674	50
670	58
278	34
808	60
124	30
330	42
442	54
256	40
330	42
244	40
96	24
180	28
854	60
100	36
662	48
674	60
126	30
474	50
102	24
150	34
64	20
1104	58
48	24
134	22
254	42
60	28
458	56
374	50
286	38
90	30
172	36
68	28
374	40
658	66
244	32
572	58
76	24
146	32
46	18
392	44
114	26
144	36
716	60
232	32
680	66
418	42
416	48
604	44
220	28
74	30
398	46
78	22
222	36
92	28
488	52
306	38
500	48
160	24
236	44
164	40
304	40
96	30
146	30
292	52
240	40
60	16
80	20
402	50
208	48
84	32
330	42
778	62
72	28
412	56
404	48
708	52
314	42
216	36
444	48
600	46
362	46
432	44
140	40
54	22
256	40
84	28
946	50
302	32
116	28
470	50
62	30
194	32
396	48
500	60
400	46
342	38
366	46
528	52
296	40
162	34
606	56
378	44
138	38
136	32
160	36
908	64
76	32
788	68
192	40
454	42
342	50
520	36
234	40
524	58
190	30
74	30
234	34
1196	66
394	46
532	48
286	42
268	40
196	40
64	28
78	30
1154	70
541	38
304	44
160	32
924	42
46	22
340	44
882	58
902	62
354	54
118	26
298	50
274	34
386	46
132	38
686	58
886	58
706	58
98	26
19	7
182	38
458	54
396	48
32	24
328	40
122	34
150	30
536	48
740	58
72	20
204	36
194	40
950	66
416	36
112	32
610	62
140	52
2987	119
426	42
558	54
330	44
614	58
568	48
542	46
1378	78
19	7
682	62
260	48
274	30
240	40
398	42
670	48
398	42
162	26
136	36
60	20
686	58
160	24
172	36
88	32
180	26
50	22
46	30
116	24
306	36
212	40
602	58
636	68
136	34
496	44
1012	64
608	52
150	30
130	22
270	34
316	32
190	34
332	56
54	26
880	70
156	32
310	38
54	30
126	38
162	38
294	32
436	52
188	28
46	14
232	36
700	48
100	32
100	28
1002	62
416	44
234	28
62	22
496	50
758	54
88	20
192	30
396	48
148	34
1040	68
376	40
720	54
1172	78
386	42
106	22
236	40
414	42
182	30
914	68
142	38
122	26
350	46
842	52
344	44
558	52
392	56
186	30
628	60
110	22
148	28
396	40
84	24
108	28
142	30
272	32
340	48
136	32
454	50
822	68
58	26
138	26
386	58
368	40
348	44
200	36
1028	68
328	48
110	26
1760	88
48	20
246	26
678	66
340	42
396	56
40	24
564	60
1066	66
548	56
114	18
232	32
96	28
192	36
428	38
226	46
98	30
254	38
102	30
278	50
384	46
110	30
460	54
624	52
50	14
612	52
126	22
162	42
376	52
582	48
208	40
294	38
158	30
182	30
134	26
86	26
104	32
362	34
180	44
70	34
210	26
62	30
814	62
614	58
896	56
86	26
240	48
306	50
334	34
182	30
520	48
504	48
184	28
536	52
820	52
1518	80
512	48
1212	70
132	32
120	32
558	46
428	38
166	26
108	32
236	38
512	56
372	36
252	48
544	48
472	48
92	20
1102	80
98	38
648	44
344	44
284	44
36	28
1080	72
204	36
278	34
284	30
182	32
168	28
362	48
206	30
426	48
674	62
442	34
270	46
100	24
668	48
308	44
88	28
256	36
80	20
296	40
118	38
636	72
374	42
292	48
378	50
222	48
344	50
288	40
70	18
550	56
206	38
646	50
188	40
138	26
200	36
270	46
266	46
572	48
60	20
212	40
224	28
288	44
328	44
298	34
210	34
422	52
68	28
350	42
470	48
722	54
122	28
426	54
514	38
52	28
106	18
392	52
336	44
810	48
100	28
300	36
122	30
592	54
338	36
240	40
354	42
2904	98
578	44
130	26
388	42
82	26
164	44
334	36
1690	70
478	56
558	46
246	42
84	24
208	36
202	34
98	30
56	16
286	34
120	18
462	32
372	40
332	38
110	34
108	44
438	42
144	28
178	30
194	36
162	26
128	24
120	32
84	24
600	60
114	30
92	32
112	28
80	28
288	36
180	30
140	28
198	28
30	14
306	34
390	42
90	30
150	40
138	30
166	34
126	34
650	56
1118	70
454	42
278	36
414	50
574	46
324	38
482	44
356	36
74	26
256	40
3648	114
116	24
86	18
388	48
258	38
104	22
130	36
40	24
152	22
616	56
440	48
110	26
244	36
104	22
790	74
340	36
54	22
224	30
580	52
80	20
1220	64
854	62
240	32
142	26
272	46
246	30
164	32
116	32
188	32
42	14
88	22
278	42
632	56
226	34
320	32
2988	98
206	26
230	34
54	24
264	36
226	34
340	36
90	26
416	38
450	42
280	44
324	40
456	48
120	24
108	28
332	44
210	30
592	64
462	50
176	36
540	46
328	40
264	36
424	44
178	38
262	34
312	44
756	68
574	46
442	50
190	34
224	36
580	52
970	66
108	28
34	22
98	26
192	48
106	30
466	44
340	44
86	18
464	48
100	28
1274	74
356	36
200	32
102	22
112	32
222	30
200	32
266	38
150	38
484	56
1090	64
926	70
500	44
574	62
132	28
188	28
380	44
66	18
330	38
84	24
846	62
214	46
66	22
474	54
938	74
120	40
198	42
44	24
764	64
326	30
140	32
390	46
194	34
124	26
168	32
462	46
698	58
740	60
210	50
90	30
182	30
414	50
680	64
464	52
162	38
132	24
224	52
406	50
164	24
234	34
382	50
54	26
812	64
234	26
274	42
486	38
260	32
192	36
486	42
352	56
1284	68
666	58
136	36
196	40
86	30
128	32
94	30
258	38
652	52
178	30
284	48
52	24
416	48
352	38
466	42
60	24
312	36
424	36
472	40
386	30
772	60
158	34
1366	78
240	40
226	38
146	34
364	56
244	36
242	42
616	56
390	42
194	30
124	32
152	36
448	48
158	22
570	60
280	36
420	48
536	44
76	24
1778	78
378	46
106	30
1144	72
174	30
400	50
164	30
184	32
372	48
98	22
595	48
724	70
394	42
124	24
238	30
120	28
192	36
522	44
282	42
262	34
458	54
340	48
242	28
252	40
176	32
260	32
146	30
226	32
306	34
546	58
58	18
186	30
52	28
178	30
786	50
44	12
90	26
96	40
90	26
596	50
306	32
744	54
252	36
142	38
490	42
1218	68
3438	122
292	36
336	52
386	40
2178	70
418	54
324	42
104	28
286	38
84	12
106	26
534	50
534	48
264	40
656	56
1023	76
516	56
174	30
152	28
452	56
184	36
548	48
728	48
138	26
112	28
190	38
350	54
108	20
238	38
224	34
78	26
210	28
198	42
308	40
178	30
330	52
304	40
766	66
392	52
516	46
182	30
332	44
230	34
224	40
322	48
214	42
142	38
132	32
78	30
318	36
520	60
1094	82
298	38
710	58
374	30
430	54
256	44
62	30
176	32
1370	84
334	42
584	60
432	40
482	50
228	36
286	38
190	30
240	36
582	50
190	34
60	24
316	36
594	58
530	46
770	62
348	40
50	26
238	38
846	54
358	42
78	26
310	44
302	42
58	22
188	44
516	60
64	16
114	30
522	50
792	56
82	22
400	40
70	26
230	30
434	40
344	44
556	64
282	26
770	66
454	46
188	36
270	42
1168	70
176	44
110	30
236	36
184	30
300	46
750	60
84	32
90	26
564	44
558	46
94	26
140	32
288	44
416	40
144	24
140	28
76	24
184	32
396	40
648	72
130	26
272	48
68	14
90	22
246	26
66	20
244	44
644	56
428	52
278	50
60	20
224	32
424	44
1066	56
694	62
26	14
60	20
3055	111
450	54
1354	82
258	42
66	22
156	28
194	46
194	38
224	40
770	78
26	22
774	62
48	24
764	54
620	60
338	46
616	54
118	34
252	36
352	42
124	32
1912	72
652	48
94	30
230	30
298	42
200	32
236	34
58	34
528	52
274	38
1110	70
142	38
132	36
40	24
120	28
130	24
494	46
174	28
130	26
94	30
568	52
102	30
270	38
266	40
454	42
512	52
512	50
115	26
276	50
310	34
102	38
212	36
580	44
38	30
234	34
298	40
310	38
206	46
154	30
152	32
444	40
312	28
260	40
380	40
54	14
452	52
574	38
428	48
780	66
232	36
102	26
140	24
108	24
352	42
2774	106
202	30
640	52
646	52
64	22
1696	74
150	26
192	32
392	40
338	42
650	58
248	40
210	40
158	34
388	40
188	32
424	44
936	64
888	52
56	16
380	44
518	50
286	38
194	26
432	52
74	22
100	36
416	42
260	42
106	26
350	26
98	18
224	44
316	48
48	16
96	24
704	56
112	28
258	50
150	38
320	44
384	56
598	54
250	42
504	56
50	26
244	36
202	34
344	40
364	48
184	32
180	32
522	46
590	54
510	58
670	52
568	52
360	40
580	50
360	40
1126	70
186	30
32	24
462	52
232	30
430	54
204	32
1332	70
954	54
996	64
144	26
178	26
336	44
732	56
106	34
124	20
19	7
348	48
358	46
72	20
328	52
308	36
268	44
102	26
1504	78
510	40
166	26
298	50
190	30
54	18
350	36
324	38
154	26
128	28
58	28
460	52
1712	66
424	36
198	36
296	36
196	36
156	28
290	38
176	36
458	48
404	48
464	44
156	32
246	34
498	38
218	30
110	30
648	56
64	40
1004	64
38	14
382	58
142	34
146	30
360	44
288	56
702	54
510	56
120	32
1162	74
144	32
404	52
300	32
88	20
622	54
232	36
277	38
144	40
188	36
362	34
430	52
356	44
158	20
190	26
318	40
558	48
342	46
188	32
732	66
1326	78
124	38
192	28
38	26
620	56
84	24
1024	70
188	40
386	46
336	44
110	22
360	44
238	34
616	50
1226	64
388	40
58	22
246	34
156	28
208	32
162	22
1006	58
690	56
816	60
106	18
300	36
112	24
126	34
282	28
708	64
622	48
72	24
240	44
428	48
220	40
182	34
570	60
678	64
246	30
244	36
50	18
74	26
696	56
670	50
108	24
370	42
250	34
304	48
1034	76
358	42
604	42
272	40
352	50
1546	80
56	16
64	20
108	24
436	46
326	46
519	44
416	40
426	50
664	48
686	58
110	22
636	56
124	32
180	26
240	40
78	18
76	24
86	30
276	36
206	38
222	38
320	48
244	36
844	64
124	20
1662	86
256	46
116	32
150	38
172	32
500	56
662	50
836	74
148	36
300	30
496	56
208	44
846	62
600	54
116	24
184	24
1792	96
1116	56
94	30
188	44
318	50
336	44
318	46
484	48
578	54
598	56
586	56
2122	88
722	62
158	34
86	22
774	60
56	24
104	24
98	34
204	28
166	30
256	44
938	62
176	40
262	42
314	30
234	30
96	28
1528	82
190	26
374	42
50	14
718	50
362	42
76	32
340	32
90	24
450	42
214	50
226	38
474	54
444	54
148	36
154	50
314	42
240	34
336	44
1328	80
262	38
308	32
272	44
594	48
170	34
490	56
458	42
656	62
282	38
286	54
370	46
900	64
258	30
214	34
640	56
418	48
972	74
616	60
1691	73
146	38
402	44
230	34
682	50
400	48
306	38
122	40
506	48
392	48
124	32
660	56
522	50
586	54
514	42
72	24
186	26
244	44
154	38
532	40
266	38
608	52
19	7
74	26
846	58
274	34
390	40
172	32
1468	64
392	38
212	20
184	32
126	34
306	54
258	42
168	28
120	24
86	38
282	44
464	44
398	46
252	32
734	58
234	46
244	44
50	18
716	64
512	56
254	36
140	24
320	40
260	36
88	28
248	36
246	30
168	32
148	36
324	38
532	48
218	34
42	14
340	34
256	44
490	54
738	56
42	22
140	28
228	24
526	54
410	42
1392	74
176	40
204	30
386	44
152	28
230	38
352	40
678	50
168	28
746	62
2551	111
170	30
254	34
2618	98
524	56
266	40
620	42
194	34
228	36
368	52
170	30
172	40
1704	82
160	28
384	28
246	50
240	36
144	32
230	26
164	24
510	50
92	32
46	18
110	26
166	34
76	16
734	52
624	52
342	42
138	30
128	32
270	38
86	26
384	48
372	44
522	48
3576	114
350	38
216	42
1098	68
854	66
126	34
696	60
968	64
316	44
204	30
86	30
92	32
424	56
532	52
150	34
190	30
918	58
674	62
214	40
288	44
156	28
650	54
128	28
258	34
124	20
104	32
188	36
162	42
154	34
420	52
292	32
494	46
38	30
190	38
862	48
134	22
196	24
218	42
418	46
530	50
322	34
154	38
530	42
94	28
266	38
166	30
46	26
1254	64
116	32
198	42
480	56
418	42
414	52
136	32
454	46
326	38
1432	70
410	42
160	32
1588	88
108	24
134	34
172	26
290	42
604	52
462	48
226	34
364	44
174	30
330	38
130	26
162	38
160	36
322	42
574	44
462	46
226	34
138	34
96	20
664	60
118	30
188	32
974	76
230	28
732	56
100	32
264	44
294	34
170	30
612	44
104	24
256	36
342	46
214	42
182	26
580	52
270	38
578	50
877	61
246	46
126	22
472	44
296	36
288	30
78	30
186	30
354	38
330	42
330	42
472	48
1090	72
348	40
900	62
1180	72
232	36
300	40
190	34
420	54
130	18
416	44
70	26
192	32
782	66
104	28
90	22
168	38
402	46
640	52
56	24
554	42
224	34
216	32
112	20
522	54
192	30
124	36
270	48
340	52
144	36
290	38
825	53
112	28
232	44
648	52
448	52
302	34
350	50
452	56
150	34
352	44
378	64
88	32
176	40
19	7
138	26
192	32
388	44
230	38
76	16
517	48
400	38
70	26
168	44
512	52
316	44
488	44
358	34
278	44
114	34
412	48
396	44
420	50
176	44
260	44
96	28
234	34
72	32
82	22
134	34
358	44
694	58
114	30
708	54
334	46
624	64
130	30
234	32
280	36
124	40
390	54
282	38
348	44
464	58
242	38
86	30
494	50
148	24
104	16
160	34
270	38
68	16
574	54
772	68
604	44
226	44
5297	126
416	42
312	52
250	38
72	24
220	36
138	26
70	34
442	42
508	52
1250	58
412	44
112	28
1133	77
380	44
468	56
294	42
244	32
282	34
836	72
120	28
108	22
154	26
292	48
558	50
402	50
208	40
368	40
184	36
240	40
366	42
158	34
328	40
116	24
258	42
262	38
1419	86
344	44
208	32
478	42
302	54
266	38
600	52
94	30
92	24
298	46
342	50
63	15
252	36
80	24
296	36
268	40
552	50
376	36
144	28
998	76
136	28
138	26
774	62
1254	70
448	44
292	36
616	52
642	54
816	48
514	48
768	56
152	40
318	42
820	42
256	36
384	42
274	38
378	46
624	44
546	54
390	46
314	32
230	34
52	28
74	42
86	22
212	28
502	54
460	36
348	40
168	36
450	46
164	32
334	38
340	42
400	34
86	30
766	42
94	26
158	22
580	52
368	40
68	28
378	52
314	38
820	56
58	34
352	28
532	40
90	22
498	52
310	50
138	42
430	50
244	40
462	34
722	50
260	40
204	40
120	32
68	16
982	72
142	38
892	58
342	42
188	26
94	18
241	34
19	7
146	34
38	14
360	44
468	38
118	28
206	42
162	34
338	50
454	54
470	46
1304	80
176	28
570	66
308	40
282	44
498	46
164	24
626	46
276	36
362	46
610	50
950	74
108	32
300	44
218	26
1632	80
258	34
230	36
176	28
578	56
236	36
638	46
338	42
288	46
162	38
348	46
414	42
236	40
132	32
462	44
288	40
150	34
552	46
314	38
240	44
314	34
432	44
298	36
118	22
202	38
50	18
874	50
206	38
256	32
2842	110
136	44
200	38
730	46
86	38
318	46
540	50
162	30
330	42
222	38
38	18
444	52
276	44
178	32
248	36
146	26
42	22
206	30
294	34
168	30
260	36
154	34
202	46
166	30
602	54
188	36
256	36
170	34
164	28
386	50
254	22
510	48
662	50
162	30
394	46
114	26
266	42
96	20
566	54
584	52
546	66
1052	70
746	58
120	28
156	32
228	40
644	54
102	18
548	48
142	34
358	50
1622	96
386	46
210	34
314	34
460	44
300	26
404	44
86	26
420	40
198	42
112	28
746	42
90	38
192	36
180	32
204	32
378	34
204	32
176	44
190	34
124	40
160	24
690	54
998	54
104	38
272	40
172	40
472	54
54	18
358	54
76	18
442	50
838	50
306	38
320	48
102	22
444	50
142	30
82	26
1222	66
976	52
82	36
396	40
654	46
1044	62
19	7
554	48
305	32
290	38
110	18
510	46
500	46
448	56
874	58
308	50
212	36
376	42
160	32
530	58
1628	92
240	36
78	18
78	26
138	30
86	26
312	46
294	40
404	48
94	18
578	46
142	22
406	42
262	38
1416	80
752	58
186	46
1112	64
172	38
1316	70
288	46
424	42
350	38
156	36
346	42
656	42
178	26
152	20
224	52
914	60
100	28
3286	104
298	38
120	36
282	30
434	42
148	36
424	44
70	18
98	22
1398	88
312	32
774	58
72	32
134	22
156	28
506	46
30	14
154	26
688	54
68	28
310	42
106	30
408	44
270	46
560	48
1054	74
262	42
40	16
4532	106
142	34
78	26
256	30
44	28
120	32
290	54
270	42
212	30
300	44
196	40
1272	80
128	38
310	34
418	50
442	42
230	32
190	38
660	58
168	28
234	30
298	38
334	38
312	52
358	42
32	24
184	32
140	24
508	40
806	62
118	18
554	54
896	60
336	44
268	40
118	26
92	32
282	42
220	40
148	32
92	20
312	44
360	48
2376	104
180	28
206	42
652	52
462	50
642	48
60	14
80	20
172	40
222	34
144	44
36	12
296	40
276	44
112	36
214	34
392	48
448	44
418	42
382	50
138	20
46	28
122	30
338	46
196	40
308	34
108	28
214	42
886	60
128	24
236	40
160	24
112	28
232	32
208	32
418	52
3118	108
54	26
1750	78
4520	138
190	38
226	50
46	14
3858	110
298	30
1554	62
124	36
78	18
264	38
202	34
220	40
304	40
156	36
792	60
566	54
288	36
24	24
310	46
360	30
500	44
204	32
530	54
244	28
884	68
1284	66
184	36
874	74
310	42
550	60
90	14
964	70
154	38
19	7
178	34
766	58
432	40
362	34
206	26
356	42
19	7
902	54
710	44
304	40
694	54
222	38
86	18
192	48
22	22
436	44
186	30
356	48
212	40
126	30
544	46
340	38
94	30
82	26
312	34
258	42
108	34
180	40
986	64
164	32
450	46
418	46
206	30
468	50
210	38
500	48
550	42
396	36
124	28
388	44
776	52
244	40
414	46
686	54
640	42
194	26
170	34
154	30
334	42
64	28
176	32
132	36
180	28
82	18
202	38
200	24
216	36
412	52
216	36
618	60
458	46
322	42
618	48
218	34
578	60
260	48
252	40
804	50
1344	78
268	30
206	42
342	38
102	26
86	26
424	52
498	50
248	32
368	48
172	36
322	38
106	30
392	48
338	46
280	38
230	34
732	54
246	34
32	24
660	48
280	36
78	26
188	44
508	52
50	26
438	48
46	14
586	46
822	62
698	62
264	32
1004	72
368	44
168	32
116	20
50	34
672	56
118	26
648	60
206	34
114	30
258	26
52	32
1816	70
236	54
54	22
320	36
854	58
236	32
312	36
624	64
260	36
182	34
564	52
136	32
186	38
1164	72
282	34
230	38
776	50
88	32
94	34
336	52
308	44
670	46
420	40
340	48
168	40
238	42
688	52
116	24
516	56
70	26
2264	94
136	32
238	46
470	52
318	54
80	16
612	46
82	22
812	54
342	44
116	26
116	32
96	28
636	46
120	28
312	36
382	46
512	56
134	26
156	28
134	30
380	64
432	42
286	46
224	32
234	34
292	42
204	36
288	40
154	38
86	22
2318	86
194	38
56	32
170	26
260	36
518	42
682	58
1004	68
604	60
736	52
330	38
864	46
502	46
256	32
106	22
422	46
334	42
84	24
1392	74
198	34
1304	62
296	44
298	42
568	48
58	26
88	28
278	42
298	46
366	46
664	48
272	36
74	26
158	30
950	68
74	22
528	40
254	34
122	34
1702	96
274	36
432	56
146	34
192	32
214	30
330	46
298	46
812	66
318	46
104	36
64	28
486	46
246	34
90	26
234	38
994	62
220	40
384	44
120	32
374	42
786	58
320	44
202	26
1658	80
92	20
204	32
158	38
990	56
96	28
246	38
276	36
126	38
154	30
182	26
76	16
1742	80
996	68
256	44
278	30
276	46
204	36
304	44
434	42
82	22
796	52
658	54
468	52
90	30
254	36
304	48
584	52
1028	64
940	70
218	26
220	36
102	30
582	60
242	36
76	32
516	44
740	54
738	54
96	32
316	40
374	44
670	62
626	56
220	40
266	42
106	18
226	42
530	54
1140	72
646	58
250	38
80	20
240	36
362	34
272	40
74	22
40	24
494	46
218	38
652	48
516	56
1208	76
162	26
694	54
480	46
224	44
118	30
384	46
540	48
54	22
168	32
102	34
950	66
336	40
802	74
130	26
834	58
306	34
480	46
882	56
370	42
116	36
226	44
368	52
400	56
206	30
320	30
390	62
118	20
288	38
86	34
688	46
496	44
210	42
666	38
32	24
150	30
244	36
842	56
202	38
440	44
786	70
70	30
832	70
182	38
420	48
248	40
358	42
222	30
110	26
794	58
54	14
350	38
22	10
96	24
192	40
1288	76
224	40
290	42
228	50
502	54
382	66
192	44
234	38
198	38
156	32
256	48
316	52
296	36
94	14
170	42
148	28
522	52
200	28
1782	72
462	50
88	16
132	24
736	64
392	48
176	36
324	36
406	46
594	60
84	22
252	34
610	54
466	42
324	54
1246	78
98	30
176	34
74	22
110	26
102	26
172	28
314	38
240	36
1106	72
134	30
498	50
530	54
350	44
1466	76
252	44
168	32
602	52
206	34
402	58
170	22
220	30
188	32
1704	76
322	40
538	58
578	54
638	58
436	54
19	7
530	42
86	30
382	54
176	40
168	36
338	46
452	52
498	54
914	76
246	34
964	76
224	36
318	48
70	30
220	32
130	18
310	54
794	50
102	22
102	34
136	36
1060	52
398	42
296	32
98	22
932	48
44	28
676	62
822	60
68	28
36	12
336	42
322	46
854	46
160	24
248	32
262	34
380	48
224	48
320	40
438	62
135	18
1171	66
448	42
468	44
460	44
578	50
282	34
90	26
800	60
342	42
146	34
176	36
226	26
28	28
596	52
110	26
410	42
528	54
226	38
680	56
98	28
522	54
252	44
470	38
172	44
524	48
92	28
174	34
462	42
288	32
120	32
492	44
564	40
908	48
554	52
414	46
474	38
202	30
58	30
568	60
358	46
288	54
224	40
460	42
43	11
384	44
706	62
284	40
60	24
940	64
598	46
1008	72
392	46
646	42
284	36
388	40
406	50
276	48
798	62
104	24
232	36
188	42
320	44
234	34
692	54
178	38
146	50
412	44
4899	127
600	50
428	48
134	20
366	38
76	28
150	30
234	42
516	44
510	56
86	18
2872	86
190	26
62	22
430	48
190	34
40	28
638	62
152	36
78	26
910	62
264	36
100	24
60	20
106	30
256	36
90	30
240	40
124	20
458	46
476	46
312	40
292	40
112	28
1712	72
316	48
547	52
180	28
562	34
366	34
540	64
244	30
66	30
448	42
304	42
1034	66
704	64
124	32
128	32
508	44
370	46
182	30
150	30
794	62
704	60
328	48
102	22
392	46
190	34
194	34
254	34
448	40
170	38
222	34
322	42
368	48
220	32
480	52
334	44
134	30
104	28
852	74
192	40
518	56
422	38
386	46
202	30
346	42
76	16
788	62
1174	74
378	42
148	24
246	38
234	38
114	18
268	32
70	36
806	54
262	48
52	28
262	42
166	30
190	34
384	48
334	42
182	30
370	54
216	40
534	42
536	60
232	42
132	32
392	44
76	28
112	20
174	26
362	46
642	46
52	24
206	34
820	64
198	34
76	36
154	30
552	50
100	24
578	56
248	40
1232	62
166	38
552	46
566	46
324	36
658	38
608	52
242	38
198	42
206	42
166	30
634	46
422	54
288	40
364	34
584	42
128	40
56	20
116	34
598	48
130	30
76	16
94	26
490	56
502	50
280	52
192	26
42	14
90	30
618	46
1128	64
182	30
236	36
438	46
264	32
562	62
764	52
128	28
102	30
54	26
176	38
56	32
108	28
334	38
222	22
242	42
776	52
951	68
118	30
3162	110
422	50
112	24
100	36
978	64
262	46
588	44
616	46
198	26
498	50
200	36
948	64
248	30
120	32
250	46
402	26
458	42
158	30
92	36
482	38
266	26
66	26
460	48
468	48
214	38
308	40
900	52
774	54
474	42
632	52
992	60
862	56
108	24
454	42
80	20
562	54
122	32
214	42
414	42
560	52
152	32
108	20
300	32
396	52
364	36
698	50
74	22
736	56
1482	86
310	34
720	62
408	36
678	46
490	62
720	60
340	44
252	32
926	68
106	26
212	32
806	62
902	64
224	40
606	46
306	26
108	32
520	48
282	34
656	60
348	32
126	42
296	40
498	50
384	40
328	44
52	24
138	26
228	44
708	60
242	48
332	44
332	44
490	46
470	54
58	22
232	48
140	32
730	58
278	54
132	28
374	44
638	48
184	28
1172	74
298	42
250	34
360	36
74	22
1586	80
556	34
296	36
778	50
190	34
412	40
188	28
68	22
276	36
296	36
672	58
154	30
450	46
320	40
290	30
578	52
1182	62
124	24
356	44
356	32
176	32
568	46
108	32
148	32
174	34
714	54
1354	82
102	26
124	32
76	24
160	28
304	40
522	52
30	22
54	30
454	50
348	40
364	34
376	48
420	52
160	28
308	44
176	30
280	28
312	36
750	54
180	26
404	44
266	50
394	42
810	50
320	40
448	48
644	52
424	40
72	36
184	34
268	40
818	58
322	40
148	26
886	60
2312	84
456	44
300	32
148	28
96	28
232	36
140	40
426	42
470	46
658	50
700	56
432	42
78	28
482	42
172	32
1056	72
474	34
66	26
444	56
102	18
352	36
152	28
60	32
164	32
2070	104
378	42
218	34
384	40
1302	82
278	34
306	40
164	28
252	36
19	7
544	50
68	24
134	34
114	26
264	44
148	48
368	48
90	30
100	24
108	32
494	56
180	28
94	26
1030	76
158	30
200	32
142	38
350	50
388	40
185	26
118	26
750	54
342	42
782	56
206	34
976	58
118	30
74	34
1380	72
346	34
204	36
268	32
32	16
224	44
84	28
188	36
282	46
252	44
36	24
142	30
68	28
208	38
352	44
1508	76
54	14
490	46
78	26
102	22
40	14
218	38
1268	78
632	54
98	30
622	66
376	40
798	46
116	28
716	76
314	42
800	48
2381	104
276	48
262	26
134	26
108	24
188	40
738	66
238	30
156	28
80	28
244	28
216	38
3116	100
84	24
544	56
168	24
482	46
620	54
142	26
240	32
126	34
258	30
148	48
324	46
246	38
308	36
43	11
120	24
288	48
3130	108
260	44
380	36
396	40
24	16
1350	78
556	52
1268	74
432	56
366	46
278	42
128	28
364	42
428	52
358	42
648	50
452	52
534	62
760	64
166	38
148	32
864	68
114	22
270	34
532	48
392	48
352	60
134	42
36	28
84	28
1261	80
358	34
348	40
58	22
174	38
42	14
266	38
780	50
150	30
412	44
518	46
312	36
1448	80
188	40
658	64
246	42
252	48
178	38
1248	66
430	42
140	32
78	18
656	58
286	38
72	28
278	50
186	38
84	24
962	58
180	36
262	38
212	32
380	44
804	46
200	32
722	54
150	26
98	26
118	34
578	54
86	22
686	46
816	66
1434	86
150	34
502	52
892	56
228	32
190	38
2198	74
108	32
144	36
360	40
476	40
308	44
538	54
332	36
392	40
88	26
242	34
48	12
510	46
214	38
352	38
144	28
96	32
198	30
104	32
194	46
254	40
148	36
182	38
982	74
274	38
154	26
120	20
616	56
264	40
540	36
180	48
376	40
190	34
192	36
216	28
162	30
1734	74
418	46
278	46
106	26
1346	64
190	30
152	20
352	40
108	26
242	42
626	50
184	42
614	48
900	60
334	50
686	52
50	26
112	20
374	34
166	34
360	44
152	30
278	34
390	50
56	24
106	18
76	36
2000	86
99	19
528	56
204	36
372	44
386	50
402	42
398	50
64	28
1186	74
208	36
580	52
772	60
320	32
376	40
180	32
716	60
62	30
220	40
224	36
76	28
458	48
264	32
352	48
144	24
102	26
254	30
166	30
150	34
228	22
452	48
646	66
392	56
190	42
84	24
468	50
592	44
290	42
508	60
618	42
338	38
96	28
302	46
496	40
32	28
630	52
1046	62
274	38
182	38
200	36
1162	58
980	60
600	46
120	32
674	56
272	28
486	48
80	32
144	32
2848	106
318	38
705	54
174	26
380	34
314	36
98	32
440	48
392	50
84	24
56	20
178	34
138	34
342	30
162	34
796	66
358	46
498	50
756	62
234	42
274	46
38	14
212	40
158	30
108	36
590	54
270	34
106	26
132	28
306	38
246	38
222	30
102	34
102	28
160	36
450	34
238	34
448	44
242	30
488	40
910	64
188	36
1576	78
532	44
160	24
888	52
100	32
1100	70
122	26
110	26
398	60
142	34
234	38
216	32
294	26
118	34
132	32
422	48
204	36
252	40
320	44
652	52
88	28
970	52
116	28
392	48
802	58
122	20
496	52
168	28
394	42
354	38
239	34
112	32
1206	78
606	52
244	44
478	38
180	36
520	58
186	30
692	60
182	34
418	46
326	46
752	64
256	36
214	22
352	46
2178	94
800	64
154	30
72	20
34	26
506	58
382	42
232	32
304	52
402	42
636	60
500	48
272	52
228	44
190	34
376	48
696	60
436	40
300	32
690	54
480	56
666	66
72	26
684	54
452	44
474	46
330	38
476	52
188	32
174	26
638	50
436	48
778	62
96	28
134	34
696	62
54	30
198	38
1326	70
102	30
110	26
370	48
102	26
358	48
634	52
978	72
110	26
226	34
444	42
120	28
226	38
64	24
116	32
484	52
700	68
1122	64
726	68
356	42
438	46
634	62
66	22
266	46
282	28
538	54
178	32
330	34
404	44
296	48
50	18
786	74
1036	54
514	38
346	36
124	24
686	58
166	38
380	40
334	58
1582	78
134	38
278	30
240	28
144	30
312	40
112	28
214	38
488	52
278	48
184	40
324	40
118	26
212	32
174	30
264	40
430	42
402	42
184	32
242	42
504	50
372	46
680	40
248	40
162	28
636	48
112	28
190	26
530	60
236	28
80	20
282	34
630	50
402	38
174	34
266	26
160	26
362	46
206	32
650	38
42	30
200	32
286	38
634	54
188	32
154	30
230	42
242	38
22	22
276	32
178	34
58	26
132	28
216	40
162	38
308	44
60	28
292	44
890	56
442	52
608	56
142	30
332	56
478	42
184	36
402	52
232	32
564	52
90	30
230	30
190	50
58	34
36	28
144	28
168	40
136	36
54	22
220	40
148	36
400	44
238	42
144	30
144	22
324	36
160	32
108	20
544	50
48	24
98	26
218	26
516	40
72	28
106	18
19	7
1512	68
244	40
362	38
350	42
170	38
150	34
1468	80
672	64
216	40
1050	62
128	24
182	34
188	20
178	30
468	56
72	24
174	30
260	44
262	42
390	46
120	36
224	28
668	58
220	32
716	64
234	34
254	38
112	28
198	38
88	24
318	34
206	42
94	30
110	26
748	56
206	34
978	58
514	50
216	36
544	52
472	44
180	32
298	36
58	18
82	30
368	32
2740	102
146	26
912	58
286	42
386	44
152	32
812	48
410	56
804	68
178	26
326	46
726	48
912	58
126	26
336	40
190	42
172	32
118	26
52	36
310	38
190	30
278	34
574	42
128	28
300	32
442	42
122	30
46	22
406	34
1500	72
534	50
68	24
500	54
662	50
140	44
19	7
402	42
26	26
418	50
460	48
492	48
52	28
578	58
272	48
1107	70
274	54
3292	96
842	66
1398	74
974	64
410	50
19	7
328	52
56	32
62	26
1632	94
244	40
766	44
920	84
90	22
342	48
302	50
744	60
90	26
184	32
598	58
204	40
110	26
128	36
990	62
208	28
48	28
19	7
402	40
308	40
160	28
1206	60
196	32
156	20
192	28
154	30
188	40
34	14
136	36
1070	58
138	42
202	46
138	22
274	40
2320	62
474	50
686	58
240	32
196	36
432	44
950	68
138	34
226	30
228	32
942	62
180	36
250	34
662	50
168	38
446	50
96	28
714	62
378	46
364	40
54	26
454	48
298	34
476	48
218	42
320	40
72	32
304	48
134	26
666	58
348	32
738	58
470	50
334	44
936	64
346	50
400	48
262	42
720	56
124	24
68	24
440	52
1030	74
88	24
79	15
486	52
66	26
204	32
126	34
442	50
338	50
136	28
168	40
400	46
104	32
174	34
148	28
214	38
296	40
1036	72
626	46
650	50
110	26
252	38
198	38
124	32
378	46
530	46
108	36
262	46
1156	56
180	32
164	32
214	38
84	20
68	28
190	34
1602	78
1162	70
380	40
190	34
102	26
138	22
790	60
154	34
292	40
448	48
162	32
832	64
128	32
320	48
120	18
142	34
258	34
402	34
902	58
120	32
50	18
438	42
362	36
288	48
386	42
170	26
326	42
80	36
880	62
126	22
920	60
360	32
190	34
570	60
1046	74
178	32
246	36
886	74
232	36
220	36
156	30
466	50
310	46
1400	70
1074	70
326	42
354	26
323	39
330	38
100	28
836	60
442	38
326	36
36	20
158	34
412	36
338	42
204	28
338	46
946	54
156	24
410	44
118	30
496	48
304	38
170	26
356	38
1228	72
164	28
170	38
252	40
130	38
74	22
290	42
234	30
150	34
554	62
282	34
786	66
90	38
356	42
12796	180
104	28
382	38
148	32
84	24
184	28
148	28
572	48
278	34
88	24
998	74
346	30
19	7
78	18
414	48
134	38
146	26
526	46
606	58
348	44
158	38
108	28
244	32
306	38
456	44
246	30
374	46
188	40
732	60
578	46
972	62
94	30
1462	86
272	30
432	44
324	40
178	30
340	46
132	32
322	34
440	52
750	56
130	22
202	42
256	32
376	48
502	46
306	34
72	24
344	40
168	30
302	38
258	38
398	42
156	30
370	30
114	34
414	50
326	42
252	40
238	30
280	40
432	48
210	30
120	20
64	24
1016	66
212	48
90	38
154	26
644	62
220	36
424	50
184	30
808	58
316	36
794	62
362	34
188	32
92	24
646	42
76	24
122	30
54	26
518	54
64	24
248	48
408	44
692	54
426	42
270	50
138	26
180	32
54	14
272	40
438	50
434	48
392	32
538	46
436	40
138	40
448	46
4166	128
238	34
124	32
608	46
30	22
422	44
1252	68
316	44
368	44
582	56
658	46
158	34
852	76
100	20
36	20
1940	76
284	36
1388	68
244	40
126	18
474	46
48	20
190	26
198	46
784	64
128	36
44	28
408	48
322	34
348	44
454	42
186	34
344	52
594	62
866	48
480	66
418	50
150	36
86	26
892	60
348	44
260	42
994	66
826	70
488	52
312	40
118	26
580	50
226	34
280	44
572	60
262	46
140	28
104	36
252	40
242	46
76	16
108	24
328	44
192	36
694	42
140	28
190	30
418	34
530	42
1942	84
784	62
248	40
142	38
92	36
256	48
538	60
86	30
30	30
432	52
358	42
98	22
248	36
158	34
1146	54
170	34
282	34
516	56
584	50
1102	60
314	46
662	62
238	26
356	36
250	42
110	30
476	44
160	32
224	32
954	64
218	42
1436	60
130	26
306	38
592	58
742	50
944	72
338	42
208	48
68	34
368	40
1260	70
940	62
112	44
218	26
282	38
326	42
158	30
460	36
112	24
250	26
246	38
194	36
1222	70
90	18
158	30
468	44
426	42
216	32
412	52
350	46
166	38
832	64
84	16
354	46
372	38
334	38
328	40
452	60
258	38
158	34
106	30
504	48
366	32
206	34
262	50
352	40
708	60
638	56
60	32
338	42
362	40
744	58
78	30
94	26
216	32
1814	78
106	34
382	54
194	26
136	40
266	38
1172	88
52	28
232	28
256	32
968	62
1434	76
602	54
144	32
338	46
246	42
154	34
684	54
550	52
460	48
322	34
232	40
596	64
160	32
152	38
362	38
370	38
122	18
582	42
738	50
556	54
140	32
604	50
314	34
88	20
112	28
398	42
378	50
546	50
174	34
264	40
128	40
162	30
340	36
834	62
228	28
1294	82
1436	80
500	50
362	46
148	32
1000	70
286	38
568	56
176	30
122	30
1166	72
200	24
218	34
810	50
220	44
810	62
516	48
102	34
92	16
388	36
46	18
248	32
286	28
168	32
1428	68
442	42
376	36
66	22
648	46
242	42
836	44
246	38
382	62
204	44
64	32
128	28
302	42
840	66
210	46
202	30
1100	70
238	38
452	44
216	36
386	54
100	24
362	38
100	24
350	46
38	30
214	38
26	22
52	16
158	42
94	22
158	30
222	38
924	64
678	66
508	52
26	26
334	42
408	44
322	38
200	36
58	18
342	42
886	58
1840	80
1176	66
258	52
904	64
126	30
238	30
146	30
114	38
68	24
604	52
78	30
618	62
62	26
1104	52
484	44
258	34
364	44
382	46
122	36
652	60
404	36
582	60
206	42
668	60
78	26
19	7
212	36
19	7
106	26
670	56
404	44
548	48
428	44
298	42
428	56
1360	72
410	42
912	48
186	38
418	38
288	38
198	30
102	16
88	30
86	26
1447	86
136	32
798	64
100	36
228	50
84	24
518	46
186	34
1362	82
174	34
274	34
150	38
240	36
220	32
1624	60
372	46
314	46
358	54
66	22
106	26
280	52
94	22
504	36
270	38
58	30
114	30
134	34
602	54
660	50
388	48
272	40
206	22
296	36
608	56
272	48
882	70
192	38
378	30
360	44
376	48
438	50
546	62
384	44
648	50
580	60
130	38
50	22
262	38
106	30
718	62
336	40
824	54
304	44
782	42
122	42
94	30
224	46
698	62
506	50
238	34
662	70
332	52
156	34
356	38
188	40
70	26
82	22
238	38
235	31
1566	78
1480	66
230	34
1208	70
506	46
82	26
138	30
126	24
28	12
188	36
244	36
478	34
366	50
108	28
220	44
92	36
178	30
448	44
204	32
460	40
250	34
222	46
214	32
458	44
1094	58
198	26
636	44
1228	58
240	32
238	26
146	22
146	30
574	48
646	62
488	44
378	46
184	28
192	36
2784	98
72	20
1140	70
152	32
68	28
106	26
414	38
760	56
330	30
184	44
184	24
50	26
220	34
114	30
172	32
138	26
144	30
298	30
382	46
488	48
98	30
478	46
118	24
166	26
418	42
204	40
48	24
494	40
120	36
214	42
416	52
114	26
258	42
160	32
426	52
156	26
260	40
178	38
682	62
126	28
498	54
492	52
894	54
820	52
120	36
1616	68
506	46
396	42
142	30
408	40
326	40
320	44
713	66
204	28
978	74
308	48
152	28
264	34
192	24
168	36
242	34
412	44
658	58
636	58
106	22
206	30
464	62
316	40
64	24
86	26
334	42
214	30
594	46
348	36
86	22
924	70
108	24
218	42
230	34
728	60
158	22
270	48
124	36
742	64
928	80
2582	86
626	58
410	40
280	48
394	32
232	32
92	24
258	34
120	32
1000	68
222	42
134	38
284	40
564	46
40	22
294	38
124	28
290	30
374	46
194	34
162	22
28	28
42	14
150	34
810	64
110	26
114	30
184	44
498	48
158	34
1046	56
204	32
226	26
380	44
438	58
950	58
398	46
50	26
874	58
192	40
80	28
288	44
378	34
118	26
296	40
114	26
40	32
310	32
336	40
912	58
194	30
620	52
286	50
560	52
290	40
110	34
84	32
704	62
156	40
124	24
258	34
1092	74
188	38
552	60
288	36
300	44
182	30
1018	52
234	42
196	40
566	54
818	58
84	28
312	48
62	26
488	48
176	32
1268	70
1204	64
438	46
152	40
336	44
446	54
600	52
522	48
1744	78
62	14
572	52
658	54
556	52
240	28
1984	90
188	32
284	36
672	60
246	26
292	40
19	7
96	28
146	26
2150	92
176	32
244	36
608	60
94	22
38	26
242	32
408	48
232	32
144	32
184	28
608	76
144	28
432	48
172	36
98	28
68	26
228	38
68	24
230	36
540	44
314	44
214	42
106	34
260	44
172	36
594	50
638	58
56	32
774	62
854	66
640	56
242	38
260	40
102	30
82	34
136	36
288	44
332	48
604	52
696	56
102	30
618	58
514	42
588	52
374	38
788	48
438	34
914	74
106	26
216	40
152	32
358	46
166	42
204	40
968	58
258	46
1016	66
294	32
180	36
396	46
136	28
148	28
250	40
370	38
86	30
474	46
198	34
868	76
1110	68
236	40
272	44
102	34
106	30
474	54
596	58
92	28
204	34
116	20
290	32
348	44
416	38
170	32
486	48
422	50
370	42
832	64
460	44
952	64
96	28
186	34
350	54
214	34
286	38
132	24
78	26
899	52
266	42
266	34
986	62
552	52
254	42
244	34
96	20
202	36
296	42
410	34
354	38
194	34
22	14
324	38
436	44
508	56
910	64
410	50
378	38
720	60
356	38
552	48
332	44
1028	78
306	38
60	28
266	38
668	54
126	34
352	48
748	64
1202	64
650	54
576	48
632	48
486	54
146	26
96	24
156	24
388	44
512	40
328	38
380	42
210	38
242	46
1144	76
154	30
406	46
282	30
128	36
598	48
354	42
1872	88
328	48
740	44
48	18
86	34
504	52
1668	76
394	54
78	18
932	56
300	40
192	32
98	28
198	40
212	36
216	38
1300	78
380	48
998	58
164	32
78	26
40	28
908	60
1678	68
534	50
144	40
614	46
934	54
600	48
148	26
472	48
154	30
122	30
288	40
130	26
346	28
120	36
468	44
128	16
564	58
518	46
266	38
356	48
98	22
342	38
274	34
120	28
238	42
1662	86
352	44
404	54
188	32
158	30
1250	74
723	51
224	26
836	56
388	40
248	30
444	48
1335	88
156	32
790	58
150	30
276	36
108	24
106	18
106	30
218	28
320	46
106	34
210	42
446	54
182	38
150	26
452	40
360	32
32	24
616	52
100	36
56	24
446	50
324	44
240	46
196	44
166	30
432	32
540	40
480	40
94	22
246	42
196	32
626	54
60	24
166	32
220	36
116	32
240	32
1600	84
950	62
350	42
186	42
168	36
242	30
94	34
384	44
2086	88
182	38
246	46
254	34
152	44
78	26
278	34
108	28
556	52
851	63
126	34
242	34
88	32
272	36
84	28
624	52
250	38
114	22
1134	78
490	44
64	32
444	54
322	54
296	34
212	44
232	40
212	32
88	28
608	52
104	28
200	40
76	16
178	26
244	36
350	38
130	38
188	34
172	32
1816	86
208	36
578	62
358	46
514	50
340	32
300	36
200	32
1222	82
128	36
652	52
198	50
586	54
368	48
1110	64
1250	70
536	48
30	22
148	36
118	26
516	48
794	62
1700	76
56	16
74	30
194	46
694	46
252	52
488	52
512	46
160	24
572	54
170	34
466	50
108	28
802	74
316	40
542	42
130	26
358	42
180	40
476	56
350	34
442	54
386	44
864	68
178	30
574	54
120	28
356	44
92	32
256	44
134	30
1656	82
128	36
650	50
154	26
1172	72
590	58
726	58
260	40
154	24
142	38
230	38
114	30
238	30
258	22
276	44
250	34
290	34
356	36
236	38
264	36
216	32
1038	66
170	30
414	48
176	40
98	30
510	46
1618	72
562	50
510	48
126	30
190	34
96	24
466	44
1191	66
222	34
226	30
210	42
96	20
246	38
232	36
356	44
194	30
128	24
146	36
188	36
206	30
140	32
512	52
846	66
240	32
334	30
442	50
124	24
602	52
354	34
204	26
574	50
250	42
64	32
80	16
152	38
186	42
1168	74
350	38
178	34
1204	76
292	32
988	58
574	48
490	52
86	22
172	28
842	62
394	44
658	58
180	40
140	36
136	24
312	40
348	42
244	36
230	38
154	32
180	36
160	40
156	28
86	26
612	56
256	44
122	26
146	30
178	34
780	64
64	20
206	42
402	42
84	16
166	34
164	32
156	44
306	38
186	30
312	40
232	36
806	58
632	52
246	30
264	36
292	36
316	44
360	36
72	28
70	34
136	36
344	40
444	44
436	40
1510	84
620	48
2568	102
516	52
280	38
198	34
584	48
182	26
412	52
198	30
426	42
176	40
238	30
230	30
158	26
202	42
164	32
372	48
104	24
254	38
466	46
62	38
294	42
926	66
96	28
930	62
84	28
250	56
380	48
174	32
1058	68
392	52
264	38
186	36
96	28
276	32
1940	88
210	30
122	26
106	30
484	62
142	34
94	26
306	42
216	36
150	30
644	38
134	38
56	34
248	40
414	50
188	32
414	44
42	14
278	42
426	66
104	24
140	28
316	44
456	44
488	46
300	28
30	14
120	32
410	42
132	32
350	36
1010	66
80	20
1206	68
270	54
210	26
110	26
298	38
616	52
294	42
270	38
394	46
418	46
188	36
92	24
220	38
334	42
292	28
177	36
262	30
188	36
128	24
766	48
568	50
36	28
224	34
136	32
516	58
114	30
594	46
850	58
316	40
158	34
266	42
254	34
172	28
338	50
716	52
136	40
508	60
184	44
610	44
82	26
564	54
220	44
156	32
42	22
270	42
952	58
291	44
560	46
190	38
118	30
740	52
60	20
60	24
392	36
50	22
786	54
334	34
294	46
250	42
688	50
230	38
144	24
282	38
214	40
266	50
328	44
1184	76
176	36
122	22
82	28
852	56
560	52
110	30
182	34
232	36
316	40
1164	68
332	44
992	68
134	30
272	40
60	32
106	30
246	30
148	24
450	44
520	38
150	34
572	44
722	60
1248	74
200	40
588	48
940	52
116	28
212	32
310	38
242	34
1124	70
230	50
896	68
498	46
700	66
396	44
568	58
198	26
658	56
226	46
454	50
120	26
218	46
176	24
210	30
542	54
354	36
48	24
420	40
256	28
946	66
19	7
250	44
218	38
182	38
72	24
156	36
256	50
188	36
922	74
132	32
336	32
140	24
74	34
370	50
272	36
318	42
930	78
776	54
102	34
1746	80
488	54
572	44
994	52
50	18
190	26
392	50
426	50
164	36
124	44
178	46
64	22
254	38
96	24
656	52
234	46
308	44
1864	80
78	26
516	48
326	42
388	44
214	40
176	32
216	36
236	48
78	30
92	24
122	18
818	70
266	26
572	50
214	50
412	44
542	54
284	36
166	30
468	58
272	40
392	42
156	32
564	48
368	44
242	34
314	38
258	34
148	36
48	24
208	30
330	30
482	46
234	34
150	34
304	40
968	60
408	42
748	60
136	28
66	30
60	20
364	42
356	36
192	36
154	34
596	52
494	52
260	40
726	50
302	34
484	40
122	18
524	54
228	36
408	40
2110	100
556	52
628	60
130	30
142	22
156	26
150	30
448	32
176	28
424	52
114	30
454	42
220	32
402	48
380	44
644	44
116	18
246	38
322	26
444	44
348	44
60	36
112	28
36	24
42	14
830	58
588	60
506	42
574	54
478	50
86	26
52	20
168	40
588	56
298	38
396	48
584	60
182	34
140	24
700	52
322	42
174	38
390	44
260	44
400	46
226	34
134	30
338	42
198	42
80	28
404	56
184	28
646	58
90	18
1122	76
302	38
568	62
1172	76
328	36
298	34
1420	86
76	28
122	42
270	38
66	30
48	24
314	42
858	68
152	32
534	50
312	42
274	42
268	36
96	28
186	30
1602	74
106	30
1034	66
220	36
500	44
170	38
1032	64
252	46
1280	56
598	46
252	44
246	30
336	40
484	64
254	32
182	46
262	42
768	72
248	48
350	38
582	48
144	28
150	34
496	50
430	50
348	36
44	20
198	46
504	50
390	46
232	32
92	32
242	34
140	28
136	28
86	26
112	36
260	36
64	20
170	38
266	46
708	50
1554	76
344	42
636	44
228	40
104	20
116	32
242	26
104	24
48	28
120	32
228	32
326	42
124	32
348	46
84	20
244	40
178	30
354	42
414	40
550	54
368	42
484	44
82	18
200	38
330	38
288	44
70	30
90	30
142	34
26	26
788	48
462	50
366	38
306	38
506	58
414	42
498	54
546	54
498	42
314	42
674	38
246	34
970	50
252	28
1008	72
246	30
62	18
22	10
102	26
284	32
300	36
104	36
122	22
56	20
742	54
408	52
326	46
62	26
140	24
126	26
174	34
82	22
2482	94
482	46
180	40
304	36
262	34
418	50
408	40
546	54
194	38
68	24
194	30
384	44
1136	70
334	42
304	36
710	62
248	40
76	28
374	50
428	44
138	34
264	36
238	34
264	44
724	62
200	36
38	18
92	26
56	16
124	28
342	38
450	44
334	36
100	28
156	36
216	40
508	52
168	34
38	14
256	44
406	40
60	24
60	28
266	38
90	26
524	44
188	24
430	54
1671	82
577	49
94	22
90	30
278	42
1232	68
130	22
408	34
314	42
216	28
390	56
1722	76
254	30
42	26
250	32
40	12
102	30
372	40
42	26
100	24
48	16
192	34
198	46
46	26
70	26
66	26
238	38
160	28
54	22
134	30
360	32
74	30
60	32
374	42
828	60
252	36
136	28
898	66
184	36
352	44
56	28
722	62
850	58
188	40
678	54
272	44
110	26
354	42
218	38
392	48
68	32
698	58
542	62
656	68
514	54
962	58
102	30
118	34
236	36
212	32
552	54
232	34
86	18
588	54
128	16
376	42
2126	94
478	58
96	24
86	34
254	38
180	28
666	46
592	52
108	24
216	36
248	36
148	30
300	48
546	40
186	34
2082	68
1082	70
806	52
836	58
190	30
1246	76
310	50
386	50
256	32
608	44
246	34
142	34
214	30
300	28
896	62
648	50
74	18
354	46
460	52
232	44
988	56
212	36
204	36
236	36
604	68
254	34
222	30
536	48
202	34
112	20
166	26
142	34
318	38
34	28
280	32
508	42
68	16
170	34
352	52
250	34
172	32
378	42
154	38
226	38
470	50
1576	86
264	48
206	36
452	56
112	28
3818	108
600	52
148	28
440	42
524	48
806	54
164	28
242	44
316	40
280	44
412	40
708	56
852	54
344	40
256	34
256	36
338	38
100	20
374	46
276	36
810	58
348	40
218	34
496	48
170	30
290	38
244	28
258	42
162	38
264	36
138	30
350	42
240	24
160	24
454	46
526	46
150	28
328	40
400	60
194	22
79	15
302	42
1114	54
610	42
194	26
1063	72
620	48
212	40
454	42
682	46
254	38
154	26
542	46
364	44
108	30
376	50
1396	72
1428	72
334	50
666	58
90	34
416	40
194	22
82	22
478	50
472	50
614	58
226	38
34	14
246	42
138	42
334	34
196	40
48	24
358	42
192	40
238	48
278	30
480	56
498	50
104	28
1342	74
744	58
266	42
76	28
968	70
82	22
258	46
112	28
170	26
200	36
1076	72
116	20
742	58
216	40
686	46
360	46
76	28
230	34
90	26
266	34
314	42
854	54
220	24
966	56
186	34
634	46
148	28
1206	66
172	36
282	42
250	46
336	56
534	58
378	50
272	32
340	42
104	32
560	56
236	36
440	52
578	62
384	52
36	28
292	32
436	44
434	34
960	60
502	58
100	24
1202	70
1124	76
166	34
142	30
260	28
982	62
186	42
198	34
1264	68
166	34
40	24
92	28
428	48
338	34
394	32
316	34
396	64
370	46
156	32
240	36
196	26
110	26
292	34
440	42
88	24
110	26
612	52
82	30
78	34
406	34
68	24
1412	78
574	54
418	50
322	42
130	34
378	46
684	56
1846	80
262	32
64	24
442	36
456	48
1248	66
50	22
30	26
494	50
32	24
136	32
214	38
340	36
562	50
282	38
106	30
470	42
96	28
30	22
390	42
812	44
402	46
222	34
202	38
408	56
788	70
126	26
50	18
184	32
372	32
376	52
306	34
72	32
32	32
246	42
280	36
160	28
772	60
218	34
300	36
98	26
296	40
414	42
350	46
694	56
382	38
380	48
246	30
502	58
996	58
260	32
178	30
326	38
358	36
460	46
414	38
372	44
454	48
972	66
126	22
166	34
152	32
136	36
440	52
790	62
96	28
322	38
408	44
612	64
276	36
1058	76
182	36
50	26
412	40
86	14
270	38
228	40
54	18
124	36
160	26
90	34
1480	74
328	40
538	58
270	34
470	46
340	40
402	48
330	46
490	54
78	26
128	26
234	34
430	46
260	40
90	22
288	36
476	50
86	26
216	32
624	60
264	32
460	52
288	40
256	36
132	28
794	60
96	30
104	24
344	44
136	32
1280	60
462	46
280	44
80	40
634	50
436	52
474	46
1274	58
590	56
520	56
488	42
378	38
710	54
128	28
122	30
126	26
312	44
180	32
314	28
608	80
90	18
170	30
218	34
224	38
50	26
1826	90
128	28
506	62
38	30
84	28
172	40
146	44
530	48
498	42
84	24
954	66
130	22
426	42
656	54
286	40
296	52
660	50
130	30
456	40
130	30
794	56
364	50
262	32
94	22
220	36
88	24
112	20
534	54
70	26
62	22
620	62
1028	66
522	42
30	22
160	24
148	32
70	14
544	52
372	48
222	34
268	44
226	42
66	22
180	28
190	30
82	26
642	62
272	36
284	48
336	36
524	56
320	44
564	60
776	58
392	36
72	20
448	52
248	36
194	42
262	46
488	56
110	22
650	46
118	22
250	42
266	34
618	54
148	32
166	30
556	48
1242	60
646	52
170	26
128	32
788	54
126	30
650	56
332	40
118	30
654	42
174	38
470	46
186	34
252	36
126	34
68	28
184	40
258	42
272	48
432	52
396	40
382	54
780	56
184	36
164	32
870	68
432	40
436	44
452	50
810	70
180	32
72	16
382	42
232	32
128	28
308	38
1744	68
518	50
362	54
462	46
344	38
38	30
282	42
154	26
622	52
884	56
266	34
216	40
326	38
430	46
186	30
588	52
798	48
48	16
130	30
58	22
812	66
246	38
772	56
92	24
404	56
150	26
68	14
282	38
44	32
480	44
122	30
354	42
56	32
654	58
318	36
160	40
366	50
288	40
284	24
668	64
428	58
846	66
634	54
332	32
140	40
324	36
26	14
432	44
268	40
382	42
206	34
260	36
110	26
22	22
346	42
354	38
142	42
670	64
140	28
24	24
262	38
124	24
402	46
952	68
288	30
160	32
296	36
38	26
824	58
200	36
252	30
1024	72
182	36
328	52
540	48
982	62
428	36
352	46
542	54
762	66
948	60
502	54
268	50
144	38
296	52
926	60
118	30
628	52
474	54
242	34
414	40
78	36
136	36
152	24
210	34
280	48
172	28
778	62
604	40
118	28
532	62
230	38
910	58
1376	74
1430	64
150	30
38	30
1182	78
58	26
162	34
272	48
328	36
256	40
912	78
842	62
98	26
144	28
226	26
308	42
148	28
692	52
962	62
398	46
184	40
486	52
388	48
212	36
1036	76
104	24
608	56
1018	76
366	46
248	34
126	30
306	38
252	32
34	26
160	32
54	30
294	42
422	50
198	34
306	42
512	44
124	36
122	26
228	30
580	52
172	36
168	32
260	48
1102	64
318	46
32	26
218	34
118	26
114	30
244	44
352	48
146	30
250	34
592	48
98	26
80	32
332	44
242	38
528	44
118	34
116	32
1032	66
912	60
328	44
572	54
728	64
216	36
96	28
116	28
276	32
1042	66
322	48
384	44
108	24
62	18
484	52
260	46
96	28
338	46
752	64
196	36
112	36
128	36
408	40
412	58
1016	66
334	38
192	40
214	26
422	38
728	60
112	28
526	42
314	38
126	30
148	28
174	28
698	62
340	44
150	30
380	40
612	56
594	58
452	48
328	52
428	48
238	30
248	40
698	62
342	42
170	24
496	56
1082	62
546	50
348	40
122	26
844	74
62	30
206	32
404	48
1250	58
322	42
306	42
144	28
86	22
120	36
538	50
216	40
126	26
654	62
230	38
148	32
224	44
582	50
282	34
190	30
514	46
362	46
412	56
76	24
286	34
464	52
628	48
392	32
200	28
130	28
892	64
418	38
440	48
470	42
298	40
386	46
430	38
286	34
442	38
192	36
382	42
254	34
26	26
170	28
806	64
118	22
440	40
336	52
1166	62
568	64
556	56
228	34
488	52
274	34
234	38
322	52
1198	78
1102	70
186	38
486	50
86	34
282	38
306	38
44	24
210	38
242	34
524	42
422	38
506	46
422	50
286	30
92	28
174	42
1270	62
392	44
144	46
106	30
88	20
518	50
142	30
944	52
906	50
130	38
408	40
660	56
468	44
896	70
110	30
178	30
402	54
352	52
68	24
626	54
224	32
260	40
1768	90
19	7
280	32
98	42
382	44
474	46
218	38
632	38
1240	78
122	30
192	30
42	14
182	34
40	16
394	38
222	38
346	42
690	58
326	38
450	42
80	20
312	32
414	46
194	34
1188	60
1350	70
412	38
770	54
234	34
352	36
1290	76
220	40
116	28
50	26
40	28
98	30
444	52
408	48
284	40
1022	62
234	34
248	24
278	46
182	34
404	44
96	32
450	38
166	34
96	32
140	28
430	48
156	28
98	30
346	48
64	24
1756	78
128	40
58	22
320	48
432	56
86	30
662	52
42	14
418	48
1382	72
270	30
598	58
294	38
1248	72
332	44
604	52
352	46
22	22
502	54
540	56
378	42
114	34
186	30
436	38
470	42
2884	108
278	42
40	36
192	24
422	44
352	52
56	24
238	38
450	54
520	40
438	42
780	48
324	44
384	40
186	38
320	28
116	24
296	38
220	32
648	52
322	46
366	42
284	36
194	30
86	26
308	52
384	36
270	42
294	46
328	52
376	46
158	26
120	32
520	44
86	26
78	18
434	58
524	48
1424	80
688	52
216	40
86	30
682	50
276	40
342	42
200	36
336	36
656	60
146	30
270	38
306	42
266	36
342	46
378	46
208	32
66	22
434	48
746	50
48	24
218	38
376	44
3630	108
462	46
352	52
174	38
378	42
118	30
98	26
212	44
266	30
98	22
726	44
160	30
126	30
482	54
652	60
244	36
100	32
186	36
192	24
182	28
386	38
328	36
44	24
1500	64
220	32
186	36
362	30
308	44
78	26
452	44
284	48
88	28
648	58
110	30
156	28
204	36
114	26
258	38
1028	58
852	58
60	24
138	30
248	40
186	30
182	38
98	28
224	30
166	30
848	68
168	36
350	56
40	28
1094	70
338	42
1126	56
624	56
58	22
240	40
764	48
206	34
196	36
562	42
170	42
524	50
74	18
192	32
1388	86
430	50
88	28
216	40
116	20
644	48
240	36
648	58
42	30
1266	74
754	66
828	64
236	32
996	60
490	46
192	34
158	26
450	48
284	46
166	30
392	44
164	28
202	30
192	36
126	30
90	26
390	46
144	36
1140	66
110	26
270	38
96	28
672	64
206	30
130	30
92	20
138	26
482	38
346	34
146	30
946	62
496	44
748	60
576	52
308	40
232	36
414	50
162	30
508	46
644	54
1256	82
256	44
156	32
980	50
330	54
372	40
264	34
532	40
40	24
686	50
236	40
376	46
482	44
438	50
1310	76
372	40
134	30
138	26
120	28
224	30
1020	62
820	60
564	52
166	42
616	52
362	38
1048	56
430	38
100	20
298	54
592	64
382	46
240	32
102	30
1190	74
36	28
176	52
1032	64
544	52
106	30
122	20
222	36
400	46
456	48
330	50
112	20
68	24
50	26
354	38
110	30
216	40
128	28
370	48
546	54
384	52
200	38
452	56
614	56
942	48
204	36
76	24
362	38
520	44
414	44
174	30
48	16
654	58
146	30
172	36
328	42
1056	70
508	50
422	42
122	26
122	22
274	42
888	70
346	38
322	46
352	44
358	34
754	68
122	30
450	46
3272	116
202	42
940	56
512	48
228	40
72	28
248	40
248	40
1030	76
56	24
318	36
486	58
172	36
632	60
136	32
70	26
792	60
326	46
76	32
162	26
344	30
770	54
540	48
468	48
334	38
330	38
410	38
1496	84
638	58
896	68
172	40
222	38
214	38
52	20
298	44
264	28
272	40
794	42
60	24
252	28
92	28
432	36
312	38
1372	64
1042	66
322	38
154	26
258	38
334	42
306	38
66	30
160	32
646	56
414	44
178	38
46	30
600	46
19	7
554	54
666	50
286	46
434	52
182	42
244	40
176	36
854	68
648	46
230	34
288	44
132	36
330	40
680	58
732	64
220	28
270	52
406	46
238	34
148	36
420	40
1714	78
98	24
112	36
122	30
190	30
294	42
394	50
142	34
202	30
174	30
40	16
34	14
572	50
604	58
272	36
754	54
206	42
206	38
452	36
70	30
328	44
134	26
130	34
746	52
238	38
496	36
154	30
240	28
132	28
150	34
232	38
1250	70
590	60
464	44
190	38
624	42
228	40
188	40
588	62
106	34
292	36
66	30
208	32
78	30
226	34
84	24
476	54
96	18
606	50
120	20
104	32
442	50
278	34
50	26
556	54
280	40
380	56
542	46
64	16
462	46
1378	76
606	50
294	48
222	30
234	38
882	62
256	32
432	52
92	28
44	28
852	72
734	50
996	68
248	36
82	30
180	32
498	52
292	30
248	40
568	60
152	28
260	32
188	32
140	44
386	46
382	42
302	50
172	36
60	28
162	38
132	28
178	26
262	48
538	34
184	32
1244	64
524	44
378	46
354	54
228	40
508	54
386	42
796	58
274	38
510	46
1014	68
88	28
92	28
308	44
694	50
418	42
506	52
364	40
86	26
116	28
106	30
306	38
188	36
92	32
388	38
644	50
62	26
84	24
144	32
454	30
316	40
1914	86
124	28
1110	70
2176	94
316	48
30	22
100	32
324	44
138	34
180	36
156	32
242	38
146	38
372	36
338	40
272	34
172	46
344	48
970	52
232	36
140	28
184	48
204	28
702	46
240	40
312	40
108	20
452	50
148	36
354	40
414	48
412	32
256	44
172	24
442	50
288	32
260	36
78	26
1404	70
1048	64
544	56
174	34
19	7
232	40
114	34
158	34
530	44
186	30
62	18
474	42
567	50
712	62
264	32
576	46
132	32
106	22
96	28
204	30
1360	76
100	30
332	34
158	38
160	32
188	36
180	24
348	44
366	46
314	38
390	46
138	30
192	32
160	28
326	38
168	32
484	54
190	46
412	44
72	28
120	28
288	36
258	42
542	54
250	42
732	52
228	36
400	44
106	30
112	20
102	30
460	54
304	36
202	36
436	48
1068	70
282	38
138	34
414	52
404	48
60	36
856	60
402	52
216	34
302	34
628	40
606	58
558	52
1184	60
682	54
586	54
306	38
64	16
418	46
424	44
70	30
294	38
466	32
92	28
732	60
88	36
266	40
608	56
706	66
32	16
218	38
162	24
648	48
548	40
424	52
806	62
338	42
60	28
118	34
508	54
106	22
180	36
82	22
538	50
38	14
464	46
120	28
242	54
60	28
1252	80
1030	66
338	50
972	56
270	38
810	62
372	40
246	38
648	56
90	30
140	28
106	22
196	44
222	34
286	46
440	52
496	64
60	20
536	58
284	40
136	24
162	42
402	50
102	26
594	50
272	44
536	56
128	28
526	56
496	48
19	7
450	44
36	16
1458	60
106	22
106	26
180	48
266	34
1420	94
284	40
144	32
606	50
140	36
346	40
178	42
212	38
128	24
358	54
708	66
78	18
104	32
346	46
246	42
454	40
200	34
312	44
504	48
284	36
1054	68
778	56
206	46
190	32
756	64
166	30
164	40
896	54
776	60
204	36
706	64
316	32
172	36
766	70
930	70
1428	78
162	38
210	34
140	24
260	36
212	34
2122	90
388	48
300	52
116	20
402	44
596	52
220	44
692	66
140	32
112	34
552	60
164	32
490	46
736	60
368	40
644	56
568	60
332	28
134	34
196	40
222	42
88	28
310	38
270	42
230	34
850	62
518	50
412	46
248	48
362	42
692	56
740	52
254	38
296	28
568	50
34	22
562	54
146	26
442	54
1008	78
728	44
58	34
1524	84
994	62
122	22
232	40
246	38
222	26
806	52
470	42
150	26
334	40
352	32
1010	70
52	28
440	40
454	54
102	26
44	16
252	40
825	57
276	40
192	36
287	28
882	62
126	30
204	40
90	30
178	38
264	44
234	34
230	34
334	38
180	28
222	38
162	38
524	48
452	48
366	30
210	42
816	60
210	38
280	40
86	22
70	22
810	54
312	44
542	60
196	36
286	34
278	42
210	38
264	40
608	52
140	28
42	16
260	28
222	34
418	42
34	14
466	46
19	7
208	44
410	38
502	50
60	20
120	28
198	38
310	34
1226	82
482	50
492	60
450	62
1657	77
52	28
468	54
84	28
354	46
228	42
270	30
214	30
180	44
128	24
404	44
396	48
132	28
166	30
178	30
780	60
946	66
396	44
568	48
416	40
170	30
50	22
76	30
240	36
122	26
251	30
1042	62
286	38
1226	78
190	34
48	24
264	28
172	36
280	44
814	50
224	40
198	38
180	28
250	34
170	30
900	66
644	44
240	36
98	38
436	52
184	32
334	42
694	66
154	34
154	38
288	42
226	22
192	36
106	26
314	42
406	44
1388	74
174	30
144	36
162	38
354	38
118	34
298	38
506	42
926	66
134	20
312	48
518	42
486	50
154	34
50	14
40	16
592	52
234	42
232	36
480	50
1272	52
52	28
198	30
222	30
166	30
486	50
134	22
284	40
556	44
30	26
264	32
358	46
314	46
146	22
724	60
42	26
456	40
390	42
186	34
128	28
182	30
42	14
526	50
654	54
180	28
994	60
254	46
492	60
110	30
160	24
154	28
402	40
296	40
128	48
256	34
434	48
332	40
188	28
366	44
444	46
2292	100
124	36
136	28
56	36
990	64
200	28
88	28
50	18
132	28
326	32
828	50
264	36
144	36
196	36
248	36
126	26
154	26
486	54
322	38
80	28
316	48
514	34
62	14
64	28
472	56
872	82
272	36
478	38
532	50
798	60
208	36
378	46
1022	58
98	30
182	34
138	26
62	18
852	64
146	38
140	32
1316	70
368	40
608	68
694	54
662	54
300	36
130	26
698	64
736	52
78	18
314	46
1102	74
204	36
664	56
66	38
142	34
218	38
176	36
126	30
134	34
100	28
230	38
72	28
374	42
86	26
110	26
132	28
348	48
324	40
166	34
618	60
244	32
816	68
92	36
254	38
60	16
490	54
32	24
208	32
130	30
336	42
98	26
40	24
154	38
806	66
116	24
152	24
2278	72
106	22
88	20
860	62
118	22
608	48
364	40
200	32
104	28
470	50
178	30
80	20
390	54
138	34
312	40
472	48
100	28
238	34
122	30
122	26
114	22
206	36
498	56
288	40
224	32
128	32
214	34
1132	60
558	48
192	36
58	30
236	40
42	14
19	7
146	34
230	42
204	32
1176	64
360	44
244	44
132	24
138	22
388	48
94	26
158	30
170	38
458	54
248	48
206	34
140	48
404	44
798	68
142	30
538	46
2268	88
114	46
62	18
1006	72
168	34
468	48
662	60
2546	108
48	12
344	48
4822	104
122	34
140	28
118	18
232	44
498	42
260	54
102	30
440	38
160	24
108	28
658	54
314	42
336	40
278	46
364	48
458	42
482	40
292	36
178	30
518	58
488	50
168	32
206	28
742	58
102	26
130	26
54	22
262	34
418	46
176	30
674	54
92	16
376	32
416	48
44	24
474	44
94	26
76	16
450	38
526	58
212	32
90	34
134	26
302	26
52	20
958	62
486	46
606	50
248	36
368	48
104	32
122	22
252	40
242	26
396	44
334	42
216	34
230	34
120	24
438	38
204	44
616	52
126	30
582	58
198	34
112	20
186	30
214	38
846	70
118	34
296	36
84	28
296	36
508	48
152	32
818	58
432	44
1012	60
132	28
242	38
366	54
814	66
100	24
138	30
640	44
314	32
244	24
90	30
78	18
90	26
444	52
1034	58
64	28
312	44
372	46
2584	100
204	36
84	28
224	26
170	38
78	26
180	28
406	38
98	30
718	62
43	11
98	30
154	34
1360	76
152	24
182	38
190	26
198	30
540	52
240	48
180	32
1282	74
134	42
1528	78
138	26
208	36
224	32
60	36
106	34
72	24
258	34
1528	80
216	36
268	40
116	32
1846	94
238	34
156	36
122	30
112	20
462	50
94	26
270	34
802	58
194	26
1872	90
920	52
142	34
118	44
90	34
82	22
48	24
440	44
216	40
566	54
516	42
270	34
148	32
380	44
84	24
486	50
226	32
84	20
252	32
1016	58
334	40
5124	132
580	64
104	20
142	30
94	18
360	40
1074	60
416	40
214	32
464	40
220	28
144	44
218	24
254	30
786	52
294	38
78	26
178	38
468	44
196	32
98	18
190	30
88	20
258	30
186	22
19	7
344	44
156	30
584	50
1028	66
520	36
464	52
538	52
102	34
2408	104
236	44
208	40
302	50
248	32
590	52
102	26
116	32
258	38
19	7
276	32
168	30
464	40
406	48
78	26
130	26
348	28
340	44
640	48
116	32
176	26
266	38
694	50
340	42
194	34
1042	70
116	28
180	36
560	58
68	24
392	48
198	30
222	26
266	48
260	30
82	22
274	40
338	34
102	22
224	32
114	20
158	46
90	30
220	40
190	38
350	50
514	56
144	32
292	52
384	44
1656	74
74	26
220	40
156	32
911	66
1102	62
500	60
362	48
486	44
19	7
172	32
356	36
286	38
250	34
58	22
164	36
110	22
138	30
74	26
150	30
98	34
298	30
692	56
466	42
302	38
328	44
542	56
288	44
4585	125
328	46
318	38
370	50
332	40
310	46
608	44
152	24
112	20
468	52
250	30
58	14
414	50
110	26
396	48
478	52
172	36
470	54
324	28
894	64
800	56
134	42
46	18
222	42
420	42
202	34
852	56
86	18
936	60
1580	76
144	30
1010	76
152	24
302	34
196	22
112	36
366	46
226	30
160	26
84	16
806	70
230	34
252	44
194	46
406	40
304	40
46	22
170	42
334	38
142	28
1378	76
446	38
276	44
342	46
104	32
60	28
110	34
74	38
148	24
148	28
418	50
798	58
19	7
370	50
282	42
462	54
168	34
836	76
100	32
248	36
202	30
420	50
304	40
268	42
312	34
414	38
384	44
68	20
86	26
142	42
1054	56
418	50
252	34
754	56
134	26
106	26
256	40
222	38
434	42
490	52
116	32
110	22
186	34
322	46
140	24
212	32
230	46
270	38
172	32
476	56
186	22
632	60
104	20
794	56
188	36
88	40
112	32
588	50
100	32
128	32
120	36
1172	84
498	38
140	28
222	34
412	40
280	44
442	54
284	44
82	22
202	42
138	38
108	24
252	36
452	54
176	36
180	28
784	52
622	62
274	38
274	42
150	38
340	50
408	50
870	60
104	28
228	30
34	22
1408	80
186	38
230	30
428	48
180	36
602	60
118	30
412	28
268	48
188	32
496	40
102	36
72	24
398	38
138	42
566	46
542	52
232	40
196	32
286	36
268	40
1972	82
112	28
1464	80
60	36
310	38
34	14
758	46
142	30
584	54
360	40
138	18
1094	72
180	32
398	46
1026	60
534	58
232	36
388	54
674	62
92	32
470	50
180	40
306	46
190	38
180	40
66	26
234	58
192	32
194	38
58	18
544	48
660	44
130	26
1704	90
318	50
180	36
297	29
308	28
410	36
138	22
1026	58
264	46
408	48
304	32
622	54
134	26
62	22
382	38
748	44
122	30
122	26
168	32
256	36
86	26
276	44
172	24
154	22
698	62
84	32
280	30
126	30
200	36
354	36
618	62
84	20
866	68
2501	88
356	36
378	46
622	52
280	32
258	34
258	34
150	32
320	38
174	34
36	24
138	34
810	66
316	36
200	28
150	34
238	34
346	38
194	30
278	38
224	40
392	44
1850	94
156	40
158	34
786	68
54	18
262	38
304	52
148	32
58	26
356	44
358	42
204	40
2702	82
256	24
662	48
34	26
548	48
46	14
168	28
48	16
110	34
1502	74
132	36
128	32
560	52
634	60
774	66
166	34
35	11
380	40
678	50
204	24
118	26
100	20
296	56
178	42
152	30
270	34
378	42
2314	92
138	30
370	38
114	26
232	40
138	30
284	44
250	38
404	44
754	62
146	30
140	32
506	62
228	28
192	40
196	40
2146	106
150	26
264	40
288	40
118	38
148	26
438	46
954	54
422	46
182	38
854	62
230	30
138	34
636	54
1874	86
132	32
150	38
266	46
406	48
228	40
172	32
212	36
178	42
54	30
66	18
626	58
86	26
238	50
432	44
332	48
100	20
508	54
564	56
146	34
58	18
108	32
1260	68
398	50
174	36
324	48
452	48
102	26
326	50
300	44
74	30
270	46
238	26
284	42
862	66
426	50
212	34
462	42
190	26
482	42
434	46
334	38
100	32
250	30
194	42
804	52
462	50
752	50
302	36
232	40
100	28
144	32
602	66
80	28
2660	74
312	36
1708	74
202	42
888	50
1398	82
92	20
302	38
202	42
122	34
126	30
142	26
272	36
282	46
98	22
452	44
410	38
158	30
206	34
82	22
226	34
208	44
1138	64
964	68
96	28
402	54
82	30
56	24
382	48
206	34
132	30
228	40
194	26
312	44
440	50
202	42
118	34
96	32
264	44
410	54
236	44
2447	95
276	30
186	26
116	24
78	34
710	54
142	34
600	52
538	58
104	16
266	38
60	16
302	46
280	36
182	34
358	30
202	34
1852	88
1026	74
78	30
378	58
286	42
406	54
40	28
1524	84
166	18
300	44
194	40
318	38
300	38
460	40
122	22
222	34
260	36
696	60
84	28
140	32
506	50
102	22
186	34
164	32
178	30
148	36
370	54
150	30
748	50
344	44
94	18
366	42
152	24
630	58
108	28
710	58
208	28
2288	98
924	60
284	38
286	50
404	48
382	54
418	58
1326	78
1542	66
200	32
492	52
296	44
874	50
724	52
590	50
430	50
94	18
824	60
134	38
170	34
90	22
625	50
284	40
186	34
154	28
112	24
312	40
286	46
366	44
314	46
442	46
48	12
216	40
348	48
242	36
482	42
244	36
322	46
404	48
460	52
50	18
414	42
236	32
286	26
94	26
696	54
518	54
278	42
364	50
522	54
310	50
400	52
1012	66
530	50
506	58
252	36
758	56
400	50
158	34
608	52
230	34
220	40
600	50
1518	68
146	38
354	48
162	34
290	34
616	58
42	18
168	40
232	32
324	36
180	28
390	50
40	24
352	40
374	50
674	54
526	40
520	52
74	30
554	50
84	28
1102	54
825	67
478	46
1348	78
110	28
294	38
280	32
254	34
76	16
1028	62
610	50
1588	78
674	54
222	30
180	32
182	34
372	34
192	28
116	32
388	54
76	16
390	48
336	38
4058	130
148	32
1422	80
148	28
150	32
378	38
872	60
318	42
386	44
106	18
466	58
152	32
82	18
320	48
680	64
102	30
184	32
612	52
208	24
290	38
106	26
146	30
246	34
158	26
58	18
192	42
188	44
438	46
94	30
322	46
216	28
144	28
404	40
412	44
306	42
260	48
584	48
126	22
200	38
182	30
182	34
90	18
54	26
450	42
310	38
146	50
50	22
756	60
468	38
216	32
386	48
290	38
268	48
560	48
96	24
1738	80
112	24
142	30
158	34
576	42
102	38
428	48
508	44
434	48
1024	60
426	46
634	58
644	68
448	36
462	48
936	60
156	44
200	32
174	30
284	42
628	52
218	38
248	48
234	50
270	42
70	28
90	26
96	24
158	30
254	48
210	38
118	26
286	38
170	38
162	30
202	34
632	64
202	30
114	26
820	58
100	28
422	42
220	40
290	46
222	38
508	60
274	40
264	40
108	28
210	24
108	24
234	42
462	50
194	36
212	34
230	38
374	44
720	60
422	42
1240	82
224	28
208	36
1124	62
72	24
150	38
140	32
220	40
446	46
100	20
620	56
396	40
560	52
1750	92
100	24
364	44
130	34
526	42
240	40
100	28
322	38
222	34
102	26
296	48
212	36
640	52
44	16
462	46
224	34
228	34
186	34
246	38
74	34
1904	70
102	30
234	34
180	32
308	48
108	40
168	24
94	26
674	50
168	32
248	40
508	60
334	46
842	60
174	34
484	44
334	46
266	42
178	34
176	32
240	32
246	38
194	34
302	42
22	14
234	32
1316	68
108	34
192	32
328	36
84	32
168	28
192	34
232	38
1134	66
988	70
1292	60
274	42
96	20
210	26
348	44
568	56
298	34
292	34
536	42
326	46
120	32
132	32
122	24
506	46
216	32
66	18
5824	138
184	32
278	32
100	32
44	36
106	34
302	46
402	46
138	34
222	30
250	32
1054	58
54	18
372	40
88	24
806	50
274	34
172	36
172	30
154	30
950	62
384	52
56	24
228	28
540	56
276	40
268	36
464	46
92	20
78	30
948	66
532	52
314	38
274	42
414	42
394	46
542	46
182	26
428	44
514	54
178	36
22	22
652	56
164	24
418	46
252	40
184	28
196	32
470	34
432	48
166	34
244	40
386	50
278	34
128	36
158	42
536	52
218	34
358	50
138	34
1718	72
276	34
646	50
120	32
78	18
1156	56
44	24
250	34
96	36
510	50
86	18
932	60
56	32
604	48
306	30
142	34
420	52
242	32
304	58
104	32
40	16
946	50
360	40
660	56
48	16
208	24
190	30
210	38
550	50
1008	68
412	40
194	28
204	36
362	46
176	32
234	38
88	32
82	36
284	40
134	26
628	64
380	36
98	22
114	30
4054	114
128	36
212	36
70	14
260	28
700	58
448	48
90	34
506	46
314	46
744	56
380	46
310	30
912	52
142	26
734	66
292	40
30	22
560	54
578	58
148	24
114	38
364	48
342	34
66	22
78	30
316	44
308	36
168	28
312	34
312	48
378	42
74	26
442	50
558	54
338	38
282	38
166	30
118	26
330	38
164	40
112	28
80	32
310	54
1186	74
174	26
226	34
56	24
332	52
122	22
618	58
120	20
130	34
170	34
152	32
118	34
320	32
186	38
76	24
384	48
80	28
600	44
100	24
108	36
260	40
162	34
66	18
306	38
198	42
1249	90
276	36
374	42
2528	94
554	62
116	32
26	26
188	36
432	56
128	32
164	38
138	38
224	36
244	48
206	32
456	56
510	54
92	28
108	32
240	48
1218	86
736	44
246	34
126	30
344	48
204	56
180	36
118	26
450	38
224	34
692	52
346	42
490	34
638	56
328	26
104	26
266	34
58	14
474	44
422	40
826	72
128	28
106	26
422	42
248	28
132	28
2170	92
596	52
362	26
884	60
636	60
1830	82
1384	84
924	72
19	7
230	30
466	42
468	56
438	48
558	48
120	32
366	34
252	36
3180	110
2198	78
334	50
22	22
506	42
198	30
246	36
94	22
1554	96
1096	72
68	32
128	24
120	44
584	60
1000	56
424	48
768	56
192	36
132	20
930	66
274	46
400	28
146	26
1186	78
410	38
108	32
676	48
514	48
136	32
104	36
290	50
378	48
538	42
86	26
202	38
194	30
782	46
160	20
176	32
410	46
92	28
422	54
60	24
486	54
142	34
564	68
644	60
280	36
518	46
172	32
1160	82
376	40
148	28
128	28
482	50
276	40
164	32
54	20
188	40
386	46
1476	78
178	26
19	7
64	16
96	28
424	62
430	58
318	50
104	32
1760	80
254	32
138	22
538	48
106	30
586	54
348	48
486	50
406	50
784	48
204	36
224	32
160	40
276	44
102	26
74	22
78	22
246	38
138	30
70	18
94	34
112	28
36	12
74	26
42	26
182	34
100	28
432	54
270	38
230	34
40	24
754	66
350	38
36	20
550	42
114	22
1056	60
372	44
972	52
158	26
180	32
900	60
76	20
130	34
220	28
914	52
438	46
690	58
248	40
246	26
70	22
746	50
94	30
204	28
224	32
192	32
260	40
172	32
38	26
480	52
76	28
214	30
248	48
448	54
312	40
328	36
70	18
1086	64
454	50
388	36
98	18
186	34
938	62
298	46
334	42
238	38
166	38
742	52
600	52
424	48
148	32
134	22
122	34
148	30
198	30
716	62
610	54
124	24
272	44
128	36
1836	84
190	30
208	32
564	56
152	36
188	32
278	46
204	32
164	32
414	42
870	64
392	42
422	38
110	30
538	58
276	48
466	46
404	48
448	60
212	32
364	32
536	50
166	34
98	22
70	26
166	42
372	46
276	44
336	52
335	38
30	26
472	50
244	36
128	30
122	34
230	34
224	40
224	36
750	66
454	34
226	42
422	54
242	32
19	7
266	38
222	30
132	24
254	54
144	24
662	50
522	50
662	48
602	58
80	32
204	36
68	28
250	26
300	40
1874	102
112	28
188	24
220	32
922	58
254	50
198	46
454	50
154	38
1684	84
1438	80
126	22
86	18
344	38
638	62
308	42
1378	88
246	38
886	56
470	50
538	60
480	60
138	38
96	28
258	30
232	40
538	42
188	34
308	32
364	42
124	20
366	38
372	52
302	40
92	24
466	38
100	32
680	60
162	34
1340	64
276	44
412	38
124	24
380	48
506	56
172	32
150	42
786	62
62	26
456	42
238	30
232	40
654	52
568	40
692	48
172	28
100	24
188	36
50	18
218	40
120	20
182	38
508	34
774	52
190	34
420	46
434	42
290	42
350	50
74	18
260	40
182	34
292	36
406	50
442	38
434	50
332	40
406	38
22	22
584	52
254	42
158	26
154	30
26	14
448	56
346	40
300	40
168	32
112	36
132	32
226	28
250	38
480	64
360	44
62	22
870	70
364	48
396	44
680	46
44	16
118	22
184	34
254	50
156	28
500	42
1712	90
548	44
240	36
712	48
410	46
470	42
366	50
350	38
118	28
1118	54
180	32
240	32
314	34
116	28
152	40
1142	74
410	42
260	48
66	30
382	46
506	38
86	26
594	58
184	32
358	34
740	60
170	38
136	28
44	16
266	46
594	46
466	56
76	16
912	62
2006	92
952	66
210	38
312	40
94	22
382	44
256	32
520	44
230	34
454	34
504	48
336	38
622	52
98	26
196	32
266	34
354	46
114	22
196	40
86	30
196	24
19	7
198	26
512	40
898	60
64	24
38	22
436	44
58	22
348	56
366	46
98	30
238	50
684	50
178	22
140	32
550	58
120	30
586	50
1374	74
216	28
220	48
224	40
182	30
264	48
282	42
76	16
312	36
374	38
394	54
796	54
356	56
608	52
252	34
352	44
814	50
140	32
168	32
422	46
430	46
276	44
308	40
460	40
362	46
240	36
96	28
336	34
282	46
104	20
640	46
262	34
248	40
1436	72
214	50
266	50
350	48
178	38
460	48
390	50
126	26
622	46
752	68
334	46
134	22
232	42
152	28
496	52
76	16
340	40
990	68
390	46
388	48
76	16
728	52
234	38
134	30
910	62
278	42
394	46
142	34
246	22
808	48
780	58
580	56
98	26
418	32
386	34
662	52
156	24
600	52
168	32
140	40
292	36
142	34
184	34
478	42
526	52
202	46
204	40
126	22
214	42
250	34
706	64
808	62
906	62
62	26
452	44
246	42
136	32
374	46
102	34
918	68
1662	90
88	24
192	32
688	64
1162	78
664	56
656	52
264	28
130	26
180	32
706	62
628	52
230	34
294	48
216	44
154	34
230	34
384	40
336	36
168	32
50	26
132	28
250	32
162	34
166	26
58	30
726	64
304	44
326	50
416	36
498	50
1008	64
742	64
102	28
108	32
256	28
270	38
138	30
410	38
354	46
160	28
68	20
570	52
130	24
68	20
662	54
160	28
466	42
402	38
268	36
112	32
204	32
224	44
632	44
248	36
898	64
170	38
1284	86
90	24
276	42
154	24
664	56
144	28
122	26
130	30
182	30
1270	86
504	40
488	54
1044	68
128	36
352	40
586	60
330	54
158	30
262	38
530	56
212	32
414	46
280	36
408	40
318	46
172	36
234	42
170	30
138	34
82	42
60	24
220	34
166	38
410	50
482	46
98	30
330	50
618	58
86	22
916	68
112	28
422	42
54	18
136	28
928	58
162	30
836	64
216	32
36	28
260	40
146	34
220	40
398	44
34	26
610	56
304	40
482	62
792	70
19	7
1502	78
854	64
102	22
792	60
168	38
758	50
98	30
52	24
176	36
600	38
270	30
272	48
182	38
446	50
418	46
478	48
110	26
116	28
1022	70
786	64
50	30
342	46
134	26
772	52
1370	70
80	26
178	34
1142	60
478	46
144	20
178	26
834	58
1422	84
164	28
414	48
116	28
446	46
374	46
122	26
368	40
198	42
182	38
252	32
110	26
660	60
228	32
66	22
566	50
110	30
180	28
750	58
478	46
72	28
226	32
324	40
994	78
386	46
288	32
222	34
118	26
446	56
434	38
290	38
422	46
106	22
144	32
114	34
110	38
1398	76
1340	68
98	18
188	44
236	36
104	36
134	34
500	46
238	46
56	20
614	52
382	46
302	46
374	50
342	50
150	34
1350	74
196	28
502	46
748	56
314	36
918	56
302	38
70	30
306	50
206	30
1150	66
166	34
662	58
164	32
186	34
128	28
516	48
488	44
148	32
408	48
192	36
646	58
144	26
1732	82
130	26
72	28
208	44
296	44
350	50
326	50
194	38
30	26
4536	126
138	34
476	46
250	38
392	44
842	44
292	32
162	30
204	32
724	50
310	38
210	42
434	38
762	58
160	32
94	18
568	58
184	44
1641	86
1238	68
404	44
200	40
132	32
222	22
34	18
156	32
268	40
1102	68
1076	70
162	42
64	24
554	54
192	28
684	62
204	32
146	22
830	62
222	34
228	38
714	60
254	42
102	30
174	26
170	38
270	34
56	32
102	22
354	42
182	42
230	38
118	26
94	30
202	36
132	36
1126	70
58	26
76	30
154	38
244	40
294	38
944	54
44	24
676	48
838	66
58	34
376	52
324	48
544	46
210	46
486	40
300	40
196	28
184	40
1394	84
184	36
638	60
838	52
150	38
358	50
90	24
294	34
228	40
178	38
788	62
148	28
98	32
166	30
346	42
298	42
204	38
152	32
122	18
160	32
196	34
1020	68
60	20
188	40
132	36
110	26
244	30
792	56
518	62
210	34
278	38
390	42
56	28
1554	66
808	60
96	28
442	58
194	34
246	32
230	26
268	46
288	52
1602	92
1774	82
612	40
328	36
278	42
244	40
834	68
696	44
382	50
668	60
298	50
584	56
222	32
560	54
56	16
478	50
456	36
514	42
104	28
66	26
132	24
264	44
60	16
92	24
344	32
110	26
50	26
46	22
622	54
102	30
316	30
142	34
144	32
698	58
336	40
348	48
50	26
38	26
90	30
598	66
110	34
92	28
176	36
644	56
246	34
36	28
248	36
412	36
208	32
192	32
190	38
478	52
98	22
516	46
200	32
1756	80
208	34
66	18
470	36
228	26
180	32
258	34
398	42
842	66
66	18
100	28
132	28
22	14
246	42
402	38
422	42
194	30
378	42
186	26
38	14
102	18
218	30
158	34
166	30
328	36
352	48
228	48
114	26
602	54
486	50
522	58
536	56
166	30
238	34
184	36
282	34
98	38
316	44
204	36
62	26
204	44
368	40
494	50
220	32
380	44
392	44
100	32
1004	60
356	34
456	48
774	74
200	28
32	16
740	52
166	34
322	38
310	42
236	36
362	38
870	74
492	52
1098	70
560	58
184	40
370	42
130	38
464	52
620	48
168	24
642	64
19	7
984	76
38	26
232	44
610	54
902	60
300	32
150	22
342	48
602	66
606	46
1462	74
264	42
122	26
592	52
306	34
910	60
636	52
438	44
86	22
372	48
1566	78
72	32
580	44
704	64
462	54
392	48
576	54
198	38
222	30
618	42
204	32
1142	66
150	42
70	26
1198	82
258	34
170	26
100	36
498	50
452	40
56	24
268	40
232	40
168	36
288	40
228	44
96	32
350	54
52	24
104	16
34	18
512	52
138	24
102	30
544	56
2638	98
454	50
428	44
838	66
212	32
136	24
280	36
218	42
442	48
120	24
268	36
116	32
114	18
542	58
216	36
106	38
534	42
262	34
132	36
864	64
280	36
180	28
108	24
568	60
490	56
246	42
244	24
112	24
474	42
126	34
1338	82
264	42
190	38
242	42
602	58
480	50
74	30
116	28
1024	72
836	60
318	46
266	34
378	38
74	18
552	48
96	20
118	34
232	44
602	58
904	64
462	54
500	44
248	40
512	52
326	38
198	30
30	30
1262	78
392	44
88	36
38	14
86	34
240	36
322	40
52	28
292	40
580	44
522	38
278	38
26	26
86	26
1670	78
318	50
642	50
34	26
296	52
474	52
268	36
404	42
146	30
548	60
294	46
66	22
612	46
94	18
124	24
190	42
46	14
46	22
689	62
1120	58
818	70
496	46
186	34
118	30
854	52
166	34
972	62
996	60
218	36
900	48
1000	64
538	54
40	12
102	26
882	68
312	40
430	34
134	26
636	58
788	60
160	28
352	44
382	50
54	30
674	50
232	32
94	38
346	50
2142	96
816	68
170	34
754	54
66	30
280	40
198	42
440	50
96	28
398	50
19	7
428	44
428	48
1376	58
304	32
802	62
88	24
270	42
190	46
138	38
700	54
160	28
96	28
1050	62
84	24
360	44
94	26
112	20
330	50
290	34
742	50
396	40
386	44
204	28
96	24
256	42
1002	66
564	52
274	38
640	52
318	46
380	56
140	36
106	22
134	34
428	40
114	30
304	56
168	30
174	34
336	44
150	34
66	18
84	32
472	44
56	16
216	32
180	36
124	28
216	32
282	44
858	50
50	30
68	36
206	34
234	40
198	34
324	40
810	74
224	24
164	28
110	26
98	26
536	52
362	30
122	38
194	26
112	32
78	18
252	40
406	50
268	40
106	26
214	36
390	42
574	50
76	32
198	30
60	18
114	30
812	58
70	30
116	36
652	48
1574	84
32	20
578	50
574	46
176	32
434	46
116	20
142	30
218	38
240	32
300	40
248	48
468	40
168	30
704	50
140	20
822	62
172	40
322	50
128	32
19	7
114	18
204	34
360	48
328	32
130	32
172	24
244	34
110	26
160	32
238	40
258	34
902	66
704	50
460	52
194	38
138	34
58	22
40	24
366	46
286	42
80	20
86	30
202	44
448	44
512	34
70	22
262	38
1743	86
178	30
136	36
730	58
372	52
150	38
726	46
174	34
588	52
84	28
162	30
320	46
518	48
348	36
193	24
302	46
318	54
354	42
584	48
324	44
68	36
238	34
74	18
1452	64
268	36
1118	74
270	42
374	44
162	38
144	36
248	36
178	34
54	22
318	56
168	40
626	50
190	30
606	56
140	32
196	28
172	40
266	42
296	36
1344	66
910	66
802	54
180	32
138	28
214	42
46	26
244	40
168	36
268	40
156	28
448	52
220	32
54	18
278	34
244	28
4594	112
356	40
1664	84
316	44
60	28
192	40
128	24
786	50
90	34
106	34
132	28
226	42
156	28
114	26
424	64
328	36
2526	100
1404	78
78	26
410	50
180	36
246	34
138	32
270	38
1228	76
3750	112
22	14
644	56
284	44
344	34
388	40
1414	86
164	40
96	32
420	52
404	48
174	34
732	60
82	18
1138	70
84	28
68	24
234	36
132	24
728	70
462	50
148	40
24	24
272	32
676	56
156	48
448	38
68	24
506	54
770	70
498	50
220	24
1731	74
290	34
416	48
318	44
50	22
194	36
19	7
126	30
116	28
292	34
520	36
356	40
134	26
782	74
398	48
382	38
228	32
1258	62
360	44
344	54
290	30
806	46
216	32
494	42
394	46
78	26
448	52
632	58
124	36
380	36
708	48
212	28
970	66
412	54
184	36
270	38
726	64
90	26
80	28
662	58
114	26
244	28
422	46
336	46
410	38
124	22
1476	76
116	24
400	48
142	30
164	32
112	30
284	48
220	36
804	56
1328	76
1372	76
152	20
568	70
214	34
872	52
118	20
172	32
260	40
316	40
112	36
584	48
362	46
632	56
7936	152
860	62
362	42
190	42
248	36
1406	74
584	48
182	34
150	42
398	42
196	32
204	28
438	38
122	18
474	54
106	22
276	44
152	36
71	15
120	36
258	30
528	52
462	50
180	24
1626	68
256	40
750	54
190	32
2356	94
260	40
192	40
478	38
288	38
1058	72
488	56
68	28
846	50
288	46
246	38
128	32
214	32
166	34
258	48
246	42
62	30
262	38
354	46
824	52
316	52
82	34
638	62
300	48
906	64
424	36
288	40
542	54
790	60
310	40
964	66
308	48
526	62
830	56
24	24
731	66
364	56
426	58
1176	64
270	34
3922	126
320	44
284	46
416	52
382	34
1058	58
574	48
88	24
166	30
160	44
310	38
386	40
174	36
268	32
900	60
326	54
652	50
70	30
434	46
376	40
146	30
248	32
184	32
196	32
3514	108
150	36
100	20
328	40
428	42
36	24
168	36
126	26
524	52
388	48
80	24
832	68
368	52
354	42
102	26
664	56
914	74
192	28
538	46
190	30
212	30
168	34
122	30
72	20
1298	56
654	44
66	22
122	26
170	34
1020	58
352	52
458	34
486	46
58	26
470	48
272	32
430	54
342	42
740	52
378	38
150	34
706	58
456	44
204	40
276	38
80	28
3303	110
630	54
256	38
110	26
250	40
518	50
144	28
108	28
398	50
340	44
716	52
180	36
190	38
334	38
524	56
322	38
296	40
178	38
50	26
2190	78
1148	70
206	50
186	34
222	38
194	40
66	26
268	32
196	24
270	30
182	26
182	38
336	44
94	26
122	30
72	24
460	52
70	28
578	54
38	30
92	32
130	30
380	48
52	24
362	50
164	32
418	46
484	44
306	46
604	52
148	36
436	42
86	30
550	54
1166	64
276	40
1748	76
140	32
252	44
194	26
272	44
1338	84
58	18
318	46
19	7
90	30
260	40
128	36
506	46
710	48
162	38
214	46
416	48
1070	52
204	38
594	46
482	62
210	42
327	46
40	16
94	26
222	38
432	48
150	22
170	30
384	46
34	26
194	38
120	22
182	30
372	36
286	30
390	50
166	36
250	30
208	28
106	20
482	56
902	48
214	38
302	38
90	18
80	24
160	24
110	30
394	38
506	52
86	18
168	40
192	28
170	22
342	46
196	34
750	56
236	40
180	28
58	26
86	30
54	30
102	28
132	28
192	32
250	34
234	28
322	42
72	32
152	24
104	16
542	54
64	32
78	30
214	32
1686	90
286	42
144	24
1526	90
68	24
766	64
750	66
418	58
462	46
524	38
712	56
338	42
164	40
288	40
19	7
136	22
394	50
156	28
168	36
508	46
448	46
338	42
344	44
92	28
410	42
296	48
230	42
636	52
148	28
590	52
172	36
351	46
112	28
260	34
342	40
368	28
210	34
500	44
304	44
280	40
386	50
76	24
180	32
410	42
146	34
126	34
286	40
106	30
266	24
208	48
184	36
436	56
300	46
126	26
186	36
124	32
434	46
146	30
114	30
366	42
366	46
118	30
58	18
188	36
948	56
244	32
214	42
94	42
42	26
506	46
424	42
332	40
316	40
654	38
380	48
1010	72
934	74
128	32
620	60
226	34
252	32
552	56
286	34
352	50
138	30
116	32
280	44
19	7
164	28
1708	84
290	34
664	52
48	22
110	30
486	38
1074	78
826	50
812	44
410	38
596	56
726	58
724	52
348	40
132	32
96	28
392	44
290	46
304	32
106	30
208	28
204	36
368	36
940	68
124	28
360	40
320	48
212	40
296	40
516	46
426	38
338	44
200	32
262	36
252	44
1326	62
258	38
60	24
786	54
1104	60
124	28
478	42
64	20
192	36
262	34
80	28
478	54
470	58
326	50
924	58
180	28
342	38
70	22
188	44
340	46
82	22
210	26
338	46
212	28
76	20
422	46
108	28
218	38
204	34
228	48
1090	74
802	48
490	48
266	38
216	36
544	64
142	30
552	40
166	42
124	24
670	44
288	32
204	40
208	36
1696	72
102	26
428	48
152	32
232	36
144	28
306	34
190	28
810	72
192	44
144	28
926	58
118	34
170	34
378	40
326	42
464	44
358	46
124	16
622	58
812	56
160	28
170	38
626	66
306	42
174	38
414	42
378	46
246	42
262	38
280	40
710	68
160	36
458	50
524	44
2054	106
162	34
136	36
368	44
126	20
240	36
120	28
32	16
262	36
750	54
156	44
82	26
36	28
86	30
176	36
114	22
88	32
1906	74
250	38
150	32
19	7
1028	66
594	58
418	46
816	66
134	32
80	24
48	16
374	46
700	60
208	26
282	34
278	28
668	54
168	34
524	44
80	24
166	30
372	40
308	46
248	44
240	36
76	28
320	48
250	36
430	48
824	52
416	48
170	30
174	34
110	30
86	26
1108	82
346	42
123	30
234	38
176	52
198	38
726	56
378	46
210	50
94	34
644	44
318	42
110	26
158	22
372	48
630	50
553	43
92	20
620	68
348	44
236	60
172	44
112	36
1120	64
520	42
22	14
278	46
108	32
50	26
208	32
218	38
246	32
242	34
230	38
186	38
1030	66
136	36
634	60
826	54
306	40
344	32
142	22
102	18
374	46
192	36
118	26
338	34
146	30
230	38
112	36
324	44
182	42
124	28
166	34
176	40
260	36
264	32
198	34
424	48
470	46
256	40
296	36
252	28
154	30
106	26
306	38
106	26
154	42
84	32
386	46
480	40
284	44
220	28
304	36
306	34
242	38
466	52
70	30
1998	94
662	52
212	36
188	32
762	68
150	32
192	40
260	36
86	18
36	28
238	42
82	30
426	46
122	22
68	20
98	26
26	26
394	46
442	48
122	30
602	66
526	58
182	30
130	26
102	22
640	44
282	42
776	58
846	58
274	42
240	44
34	14
352	44
140	28
328	40
1812	84
192	32
822	62
1194	54
110	22
1840	88
140	36
178	26
256	28
412	46
64	24
910	76
240	40
196	32
230	34
1328	76
970	76
826	50
290	42
410	44
76	28
224	38
278	34
54	30
140	32
176	34
122	22
254	34
158	34
3448	100
140	28
280	32
258	38
262	38
334	36
144	24
104	28
714	54
84	28
172	32
508	52
312	38
240	40
394	46
342	44
542	42
362	46
780	60
170	34
650	58
484	56
278	38
208	28
486	52
174	30
1150	70
236	28
290	42
162	34
220	40
174	38
56	28
188	40
214	34
58	14
82	30
211	31
138	26
390	50
398	54
162	24
184	36
168	32
306	38
82	30
200	40
1150	70
158	22
354	48
392	52
162	26
264	40
338	46
126	26
212	44
278	42
322	42
258	38
86	22
368	48
138	22
494	50
136	36
308	48
850	66
598	50
274	42
306	38
802	60
340	44
226	38
1176	76
160	24
300	44
570	38
222	40
480	56
460	44
202	26
134	22
182	34
96	44
2120	100
454	52
116	36
264	32
140	24
234	46
168	36
132	32
592	44
532	56
56	24
246	46
542	56
676	60
124	28
268	36
110	34
212	32
348	44
196	48
112	44
340	40
1826	74
354	46
286	34
234	34
516	44
724	68
462	52
796	52
372	54
188	28
224	40
342	46
414	48
164	28
444	44
56	16
318	38
124	28
732	56
530	52
182	30
284	32
318	46
594	54
114	30
1388	78
626	58
814	50
268	40
114	38
328	44
114	26
656	56
900	60
94	34
1300	88
224	44
38	14
840	64
260	40
158	30
892	64
290	42
174	42
118	26
19	7
340	40
170	34
142	20
312	40
482	34
114	26
158	26
62	26
332	40
260	40
474	48
374	42
832	56
642	58
468	46
712	56
206	30
1332	72
184	32
522	50
340	52
452	44
116	24
76	24
96	24
638	46
274	46
262	46
150	38
288	40
664	48
184	28
254	42
388	52
692	60
146	30
234	30
418	46
264	44
214	38
226	38
236	32
46	30
296	32
306	50
544	48
194	34
174	38
1332	72
272	52
730	54
308	28
910	58
70	26
134	26
188	24
298	40
760	56
504	44
202	34
222	34
148	32
216	36
90	22
108	28
86	22
682	58
178	30
408	48
206	26
196	28
152	30
458	46
966	62
278	46
274	34
184	24
114	34
200	36
114	22
374	42
316	44
94	22
700	70
60	24
110	28
578	54
76	16
168	32
19	7
396	44
616	56
286	38
54	30
514	50
960	64
718	44
116	32
278	38
2026	94
60	20
352	56
308	44
78	18
1440	66
548	50
210	34
30	14
266	38
280	32
580	50
238	38
330	42
228	36
680	58
436	36
716	56
86	26
740	68
284	32
348	56
714	54
340	36
19	7
732	62
456	52
74	38
164	44
1018	62
208	28
214	30
468	48
254	38
138	34
198	42
54	26
196	32
624	48
280	44
86	22
628	64
86	30
76	16
54	30
660	56
992	70
451	42
62	38
210	34
156	32
178	34
734	58
134	30
394	38
188	32
172	32
452	48
1768	90
234	42
400	48
308	40
736	50
150	26
100	28
1246	62
108	24
244	36
304	42
132	36
264	40
254	30
188	44
30	14
782	62
220	32
1278	58
306	46
546	50
262	46
698	58
348	36
82	18
492	52
550	46
446	50
478	48
94	26
376	42
246	28
690	66
364	52
452	32
412	44
256	34
318	42
184	48
402	46
182	30
124	24
258	34
202	30
88	28
142	38
276	48
148	38
102	34
114	22
24	24
192	28
336	38
104	30
324	38
188	32
286	36
772	64
720	54
136	32
150	26
242	46
154	34
310	30
344	44
264	32
19	7
124	36
1066	72
270	34
109	19
168	36
92	28
414	42
200	36
136	32
556	54
102	30
378	46
818	58
204	32
568	52
1697	76
156	32
396	36
242	32
374	36
1182	74
166	30
218	42
332	36
174	34
372	52
316	40
414	50
96	28
284	56
268	32
112	36
440	56
886	58
198	26
488	54
162	46
914	66
234	26
198	42
154	30
222	38
612	60
758	46
416	36
250	46
120	28
196	36
282	46
226	42
80	32
276	44
46	18
92	28
216	36
96	24
716	60
1358	74
326	30
556	62
104	36
200	28
270	38
186	30
148	26
258	34
176	32
330	38
156	24
262	34
524	44
74	26
22	14
456	40
614	66
340	36
1296	80
466	50
278	34
1028	70
140	32
242	30
134	26
1070	60
96	28
480	52
144	28
78	18
250	42
56	20
402	42
224	32
84	24
370	44
486	60
68	24
106	22
448	52
82	30
182	30
236	32
186	38
984	66
72	32
136	24
260	36
70	18
158	26
222	34
252	36
738	52
244	40
156	28
22	14
46	34
132	40
394	44
242	38
1092	56
194	38
1546	74
50	26
206	36
1184	62
44	28
130	34
1044	58
116	18
376	36
574	52
154	26
200	28
542	58
252	36
712	68
648	56
1210	72
440	40
360	30
388	38
38	14
124	32
224	36
43	11
44	24
710	58
100	28
262	42
266	22
228	36
208	36
190	26
522	46
688	48
572	52
186	30
464	48
140	28
60	36
234	30
446	54
348	46
330	38
414	38
74	26
216	32
208	44
844	64
212	32
142	30
432	44
280	44
42	22
654	58
306	42
1024	64
126	26
194	42
122	30
358	40
44	16
588	40
164	32
496	56
160	40
356	48
380	44
328	40
1100	72
258	34
182	30
124	32
290	40
656	50
404	36
82	34
108	28
864	56
186	34
202	34
248	32
148	28
234	38
410	46
584	64
424	44
406	46
264	32
246	30
266	34
272	40
190	48
260	42
560	50
310	38
626	46
190	38
222	30
758	56
62	26
54	26
348	36
42	30
208	36
622	62
466	50
96	32
500	38
630	52
78	18
76	28
244	38
284	40
1622	76
188	36
560	50
250	30
1490	74
244	52
324	40
574	50
70	26
206	30
102	26
375	52
478	44
568	52
210	30
804	60
714	64
94	26
238	38
310	50
1054	66
442	58
88	32
92	28
684	64
523	47
262	50
198	34
238	38
320	38
1226	68
290	46
446	46
106	26
224	36
96	36
108	28
386	50
604	64
90	26
352	48
190	34
114	34
450	54
254	34
282	38
230	50
218	38
110	26
282	46
254	34
176	36
130	30
210	38
62	14
438	48
118	34
314	46
1842	84
288	40
446	50
114	22
690	58
320	36
90	30
258	46
370	44
402	44
210	34
120	32
122	22
484	50
452	40
124	26
284	34
170	34
494	42
186	26
320	40
404	32
290	34
138	50
114	30
146	28
114	30
314	38
94	30
228	36
168	40
314	38
108	32
116	22
502	46
290	46
704	56
556	56
600	48
72	32
308	36
594	50
398	54
50	18
262	34
470	50
206	42
608	40
404	52
98	30
924	72
384	48
404	40
156	24
232	44
222	30
188	32
202	30
96	32
128	28
134	42
834	72
232	36
304	40
444	36
216	36
664	48
284	40
250	38
384	44
128	28
136	28
202	34
532	52
150	34
934	48
388	46
308	40
558	54
228	32
210	38
82	30
432	40
656	56
336	40
284	36
114	18
638	58
248	44
86	34
248	44
812	54
216	28
226	42
524	48
526	44
148	30
74	16
146	26
294	38
220	32
332	40
910	62
190	26
632	64
746	64
246	46
324	44
180	36
386	42
290	42
336	44
128	32
146	34
256	32
268	44
182	34
180	32
102	26
208	26
120	32
292	48
222	30
1860	88
198	30
270	38
248	36
232	44
544	54
398	46
184	40
180	36
230	30
510	52
740	50
432	50
1102	66
168	34
272	36
216	32
488	52
260	36
196	42
166	30
90	26
110	24
86	30
50	18
100	32
404	42
526	34
144	24
250	36
206	38
60	24
228	32
140	36
482	50
966	62
866	66
188	36
120	40
186	34
136	24
250	30
90	38
64	20
270	50
118	46
492	48
440	46
394	54
458	50
54	26
72	24
40	28
434	48
246	32
56	24
216	32
60	16
1242	62
258	38
320	44
286	36
196	28
78	30
150	26
184	30
234	42
396	40
396	40
888	68
266	42
454	46
500	36
288	32
172	32
446	42
532	48
1118	62
208	36
2578	94
78	30
114	34
218	38
148	32
530	50
384	52
222	30
478	56
1284	74
554	52
138	30
204	36
564	44
502	40
278	46
62	26
242	34
110	30
192	42
232	34
142	30
318	50
326	50
708	48
128	24
442	46
636	54
878	62
124	28
486	50
170	26
202	34
116	32
446	42
134	30
246	46
224	38
212	36
96	26
322	38
124	24
560	44
538	64
412	44
282	38
280	36
764	52
56	16
976	68
192	30
194	34
212	34
70	26
190	30
240	40
152	36
634	54
116	24
306	34
56	32
192	32
1984	102
696	44
190	30
378	46
138	22
66	30
510	58
748	60
70	22
162	22
222	38
204	38
200	36
514	42
234	36
208	44
186	38
332	36
192	40
454	58
458	52
304	36
172	28
2340	104
858	64
878	72
204	22
582	46
262	38
82	30
200	28
408	40
206	30
386	46
198	34
136	36
148	32
1842	92
292	40
442	46
214	32
406	54
690	54
304	38
310	38
692	44
400	36
276	36
1352	92
160	44
42	30
448	42
752	56
332	40
732	56
302	36
156	36
316	36
304	36
182	34
134	24
486	46
106	30
210	40
156	40
120	28
212	28
504	38
