Score	Length
3848	144
19170	326
499651	1330
262902	1044
19	7
194951	852
87734	620
642191	1438
99216	662
423948	1208
82047	638
15790	300
365560	1128
127290	696
39796	432
59248	572
24030	390
1151969	1762
589095	1284
79598	610
549347	1346
375719	1126
39542	424
25336	416
336898	1052
49946	508
9402	294
304763	1044
2176086	2278
406533	1094
57194	568
181330	872
382898	1080
5167224	3321
130788	636
36304	416
31702	396
41328	470
96706	714
1787071	2174
429228	1227
196814	918
2009254	2210
1886934	2133
73320	604
69785	626
206632	912
389634	1100
70098	568
295685	1052
181639	884
165159	824
30398	448
23578	360
241414	908
37502	456
18754	368
61504	562
25774	394
39490	432
979172	1757
40412	462
185656	772
385052	1190
26720	414
378845	1128
1206933	1790
2766387	2592
115343	704
48012	484
172354	882
7566017	4004
1116850	1699
26730	426
70104	554
127056	764
376914	1146
273632	946
25156	400
2074216	2350
707833	1433
75541	616
119438	724
1036744	1665
352581	1130
26276	388
84189	624
86792	642
151089	800
39958	400
14596	280
872997	1589
19518	316
164708	822
240043	970
117360	680
223692	884
645089	1352
74202	590
192469	872
806189	1516
626794	1416
351360	1090
19	7
354508	1144
16358	300
198642	810
205635	880
743932	1468
242399	1010
54476	528
99602	746
210010	898
248260	938
184440	876
218692	970
195910	864
232392	984
101018	672
137357	764
1272756	1870
23666	388
26666	394
17538	332
153468	762
152588	802
333979	1050
169659	762
59560	588
24136	378
84464	580
237569	914
485936	1234
1614580	2088
236272	968
32064	442
80988	584
96700	676
141472	780
33427	410
57785	560
386946	1194
32972	464
474515	1242
98900	666
198633	870
615701	1378
151873	784
2070700	2308
47070	460
20094	360
147939	796
77544	562
35962	478
101212	676
411590	1206
279211	1022
863784	1588
265818	1020
132436	784
141704	822
30116	416
189197	850
78100	576
737818	1534
262121	1028
22846	384
62590	574
74954	602
213871	925
122600	726
151884	812
694750	1398
691714	1504
208108	946
223296	944
27479	392
131214	726
94722	658
120484	704
331689	1058
136484	768
1955417	2182
102448	674
70221	676
627006	1368
463347	1288
20410	332
43294	510
54238	518
7980	236
27762	360
2828364	2565
227705	972
84647	636
349577	1096
504733	1326
92338	628
93084	706
172450	866
97375	732
18120	346
169102	816
64304	578
16734	320
263171	1038
202115	874
209222	1008
15049	274
11252	262
28098	422
1074632	1730
41804	474
143908	788
43748	562
250032	922
67074	528
280179	1014
79241	650
17312	336
305526	1042
52948	522
84410	658
8556	240
123190	784
204062	866
56312	532
67246	558
56108	520
1141356	1754
380126	1092
198206	868
45832	542
1089175	1725
94594	700
93942	660
392496	1124
31492	438
128688	742
202251	856
77290	578
87582	596
158434	840
35906	466
38854	480
20610	432
138222	828
102729	638
11686	284
66828	554
40528	478
26422	360
209075	900
1200610	1788
177030	794
186024	930
147328	748
68246	572
82555	640
43566	456
47628	482
257688	1028
38930	508
37774	458
416088	1132
241270	962
298564	984
135002	774
37616	476
1230189	1918
64992	544
27646	380
69022	578
4052316	3025
281648	1010
423424	1210
14652	290
50141	466
286817	1040
764376	1442
158309	810
67854	558
225516	922
223233	968
50644	512
52876	518
58430	564
177383	850
61734	594
69209	530
4132192	3036
14998	298
535686	1290
324360	1082
337751	1130
55442	514
110881	730
302597	1150
1550411	1948
52274	492
480503	1264
53910	516
449609	1226
69314	606
25982	382
67556	608
82032	652
1602982	1923
357695	1096
92397	640
108419	650
137374	810
560087	1256
11958	326
457039	1298
168776	802
2425393	2303
109906	694
20552	320
94465	716
580209	1311
56560	482
252921	1008
111946	662
43182	458
203282	968
10914	292
186148	814
21830	388
166921	782
130891	698
101080	634
100596	708
118438	694
225859	950
348780	1044
1262568	1803
41188	486
178654	848
105708	668
92518	626
168960	832
26262	398
63576	530
393204	1134
92488	694
80605	642
24882	374
40220	436
355148	1080
103108	586
179898	834
233957	914
149934	776
66026	568
137475	758
146078	810
113638	724
1157753	1811
533020	1310
1785841	2120
36854	430
36150	440
263621	1042
71050	704
51720	492
107072	678
19944	372
29694	412
52107	532
32458	424
417355	1099
266105	1030
1316749	1876
266715	1002
308786	990
22208	398
148946	826
66013	618
239100	952
160924	852
706741	1485
50142	542
1610540	2079
1736058	1975
15854	304
144054	750
53154	462
135423	778
409434	1152
75960	650
107649	652
959567	1664
31450	382
661307	1498
1697286	2042
138564	704
144435	738
494182	1200
242964	876
24522	340
309679	1086
71391	546
18656	368
73795	620
426093	1248
108494	668
710560	1466
112890	748
828077	1622
1993416	2232
1743719	2090
184598	910
65394	540
141071	714
86672	654
25184	426
108865	680
12976	292
63510	522
18844	362
614327	1380
58480	630
1110354	1804
40216	470
1071563	1746
47798	462
238852	1034
155652	784
190569	900
406599	1158
40495	462
1199325	1790
849529	1546
209427	906
241123	928
67436	604
25938	380
56328	544
42172	502
101829	684
43978	482
314628	1090
40710	450
149582	762
459765	1228
19010	328
276892	1078
98608	678
1144022	1716
106445	706
252444	1030
824268	1478
24068	406
49504	464
377874	1128
65794	572
179831	812
3223845	2665
2840309	2580
88184	672
33270	448
699834	1480
77344	580
473245	1253
1093649	1752
187130	910
154812	764
1283179	1809
31016	396
1423215	1948
9440	272
95601	656
105644	698
207041	866
3344	120
115506	756
314320	1054
183860	812
32398	382
395321	1154
337494	1096
238362	950
43364	484
154546	794
28824	420
13274	326
654292	1418
357170	1140
155890	862
246064	918
66705	562
187822	832
61760	618
85474	668
58680	524
209329	842
240173	970
47450	540
182631	844
122606	724
1193851	1826
50218	562
254823	1004
348780	1088
86294	606
121649	774
17596	324
471727	1170
66482	528
51754	516
3766994	2910
40833	474
19564	274
192611	828
51160	492
390121	1129
13316	302
102224	658
17852	344
83342	650
289218	1068
121064	754
37622	444
5240	192
220366	908
160060	812
3734	174
89733	592
28436	386
141020	780
142938	738
803143	1560
454213	1152
372117	1192
238302	934
191929	880
16384	308
108630	668
431993	1250
404834	1186
1893077	2207
874722	1586
86798	630
139109	768
264442	894
1688601	2079
373922	1140
56790	494
137818	760
36842	478
161207	832
27048	356
561082	1360
37306	424
11934	234
304342	1010
312582	1120
100379	710
188627	868
24476	436
460059	1160
90022	562
29288	428
41900	480
133255	752
41684	460
24656	394
316011	1060
183184	898
1341254	1861
104262	614
53630	482
83828	644
13478	272
301968	1024
191778	860
2811842	2592
197543	850
2057544	2290
52308	502
66828	518
233288	960
635533	1448
906139	1656
143370	804
37270	438
32284	422
16700	356
770610	1569
80430	592
222568	972
22216	348
18824	320
129403	804
34748	404
26256	392
221925	896
63583	576
120969	674
164134	802
105978	712
386426	1086
152456	786
878812	1552
301600	1066
277501	930
621729	1360
201432	838
651085	1364
719006	1510
428914	1200
565336	1328
101820	646
1313741	1944
136425	784
346231	1186
211737	808
26660	390
1200416	1764
215746	924
349503	1050
345367	1136
30271	492
506620	1249
40628	440
121734	660
269600	994
23054	366
83034	606
31692	394
64590	568
9066	214
72791	568
99928	694
237853	990
503713	1290
2425148	2422
550491	1320
21148	360
460338	1234
116478	788
18602	382
68964	600
55094	534
104794	732
81492	616
60854	572
67096	562
51086	518
116143	682
163229	780
275806	1006
19	7
56620	502
280586	1012
69812	546
387189	1122
252377	922
135464	714
13032	284
17754	350
237196	924
455067	1282
26290	328
83542	582
23030	400
322444	1090
181442	812
56822	520
13000	286
39787	504
113078	748
245299	932
34782	444
96010	716
52612	498
24624	400
135040	758
116255	656
113983	692
12266	266
543252	1278
771661	1470
68895	580
97578	724
40462	432
3604179	2898
109272	722
135170	760
59938	524
346918	1108
493460	1228
1605568	2072
101064	726
430165	1154
185406	826
33482	408
206836	944
98104	670
32214	436
1258232	1880
19256	384
87044	620
211639	918
122846	704
75380	588
117124	736
67886	568
3866297	2972
64158	582
67410	606
1319278	1818
55274	588
268961	1058
99304	662
69116	554
177762	776
256250	962
28066	378
7118	248
179680	898
4506251	3209
29954	408
66808	614
616593	1472
31362	416
991334	1770
197764	858
821962	1572
23508	348
57164	544
13516	302
147167	784
610693	1404
156094	714
195722	972
74718	632
164301	856
79792	612
17856	324
597844	1358
137908	728
58254	568
290761	1004
79897	642
5072091	3301
64114	552
1187536	1862
148839	780
6969399	3854
23900	378
78678	624
15956	300
32532	464
353026	1094
334400	1032
185989	874
1104517	1848
699400	1434
110028	724
172152	856
70636	628
261061	996
352445	1060
43874	444
179167	838
69226	556
7066	252
63640	564
472262	1196
153719	804
152424	790
420313	1200
49870	570
157190	760
617962	1398
317950	1042
48474	488
32224	412
118109	782
63986	572
350037	1064
495699	1336
261053	976
265994	1044
115872	744
2462617	2392
78852	626
294909	1040
2175450	2340
450872	1206
254856	950
82592	598
114968	692
163839	872
706147	1404
265941	970
413216	1236
1852542	2151
646480	1414
21141	388
1300349	1833
103608	674
260704	968
457278	1216
147404	758
76202	582
779396	1548
174850	806
102388	714
16164	338
373236	1148
66636	610
114198	708
21152	358
36434	372
89984	624
280348	1004
120452	766
107384	684
1411905	1999
1103598	1753
114317	690
513082	1268
2523898	2426
293531	1032
1438420	1873
282826	998
35292	468
74531	646
400097	1114
1278632	1944
1245647	1837
118760	740
519174	1330
48514	528
195876	912
60254	518
62662	574
1610088	2044
271676	1002
19	7
2303298	2432
71414	568
62410	566
212216	922
125502	786
230516	882
109548	718
101822	684
137498	710
284277	1018
2033482	2362
272388	1032
186094	836
97441	654
460370	1284
1079455	1739
31386	418
2062286	2284
631828	1298
17472	346
100170	684
59387	592
82424	600
2438620	2331
135714	766
776066	1556
60269	524
51412	574
221088	864
305789	1094
2480493	2424
37200	484
40046	494
48716	514
5345885	3357
371772	1182
69422	574
76368	632
178784	898
353686	1084
233092	894
308809	1090
219891	918
29576	414
193844	858
196241	904
540283	1330
357418	1168
132518	796
772337	1542
83048	664
116222	790
743502	1534
36790	430
234993	936
52524	508
153389	840
6406526	3549
64340	544
115722	788
40925	428
598238	1418
8982	208
153005	752
8716149	4247
23616	354
19230	320
403677	1178
2573757	2422
31164	400
420744	1262
51765	472
246170	942
208693	888
91665	660
43961	504
20732	346
512993	1314
58774	542
158570	870
94124	660
176568	826
58220	544
742493	1442
228520	894
40730	448
12466	274
472263	1214
397278	1128
93982	676
18850	332
16114	332
147542	790
2073284	2280
576492	1310
38624	476
258354	926
46382	510
130652	780
83734	682
314894	962
692593	1394
279838	1086
137960	796
164752	792
876003	1569
218484	838
