Score	Length
744293	1767
4223711	3283
8153597	4570
5286284	3772
1997094	2560
176264	952
6395204	3897
2728522	2749
1893620	2405
4455156	3590
18744395	6305
15014504	5781
5847154	3791
2304836	2503
49490194	9964
18251979	6411
4065470	3388
2804731	2946
1835096	2411
3417029	3136
2618716	2801
12306729	5189
893526	1890
4087727	3263
5513149	3635
2670561	2703
299446	1100
6436654	3923
2522031	2741
2445484	2716
5089523	3637
13062184	5726
3649914	3035
5660435	3561
9351245	4785
8373160	4558
10679688	5098
5831799	3956
6689292	4038
3347888	2961
938828	1732
7069122	4242
872722	1850
13320769	5644
193184	966
6548029	4224
1020766	1908
4812608	3584
577904	1420
1616129	2167
4829420	3745
598160	1554
4616311	3403
7472548	4149
7196349	4204
3462923	3093
10448919	5020
9706398	4603
1743923	2323
1563516	2289
3570989	3101
4253788	3207
2875419	2964
5044933	3648
2000012	2557
12178172	5302
7776633	4404
4485740	3512
9900233	4925
1889727	2279
1830159	2502
46548	506
17694005	6115
1291168	2230
29522164	7609
7203584	4195
8290272	4289
2194144	2533
4050565	3251
3964711	3348
4123521	3291
140860	850
10786115	5214
2645320	2771
733477	1711
1785312	2317
16754423	6182
5196793	3641
2614655	2717
6169531	3896
11520578	5227
6090234	3970
8532294	4566
3209746	3053
18163478	6175
614975	1547
17437620	5959
1595872	2330
949629	1843
3060856	2918
1237663	2118
10834933	4927
4263818	3394
19	7
2029010	2526
