Score	Length
42224	484
267388	1082
160552	846
89694	634
80577	578
1551695	2016
93154	670
113774	708
323981	1124
138028	744
229654	928
913436	1610
71946	544
110490	704
649594	1361
253086	916
191468	834
1648749	2060
436449	1140
41342	470
730186	1536
103216	752
146119	788
85648	634
622730	1436
36626	438
70565	602
148088	786
22680	384
2251935	2243
224786	948
293799	1048
112615	648
93322	658
87516	638
47676	456
47752	520
11570	252
179500	782
76100	664
137936	766
485121	1252
192532	962
172080	848
115542	712
8643	228
179322	836
148232	834
55456	510
297835	1094
1599587	1947
108146	720
16004	304
144854	814
14938	324
128443	782
1553112	1927
57916	564
45240	462
433225	1260
3043809	2625
115356	716
77680	610
499965	1242
131694	752
1081616	1654
134398	764
639220	1420
345068	1104
1106658	1773
88072	626
121108	712
108265	716
57606	494
330755	1092
236633	908
361909	1064
398051	1116
72148	656
339944	1128
223827	924
26148	366
1118764	1705
59664	578
324463	1104
7402	240
266799	1124
525225	1384
530340	1274
20248	314
194614	904
69498	550
1672558	2062
191979	922
86784	600
1329679	1858
98626	652
2356928	2390
2330336	2319
241142	984
69705	624
45466	458
410733	1090
45194	510
145856	752
687881	1424
35038	420
163608	846
965503	1662
385047	1182
2761858	2630
1513083	2008
1529809	1960
530289	1238
247726	928
767776	1526
34541	470
260724	1070
881792	1668
42540	430
93920	614
149768	752
387598	1124
201902	872
60514	550
805522	1561
279730	1026
36376	402
43432	468
53824	506
41572	470
3710344	2881
24333	374
103300	650
84946	618
19	7
19288	320
270437	950
2413127	2398
179685	868
45552	536
39698	462
126674	696
92073	692
35320	476
1304924	1910
131458	684
98620	702
65256	622
55158	538
149348	712
677382	1466
68860	540
40694	474
578624	1342
556805	1328
115248	748
111144	744
673803	1434
477875	1202
127484	782
34258	460
22696	342
29990	424
131036	734
1399207	1950
124072	784
203232	880
73726	594
118628	676
172134	830
159664	822
12954	254
18822	352
1526304	2014
4085921	3044
507027	1256
33444	444
1024376	1704
65874	538
154503	852
202276	868
5530146	3493
36048	428
108564	658
104610	694
43908	438
17214	310
214244	894
900779	1558
61120	596
23322	316
282439	978
46450	536
226637	986
511604	1320
115652	730
37969	442
651429	1422
559751	1266
29044	440
1201043	1748
11322	256
358729	1166
318286	1050
2398994	2390
1103081	1822
190795	892
117670	724
107294	748
181250	748
55331	548
119800	734
22306	354
249582	1006
123164	704
181763	872
190958	932
511486	1230
693574	1430
127490	744
241611	944
228772	898
163494	762
343802	1044
358041	1120
425315	1188
362194	1128
45997	532
103488	740
244447	984
33582	400
746476	1460
1100095	1656
227994	960
578663	1306
38940	484
46458	464
59986	476
9792	274
42520	490
84004	688
1121031	1689
546212	1294
124997	684
30516	418
58780	602
151662	796
36570	444
157526	774
176966	768
546670	1306
720333	1454
293297	1038
182518	834
183571	898
153076	908
50294	488
337198	1070
293527	1048
376730	1090
55578	556
42390	502
68242	598
71202	580
354763	1048
117248	732
213216	942
116856	714
182442	842
1106781	1774
367296	1242
175590	836
165509	890
212958	894
65277	528
378261	1098
146898	822
24786	400
108568	690
157463	798
311705	1072
72630	592
197384	920
96958	710
41313	488
558123	1332
101190	662
82771	598
363248	1086
98946	646
132931	780
14886	304
57798	570
1031786	1768
125960	698
266230	962
151316	774
156975	774
29206	352
187492	858
773220	1526
69786	576
59328	498
479223	1158
46106	482
457976	1236
4011456	2992
1195395	1820
68559	572
193189	850
1668047	2066
13383	260
74468	658
3282660	2792
604440	1480
253500	900
38734	462
20924	366
802795	1370
298442	1030
48928	452
337272	1190
2070168	2210
111384	686
296592	1044
834811	1576
573561	1376
452520	1274
93939	670
114454	680
696634	1446
231198	944
72280	602
23006	392
98868	652
199148	904
22584	342
78860	630
208849	970
132296	790
668360	1386
2631053	2520
634383	1316
56339	522
46014	484
98482	708
126702	742
111348	646
151652	770
15841	320
132148	806
462276	1248
138101	764
44348	460
122874	860
69797	594
58246	522
781934	1506
17960	362
125702	706
143721	780
72895	530
185078	902
464979	1296
104780	720
544616	1382
381963	1134
154932	822
544862	1332
156471	874
2723187	2497
1184215	1765
67210	552
101702	696
106288	692
72006	512
144524	848
19	7
269603	1046
28354	406
220640	870
91462	640
629654	1386
121000	758
63578	578
195138	886
268470	986
35679	460
47630	514
174208	788
888850	1589
80320	616
409899	1210
153077	834
63062	516
83500	570
129187	738
892231	1590
63732	578
133613	726
24263	364
70268	622
1975535	2244
27796	404
141752	826
1952920	2169
212036	836
17364	302
380094	1198
480268	1250
466375	1216
452983	1240
336039	1086
224862	944
100970	628
67112	564
135372	676
22850	364
15452	302
972789	1750
79238	642
170824	810
75845	594
2284153	2376
89382	622
103188	646
67522	554
49874	494
87840	676
334505	1110
19	7
161558	846
23752	356
145330	762
271532	966
19536	314
329835	1120
179826	826
3817903	3030
423185	1178
132664	722
165898	836
199694	886
193044	892
414207	1166
154911	810
653663	1436
111198	732
36872	440
92640	656
8828282	4218
284170	1042
15058	298
265207	1024
32658	390
68040	514
158432	810
648548	1444
363180	1076
187981	960
230927	1014
37146	476
292756	1068
72824	614
683482	1470
97812	672
4113789	2905
45708	520
66514	536
82872	606
317242	1080
695784	1436
34130	420
1587337	2074
56636	480
366576	1110
85135	632
189196	870
82796	576
85406	618
1939808	2226
36712	454
547690	1280
251872	868
576445	1350
95162	660
85542	660
661333	1484
1325507	1864
89060	636
82850	668
152302	734
220749	922
99954	708
259067	878
90320	664
1094617	1824
91150	656
28206	420
809898	1600
32176	428
125498	714
277095	1028
108714	662
28500	482
134585	740
15218	326
19	7
12644	310
13716	316
96372	634
42162	488
108695	730
189438	836
77758	646
148250	746
256215	976
41184	432
44514	492
158004	800
23534	456
339213	1162
332504	1092
76604	658
96588	690
336543	1032
58835	534
233950	938
2222355	2348
94793	672
115059	676
1552041	2054
27816	408
103032	664
335870	1096
25442	358
140848	838
316906	1112
73542	594
45128	452
548152	1280
38000	416
13408	326
2943687	2553
182789	782
24776	342
121018	776
539463	1279
112328	736
412872	1222
23108	390
15358	292
568608	1253
128886	736
18892	340
121386	788
911266	1507
2151730	2278
110578	698
2815324	2603
113198	638
479383	1334
91806	672
202716	902
2152093	2283
560652	1326
539381	1349
221292	950
132474	768
59214	526
262134	974
107830	654
73919	664
11292	290
76930	604
541783	1300
629704	1394
725207	1395
81972	570
363342	1142
284853	966
289835	1098
54849	526
2314077	2378
406652	1140
586865	1335
262958	1012
27562	406
31542	428
2600393	2488
36488	472
16454	306
472141	1220
690189	1400
46348	496
235246	958
123452	746
51222	574
91778	640
154198	810
132755	794
28022	416
55271	494
87974	608
36650	420
1675532	2120
208934	882
50962	476
75350	642
81528	676
241542	896
340882	1120
6294060	3589
5310	206
712922	1434
36586	396
2715078	2566
134909	818
74788	582
121543	760
369102	1072
247182	964
507093	1302
105322	684
2785601	2495
25692	386
240113	892
128920	752
381100	1094
92180	634
85917	640
143308	844
35960	446
49090	508
66176	574
169590	830
33718	420
522902	1258
91064	634
81256	646
13994	260
127165	768
19152	374
43682	462
26782	384
663186	1480
154234	808
366283	1064
98974	654
189008	882
517409	1272
49004	550
1430959	1980
98436	642
183839	852
67082	530
172536	872
688054	1456
74824	520
27138	510
72542	596
125340	714
272859	992
957332	1598
14778	318
18088	364
135578	794
236017	932
148248	798
256723	902
51316	506
16922	312
39620	440
14040	332
25446	418
46546	508
218994	850
260962	1052
32306	402
68478	568
252423	948
11468	270
769592	1556
217537	856
39532	416
72462	604
108932	728
56226	528
72215	512
48241	460
1015559	1684
443556	1192
72696	660
1304529	1813
530920	1266
39257	440
147550	718
57880	540
332669	1052
99506	658
2654450	2500
72598	650
458359	1234
327062	1086
25206	362
8178	278
19700	340
924199	1570
79173	648
1561922	2004
7216	232
796752	1506
74506	590
74020	618
92568	648
21996	364
242647	932
48779	504
272415	1034
1605184	1883
39204	516
388000	1226
186668	906
25790	384
241723	910
986877	1673
172950	862
66644	530
458701	1183
39584	496
274696	962
954362	1680
179859	809
3819010	3082
26360	396
249810	978
67162	552
50108	558
23418	410
130798	822
613635	1306
28672	392
143888	816
11776	238
26842	384
255445	996
312302	1056
43406	478
753451	1506
147678	718
384162	1244
484013	1232
841834	1596
56592	536
24024	378
314794	1142
81633	582
109178	642
171834	840
131016	782
575041	1302
30300	422
86826	664
2495442	2442
151168	800
4298286	3122
160521	838
96818	676
120969	708
203203	870
63874	534
369170	1084
66706	624
367768	1186
144615	716
682079	1442
98152	646
110380	686
17022	294
51220	544
16294	286
313547	1046
3586822	2932
219447	932
272894	974
159298	768
46620	470
21750	322
365409	1106
64692	562
205375	916
41783	482
329593	1066
44866	518
601686	1332
76764	554
154919	794
300196	1046
157558	860
545621	1308
216755	870
262894	998
971919	1610
114160	760
17314	336
460584	1272
65452	514
314031	1072
382937	1104
34224	396
51950	538
13942	258
2476561	2427
28088	444
30244	432
294926	992
86016	590
88231	628
100946	660
40434	516
262333	1004
36504	430
25718	406
753707	1483
1507607	2072
28786	344
59192	580
4564435	3146
53208	520
133269	666
115784	686
519868	1296
99344	640
20492	408
1872974	2159
922798	1612
237052	904
484689	1242
1222815	1860
202100	868
117261	746
64694	566
695142	1446
56420	528
360121	1018
187686	858
50254	492
104106	746
23067	358
1555925	1980
311060	1006
279857	1034
239639	1010
47842	522
36938	478
85456	656
74182	576
53326	518
11118	250
85228	610
162177	820
343584	1042
175024	876
161695	754
1833514	2150
26294	482
27486	464
20410	324
229969	920
167930	808
508224	1208
42107	522
27726	358
56677	530
281984	1065
5039661	3259
107542	720
348915	1084
143975	844
804321	1434
154322	784
363899	1136
103580	710
301277	1030
18040	332
136799	714
762141	1516
101492	698
35918	454
125188	734
118432	716
140909	810
254717	962
429564	1150
38378	414
54337	522
38084	484
494884	1230
45790	504
152635	792
71365	532
20592	360
208190	948
244263	904
198106	964
3855857	3006
73442	570
83283	642
36276	410
838058	1530
154507	780
813970	1512
175784	888
135086	754
73796	572
30258	454
43550	484
85448	580
2151952	2349
27232	366
254784	1036
158168	876
5772	194
100694	654
23107	360
1354425	1840
55114	500
365130	1180
353258	1082
