Score	Length
35	15
131	21
251	19
67	35
299	31
61	21
1351	79
341	33
195	23
75	23
441	41
23	15
73	21
59	19
347	39
53	21
299	31
437	45
57	13
15	15
61	21
903	63
57	21
165	33
57	17
81	25
47	19
351	35
59	19
55	23
53	17
79	15
165	25
103	21
31	15
53	17
177	29
169	29
153	29
17	17
491	55
59	15
49	13
151	27
303	39
883	63
425	41
365	53
209	33
375	35
27	11
295	35
45	21
29	9
83	23
55	19
41	25
105	25
91	23
99	19
61	17
87	27
41	13
39	15
37	17
15	15
31	11
101	21
67	19
57	17
107	25
91	25
107	23
29	13
87	31
59	19
41	21
19	11
93	21
55	19
53	17
281	37
41	21
447	45
43	19
45	21
189	25
507	39
77	17
93	25
15	15
501	59
109	21
73	25
247	43
71	19
51	19
43	19
45	13
23	15
31	19
191	23
65	29
23	19
1071	75
91	23
59	23
19	15
27	19
147	23
343	35
385	33
33	21
73	25
47	15
119	27
49	13
157	33
65	25
201	21
143	23
189	29
339	35
55	23
69	21
67	19
407	35
257	25
255	43
175	27
443	31
403	39
81	21
33	17
137	33
91	19
305	33
55	19
47	23
59	23
519	31
71	23
259	27
397	41
155	35
75	19
61	21
29	21
175	35
201	21
43	27
97	21
271	31
119	35
279	35
33	9
67	23
233	29
159	27
79	19
29	9
47	27
231	35
27	15
329	29
67	23
93	17
25	17
301	41
135	27
273	45
359	43
149	21
59	15
145	25
25	17
27	15
295	25
343	39
327	47
31	15
785	65
187	39
25	17
129	29
269	33
127	19
239	31
49	21
69	25
15	15
1049	63
363	31
131	19
69	17
17	17
989	69
59	15
249	37
71	19
305	29
105	21
99	23
243	35
203	35
51	19
67	19
31	15
215	37
79	19
69	13
115	23
23	15
15	15
87	21
35	23
125	25
531	53
539	45
293	29
37	17
27	11
187	35
37	19
111	21
83	19
47	19
139	35
49	21
51	19
93	25
119	23
49	25
55	19
105	23
43	15
39	27
75	19
179	23
475	55
179	29
43	15
609	45
253	25
303	31
105	21
21	21
51	15
79	29
225	21
27	15
109	25
313	33
255	39
93	17
147	23
71	19
159	21
85	17
195	27
43	25
121	25
315	27
25	17
121	29
87	19
243	23
583	53
43	11
131	35
43	19
39	15
549	45
213	25
437	35
245	33
441	35
89	23
495	47
43	15
17	17
679	55
125	21
29	21
379	35
37	17
139	27
87	35
79	15
343	47
51	21
521	41
783	51
31	19
525	43
299	31
57	21
19	7
99	19
175	19
197	33
73	21
155	23
61	17
785	55
39	11
105	29
55	27
23	15
53	17
363	47
23	15
359	47
17	17
161	29
93	17
81	23
45	21
101	21
53	17
41	17
49	17
223	23
123	27
251	27
695	49
247	31
67	27
397	33
67	19
53	21
159	27
211	31
211	31
31	15
67	19
55	31
609	45
57	13
329	25
169	17
99	23
31	15
309	45
63	23
233	29
377	31
77	21
59	19
201	29
469	37
57	17
65	17
209	29
63	23
123	27
239	43
43	19
45	29
307	23
207	19
151	19
49	17
407	51
27	11
343	35
223	35
421	31
209	29
93	19
283	23
307	31
221	29
91	23
17	17
81	25
59	19
91	23
49	29
57	17
107	23
33	17
357	45
91	23
157	25
83	19
121	25
383	31
201	31
173	21
251	35
159	35
231	35
17	17
397	35
87	39
29	9
267	47
119	25
65	17
135	19
105	25
97	21
23	15
37	19
173	25
147	21
183	27
219	39
19	19
83	31
179	31
313	29
35	19
353	33
73	19
317	25
147	23
85	17
99	23
133	25
569	41
43	19
29	9
317	49
33	17
15	15
249	41
19	7
137	41
219	23
247	27
113	25
41	17
311	31
55	23
25	17
27	15
287	27
143	31
233	33
223	31
45	17
259	31
71	19
37	17
21	21
65	25
87	23
201	41
317	31
33	25
217	37
25	17
17	17
229	49
33	9
149	23
407	47
45	17
287	39
225	37
45	21
49	17
33	17
193	41
39	31
67	23
91	19
149	25
125	25
431	51
193	35
69	25
43	19
73	25
567	43
81	21
137	29
25	13
81	29
47	19
725	53
257	29
305	29
99	23
61	21
131	19
59	15
45	21
225	17
203	27
25	17
109	29
415	35
25	17
41	21
95	21
511	43
191	27
687	51
63	23
23	15
93	23
61	21
49	13
55	19
223	31
185	29
459	43
57	21
105	25
315	31
53	25
269	37
29	9
1141	67
47	19
91	23
201	33
347	37
57	21
99	23
327	35
431	35
83	23
31	15
195	35
65	29
43	15
71	19
563	39
141	33
439	55
69	21
275	25
141	33
45	21
185	29
23	15
173	33
17	17
29	13
219	31
245	27
45	21
135	27
25	17
33	21
29	15
81	21
29	9
1059	65
91	27
205	37
127	27
71	23
47	23
373	33
105	33
269	25
99	19
77	15
25	17
19	19
39	15
389	37
557	57
105	25
51	19
103	27
33	9
109	25
115	27
177	29
159	27
61	21
33	9
389	41
63	23
47	15
93	25
685	57
51	19
773	61
287	35
461	41
383	31
179	27
399	47
867	63
59	23
47	23
29	9
159	31
331	27
43	15
153	29
223	39
401	45
81	17
85	25
127	23
165	33
39	15
109	21
203	35
43	19
167	25
225	33
225	25
277	45
195	35
231	39
51	19
51	19
147	29
49	13
21	21
63	23
215	31
441	41
113	25
27	11
15	15
283	43
31	19
71	31
89	17
35	11
31	27
33	17
27	19
57	13
127	27
65	25
45	13
229	33
175	23
875	51
415	47
89	21
89	21
49	21
269	47
309	25
47	17
93	25
25	17
45	15
319	35
57	21
139	23
29	17
497	33
229	29
119	27
179	23
25	17
109	21
49	17
73	25
79	23
191	31
185	29
33	17
141	25
135	27
55	23
471	39
565	57
191	39
457	41
433	47
33	13
97	33
147	25
31	23
529	33
571	35
227	43
393	37
467	47
259	31
181	29
157	27
291	43
267	31
723	55
69	21
249	39
127	35
87	31
225	33
81	25
67	19
211	23
113	27
89	25
141	29
213	33
745	51
41	13
517	49
95	23
239	19
15	15
287	39
231	43
217	37
49	21
57	25
21	21
47	23
29	9
93	25
161	29
69	19
287	39
161	25
163	27
327	43
39	15
49	21
465	57
31	19
105	29
91	27
187	19
147	27
45	17
79	23
263	29
447	53
39	23
157	33
57	13
773	61
39	23
33	9
51	15
231	35
113	29
135	31
125	29
61	19
17	17
59	19
151	27
19	19
593	47
33	9
243	31
433	37
463	47
81	21
37	11
71	23
49	21
251	27
401	43
45	25
41	21
29	9
109	21
325	25
71	23
219	19
69	27
325	43
47	35
43	15
45	21
241	47
29	9
49	21
87	25
459	39
245	27
59	19
517	49
155	35
21	13
233	33
131	23
59	19
29	13
53	17
91	19
19	7
311	37
491	43
19	7
83	19
123	23
205	29
89	21
403	37
571	43
99	23
61	17
447	35
75	23
57	21
253	25
191	27
139	31
67	23
63	23
101	21
135	31
83	23
103	23
427	47
417	57
267	31
19	11
163	19
97	21
281	33
23	11
45	17
51	23
31	15
27	19
39	23
85	27
253	37
65	21
71	19
189	31
93	29
163	35
19	11
1563	95
31	15
409	49
137	23
187	39
29	17
179	23
207	27
29	9
235	23
107	27
443	35
185	17
277	35
69	13
71	23
17	17
29	21
63	23
245	41
467	35
293	33
37	17
549	49
119	27
307	31
51	15
69	25
29	21
943	63
73	21
323	41
43	19
957	61
55	17
197	17
183	25
39	11
273	33
255	41
31	19
57	17
225	29
93	17
25	17
537	53
37	17
29	17
47	23
175	27
175	23
249	29
33	17
65	17
67	27
145	21
169	29
309	33
29	21
29	21
457	49
33	17
327	47
345	25
21	21
119	31
273	37
123	27
37	13
185	33
221	27
31	15
197	25
67	15
167	35
95	23
103	23
349	29
47	15
145	25
129	21
197	29
177	33
141	25
29	21
93	25
57	17
93	21
401	41
343	51
573	57
215	39
145	21
35	19
349	37
65	27
61	21
87	23
17	17
251	27
17	17
201	33
329	29
61	21
71	23
29	9
355	55
111	23
239	37
83	31
229	25
97	33
389	23
141	21
147	25
69	29
69	17
65	17
83	23
221	45
263	27
391	39
39	15
331	43
75	23
139	27
53	17
29	9
763	71
29	17
203	31
65	17
101	25
707	55
65	25
111	21
25	17
147	23
47	15
87	23
413	47
2367	99
127	27
89	25
47	19
285	37
17	17
73	21
207	23
289	29
73	29
53	21
57	19
49	13
101	21
87	23
49	17
53	17
53	21
35	15
193	25
77	17
167	35
187	23
141	25
117	25
