Score	Length
168091	898
983923	1914
500256	1444
2573696	2742
3278472	3145
265677	1020
1738334	2334
646332	1642
1132634	2020
799537	1610
974760	1914
966179	1912
355021	1146
1268478	2044
997630	1846
146708	794
62674	564
821292	1770
360672	1352
622760	1412
672915	1716
912871	1844
2644144	2616
1838278	2338
774827	1572
659040	1416
3789986	3232
237444	1146
909582	1832
709692	1658
67618	606
4328698	3162
479076	1386
1416030	2226
188564	884
927692	1786
226652	1086
254394	1002
1066530	2072
633047	1556
473272	1364
593760	1554
1332560	2126
831246	1718
6932665	4162
2013896	2398
1413046	2062
894834	1860
379656	1330
1370035	2106
730658	1596
514851	1498
851207	1732
393424	1334
310635	1234
1064615	1846
397446	1278
198044	1066
1775432	2248
622257	1468
572046	1486
1809308	2380
342072	1096
695316	1422
951449	1916
739146	1754
1507217	2140
512292	1668
945418	1762
3110535	3063
1216812	2048
376086	1230
1037761	1886
4662773	3573
1074982	1804
288346	1162
755269	1640
2237659	2546
239130	1198
470974	1328
171958	920
19	7
758025	1640
1730451	2358
374938	1254
831487	1754
124818	842
427004	1400
7843368	4431
7606641	4364
513223	1502
101926	772
2507981	2874
3696864	3226
1305581	2060
1291374	2050
10196485	4860
497536	1542
297976	1136
29400682	7714
251498	1152
518420	1432
178518	984
23545074	7095
2169261	2518
838780	1738
955887	1770
510274	1370
1311493	2126
914764	1848
542251	1340
3522572	2912
872184	1904
605126	1594
194922	1052
4478115	3236
757862	1656
251854	1022
3212214	2990
748616	1536
614678	1556
581459	1564
407107	1376
817772	1720
3994974	3258
1495990	2130
188830	970
945759	1790
1759159	2260
519242	1532
179514	944
736693	1730
448806	1236
1386438	2092
897165	1736
487143	1484
1069603	1860
734830	1524
1285711	1948
398153	1202
2225784	2618
500540	1314
949102	1768
524274	1348
19	7
178708	912
62290	556
1253725	1966
513946	1376
40066	482
205654	898
5936246	4039
567474	1506
768727	1704
704332	1540
1409252	2210
168910	908
1604652	2204
956619	1866
249648	1132
1245934	2092
162160	978
458996	1340
1886021	2438
1000318	1778
9800150	4795
974293	1794
431963	1392
587414	1518
574310	1482
410852	1436
1331719	2074
706100	1694
1454645	2216
2018456	2374
2114991	2560
1606715	2200
129264	806
303033	1130
756418	1556
266218	1136
3627337	3252
726518	1644
496258	1558
684897	1562
1740890	2452
20669495	6414
235844	1168
623414	1632
321412	1220
242574	1046
224589	1148
153940	918
609460	1504
360452	1232
166692	942
516835	1448
372151	1236
1788644	2432
912989	1916
525452	1440
949131	1954
114874	836
1408870	2056
245978	1136
3535276	3082
178936	952
177209	820
887127	1832
995141	1958
518150	1400
834050	1590
1701735	2254
533676	1360
3529830	3106
1786741	2298
1313276	2118
812659	1686
1093727	1936
3536154	3146
96268	702
3537999	3183
1812243	2406
275182	1068
1053758	1938
149314	816
11653242	5036
181706	912
1218272	2016
558717	1420
284746	1078
498090	1440
1619345	2200
996492	1672
405128	1414
191078	1056
878474	1678
1124000	1862
640781	1632
548954	1564
1673487	2262
557165	1522
11992356	5271
9268746	4814
728649	1652
420894	1218
1845648	2444
1452170	2158
989849	1870
481163	1314
772229	1636
1083365	1932
419340	1444
410426	1220
279124	1068
649738	1544
779375	1694
1267503	1862
941566	1848
264960	1016
493044	1442
1130900	1912
1320144	2156
569146	1606
1094849	2078
167850	862
600592	1556
208757	934
911311	1798
182498	896
2832476	2922
474471	1356
428096	1328
2840470	2734
3748138	3224
2026873	2350
898445	1680
53766	468
1849486	2286
3116973	3096
985720	1716
1916021	2392
537116	1604
335440	1234
1245322	2286
1120130	1828
324496	1148
853620	1704
534380	1474
820982	1776
700098	1682
6836197	3896
130358	790
1037653	1890
936601	1944
831691	1674
1596693	2288
1906117	2434
1271098	2058
764626	1600
194072	968
614440	1538
1174653	1972
303742	1072
4330858	3256
234453	1030
235014	1122
1491103	2216
185044	996
660816	1744
1379798	2242
353234	1102
1390305	2130
1030419	1920
352495	1194
4639232	3510
3850387	3078
1333606	1992
764442	1648
19	7
2224842	2574
765016	1492
201370	962
479890	1360
44582	534
69320	710
260838	1178
472151	1428
1746852	2284
260762	1032
1078277	1876
239060	1072
953001	1896
543128	1510
111244	800
272787	1298
609903	1596
5877387	3812
1353221	2096
641380	1606
4051014	3074
3575088	2926
844804	1692
1175767	1888
963038	1824
258307	1110
890189	1766
19	7
238287	1098
428862	1306
6088365	3902
811347	1758
420042	1246
2430673	2744
291260	1206
732742	1750
3170307	3136
1493153	2170
990877	1796
475880	1454
4378399	3218
382723	1390
13974094	5706
1258869	1942
114152	774
408124	1328
238019	1062
2568668	2712
647538	1522
716668	1712
483087	1410
242178	1058
1452036	2146
266009	1136
73100	646
2004958	2608
458759	1503
382178	1312
1280591	2134
819545	1802
595617	1534
3131562	3012
343692	1240
204553	1028
411689	1360
1611972	2248
268418	1090
201534	966
3821458	3240
601793	1610
584931	1512
281356	1030
435461	1514
1115674	2050
1476401	2330
1231567	2090
1012514	1946
1608897	2516
91038	716
212564	1104
4182097	3314
12237672	5202
369170	1310
1752727	2296
2556514	2840
615605	1602
296454	1192
3964591	3042
6719991	3944
753780	1732
1445339	2138
664905	1646
1025088	1868
395624	1336
448728	1358
225793	1024
868946	1964
696496	1586
1541876	2252
1165453	2038
1496671	2014
2091464	2550
1613427	2238
963986	1904
1094738	2016
939010	1770
1359301	1904
1117432	1922
990338	1940
514554	1398
861100	1714
458206	1314
760937	1642
3717418	3030
1224842	1968
3110597	3116
174672	976
253065	1154
4095219	3340
460222	1290
109300	724
2912702	2804
980885	1892
852961	1732
413754	1482
766663	1794
491311	1480
436618	1376
1652378	2148
516583	1430
1448447	2028
561615	1474
360118	1366
224696	1014
1571963	2220
1615811	2332
397658	1056
979304	1814
455998	1388
194572	982
1348056	2094
755740	1792
3642155	2996
94948	638
4036835	3308
7253155	4188
1440723	2172
416713	1360
1332081	2104
2715185	2810
745362	1732
518092	1458
4903724	3727
2454299	2624
323976	1146
250609	1162
626065	1560
1794523	2328
887570	1896
869083	1918
419193	1266
487271	1418
7705518	4240
1032348	1888
3299979	2980
2101257	2372
340630	1176
715158	1608
700201	1594
1323052	2016
385387	1194
6887905	4138
497340	1510
6508275	4171
2070603	2536
1674977	2300
2756183	2772
231520	1086
2617526	2680
405668	1206
1234467	2060
530342	1424
54500	618
1408694	1956
707620	1458
822133	1724
5767303	3754
8784321	4644
609411	1524
1224928	2183
974717	1858
54440	522
659293	1610
489382	1300
542916	1518
5026260	3707
263174	1048
943453	1912
240814	1116
442925	1352
114568	748
382786	1372
570840	1504
349574	1128
514284	1476
572355	1594
2709486	2914
572200	1412
221836	1034
206953	972
