Score	Length
1142	74
7308	220
1632	100
1798	122
1806	96
3166	150
2416	120
6774	174
3864	154
1198	74
2106	114
3652	116
2886	126
2416	134
6386	170
5928	182
12240	192
3370	132
6279	186
5804	178
6082	178
5214	156
6376	196
2680	106
5040	178
21334	326
4050	136
3208	136
6302	154
9120	232
4286	154
4760	138
4128	140
1768	114
3956	148
2066	102
2890	140
2670	146
6230	212
3850	160
2246	114
1346	82
2670	112
1680	132
27078	350
4008	124
594	58
6268	176
9306	210
2302	122
3170	128
6148	166
2986	156
2946	138
12790	240
8436	216
6066	126
2032	126
11118	192
5220	174
12674	248
3492	158
3584	134
2904	132
1770	114
1036	68
3680	122
1848	94
2758	114
12394	246
514	54
670	74
4610	160
4874	174
1894	106
1884	106
4194	166
1724	112
16880	298
3704	144
2718	126
9142	232
6308	148
4670	186
2054	114
6502	222
3808	152
7204	212
13961	248
1048	96
1090	106
2010	102
1520	112
794	74
2668	134
2662	126
742	66
10638	252
1682	86
1952	96
9934	212
3092	150
3882	146
39892	466
5846	214
1490	88
1542	82
2198	102
3822	168
1664	78
19326	310
3184	122
1042	74
6628	214
2592	108
6208	156
2272	134
3992	132
3802	154
7942	206
8656	220
544	60
5032	172
544	44
4720	204
3692	120
2650	134
8534	232
3898	144
2240	104
2080	104
16647	274
2156	122
1338	78
650	78
1130	64
13862	258
10282	228
2402	128
3424	120
1050	42
3790	138
6986	180
7122	180
3570	142
4132	142
3220	140
2532	120
1408	84
7668	216
3502	120
288	56
3812	156
2212	100
8788	232
22822	338
8782	226
4048	152
9270	256
2424	134
4612	160
7126	216
2480	126
2094	128
4540	190
3924	140
984	84
6582	162
2962	150
4052	182
6802	202
2422	134
2770	134
11520	272
3510	138
2098	110
13314	300
662	88
12521	290
2832	134
12954	262
7682	196
7418	192
1374	78
1874	100
7670	200
4014	184
1346	106
2690	150
4502	166
7332	194
9320	222
28550	406
8896	240
1174	82
3514	118
1722	112
4442	146
366	74
1124	76
9974	214
14346	248
3706	172
9638	224
1956	104
678	54
2862	94
6046	208
3312	170
688	84
3098	134
3600	134
7932	206
2434	130
3710	130
476	56
6192	190
31481	380
1298	118
3508	158
2336	152
5296	192
8118	226
9526	266
3324	150
3218	144
2140	110
3530	114
2198	118
3014	170
1536	108
10872	248
9592	232
2752	112
1178	94
6542	188
6496	164
5150	172
6550	190
7848	184
6944	202
4724	180
9532	232
1356	78
2886	130
4070	100
2364	110
10808	300
7876	186
1536	84
11866	214
3012	120
14132	318
1494	110
5190	178
5922	210
8410	180
3444	132
6764	168
4864	178
2800	104
3738	138
6938	194
11068	250
4786	134
4596	150
3490	126
4018	162
5703	188
370	22
1936	110
2978	128
3162	150
1690	126
9712	204
1306	66
2372	114
3394	128
2884	148
744	32
6268	192
3404	144
7204	212
4574	164
7410	218
1852	120
3210	138
1098	54
7474	188
2848	120
2852	162
8402	206
252	44
10684	242
5230	150
1266	114
5148	178
6430	246
14366	232
2882	154
6054	170
8696	238
2198	106
2070	116
11264	280
2882	104
2870	112
4020	168
1766	102
49548	466
2554	114
4564	158
1868	124
8138	244
4006	158
6540	200
8144	226
2156	102
1108	68
2862	154
9814	246
1344	92
4742	142
1226	108
4094	172
4352	120
8756	152
8352	212
6060	170
9104	240
4534	166
5350	156
2472	124
3574	140
19876	358
4728	146
2332	144
2630	98
4232	156
3484	148
5390	146
4154	146
1544	98
3302	154
4414	118
20607	300
14718	282
7128	210
5438	174
8164	180
4960	196
2624	128
9094	228
2692	148
11058	254
4440	132
3684	130
22622	344
14838	278
2334	116
5862	214
5008	172
10270	244
2110	96
5970	202
1516	80
24804	270
2912	116
5474	182
7018	246
3279	120
3582	150
3012	144
10230	252
3332	148
1536	90
3284	138
1684	78
6098	172
4652	160
2386	146
5738	160
4174	142
7970	166
2494	118
3762	166
6366	186
19320	354
2266	164
10054	244
1616	92
260	52
6888	192
2486	122
6158	218
3770	156
1986	98
2366	104
6568	168
5124	150
2892	130
7310	198
830	74
4636	190
2050	98
908	92
3472	128
9962	230
2108	128
3634	138
518	38
4728	160
6892	186
824	92
5628	170
592	72
6682	186
6994	216
904	84
4104	156
7558	248
14816	332
17420	324
6370	204
4314	188
4228	160
8793	212
1844	136
2074	114
1750	68
10226	224
4376	164
4084	160
724	84
19	7
2926	130
1830	92
6030	172
3360	132
6226	188
5412	174
1372	78
2354	122
7538	212
7438	214
2580	114
1132	82
3896	180
4578	156
2650	132
2668	124
9732	250
902	82
8314	234
2744	128
8800	218
1576	120
6570	180
8726	198
11372	228
11632	244
2826	132
4534	170
6876	188
2178	116
2594	138
5820	166
1350	98
7538	184
1836	102
4894	176
6806	214
2386	126
7548	176
348	68
10510	236
2680	122
7802	204
806	74
1942	98
5662	208
4886	166
7264	208
5878	162
4430	132
3468	120
6269	146
4254	170
6390	148
3858	118
3718	140
3520	126
2462	122
2106	112
2718	122
12406	218
3020	136
7862	232
1512	90
3954	130
3316	128
2928	142
13240	276
1888	124
2636	136
4090	148
2164	132
5066	176
11198	272
3736	144
6462	216
3778	130
894	62
16958	310
8472	220
8092	180
3378	136
21832	308
2670	118
4490	152
1316	116
2136	80
2824	116
9944	240
4298	140
8074	230
1806	90
14854	282
9372	262
3100	128
4024	152
2650	118
5474	136
4124	152
8444	200
4716	144
994	90
8192	166
3808	144
1198	90
2736	112
4850	148
3282	130
8482	230
3528	154
6572	200
7420	190
26148	372
5310	154
4914	182
8062	216
5534	172
4296	180
5636	178
1438	126
8884	238
5164	190
7906	202
918	42
1940	116
412	48
2112	104
1974	114
4989	202
1356	92
1034	90
9822	228
692	76
3390	158
4072	138
1620	104
15696	300
406	42
1466	102
4350	174
2616	108
3306	128
9960	230
1150	82
1648	112
5048	180
13854	278
3650	98
34838	394
3424	148
2266	116
3518	170
1094	94
4013	156
3406	142
16579	340
5058	196
1506	104
1984	128
7154	202
1892	100
1404	88
2516	106
9418	220
4624	146
1186	62
3840	126
3756	176
6400	194
4756	184
7566	206
3128	134
1636	120
742	62
3784	124
25696	346
2782	140
2302	106
8300	248
4828	192
3492	130
4243	162
6300	210
3218	120
5838	196
5426	192
1638	106
5852	182
3988	138
1574	100
5278	166
5146	184
3042	174
6065	176
3934	152
5132	186
7660	192
1422	104
3082	138
11096	232
94956	602
1434	94
4944	168
6022	196
7594	210
4934	156
2324	96
4152	130
8288	232
10416	244
3748	138
4090	148
4062	164
8594	208
2142	86
2060	120
6042	182
788	84
12282	236
2070	114
13712	244
3686	146
4659	182
4138	162
934	74
2644	120
3168	156
3496	130
3318	132
22152	368
5718	206
1296	84
3052	136
1672	134
4398	160
5312	156
1482	100
48124	420
3670	150
1118	82
2306	150
1472	94
3872	152
4284	154
1556	112
4392	128
3522	162
5740	182
802	78
3578	128
4856	162
15436	306
18050	280
26618	344
4608	156
4892	180
1772	82
6454	222
3954	152
9730	222
500	68
2628	102
7518	226
1856	112
4376	168
8550	214
3010	102
10162	206
1142	118
3432	124
2846	148
4362	150
2460	128
5732	160
4434	166
1452	88
9258	210
13316	282
27400	380
9360	232
4636	184
5614	178
2098	102
2908	108
1554	118
2618	142
7950	170
7316	174
3126	122
3164	122
6310	210
17650	276
4764	188
21950	362
6364	144
3416	132
3956	154
8690	242
1792	112
3328	162
3238	126
2334	134
1666	118
10912	234
7176	198
11016	218
4278	162
8894	222
13218	300
2568	128
574	82
5438	190
3952	162
7100	212
5350	158
25517	394
10132	230
2464	90
28140	378
2672	112
3326	178
6708	188
1610	94
3074	118
5354	194
10006	252
19	7
1288	112
1552	102
2252	112
5764	156
1578	102
8260	170
2242	94
9086	234
2478	138
1328	78
19	7
7646	206
3834	136
9380	230
4120	162
21362	348
4266	164
2780	146
14620	286
11400	238
5950	154
2436	110
630	58
15182	320
2958	136
2600	134
2040	132
2690	126
1478	98
13154	260
16454	296
5412	190
6434	192
5038	210
2532	96
3796	184
1824	106
5260	192
1962	96
83846	592
1104	100
2196	100
1842	90
10692	300
1728	132
2258	112
2734	120
8902	210
1404	82
1714	116
7148	212
650	74
746	82
6314	190
2556	92
2758	138
1236	80
20351	306
2880	140
1068	94
1676	116
2382	126
18688	286
1398	106
2168	124
3330	120
2026	128
2380	124
3502	158
10424	248
4250	152
1482	102
3548	124
11628	216
1466	78
11082	254
2766	122
8004	208
10046	242
3070	134
5428	202
3254	142
2476	138
1914	120
2112	138
1840	114
4714	160
4016	160
4117	120
3522	174
3500	170
3524	146
1232	130
1976	126
5864	160
7548	200
3150	108
11316	256
1754	114
4412	182
2818	126
1062	86
3146	116
16722	324
6356	194
6830	192
9538	258
3280	130
43640	450
2354	66
3562	138
9006	224
2896	114
24230	308
1840	86
6816	166
2326	102
7784	190
10146	208
2388	120
1880	122
5560	186
8686	262
2006	104
7750	202
3052	104
1420	120
5918	204
1784	100
8754	200
13016	218
2672	120
9496	238
16886	284
20994	332
7022	188
11048	218
5522	136
1774	124
2882	148
6382	182
1460	66
4736	164
4094	142
6342	152
1110	114
3000	120
3512	130
1042	74
448	36
5202	174
2100	136
792	68
1160	80
22962	346
1070	102
3142	118
5692	188
5984	150
8464	172
2482	138
4310	112
7242	208
3716	122
4154	184
908	64
3812	170
6608	188
1436	108
3660	138
4722	174
3004	122
1876	124
4100	140
2822	150
1678	132
2358	124
4526	148
2582	132
3584	158
3347	110
7162	200
5334	146
1950	120
2488	102
1276	124
1910	84
7014	180
2896	102
460	48
712	72
2894	126
2120	110
12302	256
4865	168
2130	136
9534	190
7180	206
3194	138
1768	100
738	94
828	84
2646	136
2696	116
4918	158
2652	164
3520	136
10530	252
4516	140
2826	148
1734	90
1192	92
3760	160
2784	96
3520	158
512	48
15248	288
1678	100
1482	66
1684	104
3350	128
2544	88
4230	156
7096	146
8026	188
3126	138
6324	146
3256	156
5700	184
3856	120
5326	154
5246	184
4236	144
5435	126
4432	144
3088	136
1252	92
4948	160
3194	146
9278	246
4878	172
2452	130
3710	150
936	90
1120	76
1456	110
6448	172
5166	172
3342	110
6738	170
1256	56
1580	104
2196	132
3436	130
3330	138
2232	128
8284	206
8816	196
2790	146
1670	94
8868	206
5870	184
5318	196
1602	106
19803	324
5216	168
4060	142
2118	96
1206	78
4590	170
13416	256
2868	150
6428	196
1632	102
2814	94
2904	124
5352	198
12208	236
15052	244
3496	144
5046	142
8308	218
12308	264
2120	128
7566	226
4010	142
2086	106
4452	146
8383	230
3858	124
2816	76
13086	276
1492	112
1906	110
4352	164
670	74
8250	220
2890	142
6450	174
3676	164
1232	106
3526	164
5620	178
5850	202
1760	100
1610	74
2714	138
7000	212
2230	134
1170	98
8138	212
3368	152
3188	176
16454	316
10218	222
10318	244
2784	144
3438	142
5984	180
1114	78
2110	114
9542	194
1344	94
20424	352
5044	180
11026	268
3350	148
2016	102
1806	122
4606	152
778	78
2344	128
1300	96
3910	132
2504	138
5432	160
23358	358
3662	150
4428	186
2774	98
6128	170
3254	146
1194	58
5750	192
16332	300
2250	130
4483	182
1978	134
11114	258
24346	280
3410	114
1576	80
3700	146
2516	128
946	64
3504	146
2454	110
1318	106
2556	106
2994	142
6326	192
6840	204
35698	388
4106	128
4232	192
7304	236
3705	144
4350	130
2586	108
4313	182
3170	154
5702	160
2434	106
3482	170
1520	112
5501	150
1526	68
920	32
11960	236
744	68
5184	148
3408	128
6312	174
11360	232
1652	96
4370	142
4979	190
1916	108
19	7
4232	132
4608	136
2582	110
2894	122
5768	192
3082	142
16133	298
12158	230
3082	140
2536	124
5492	178
1828	90
1836	110
20314	336
1976	100
1976	128
1118	90
4502	178
8058	202
2622	138
5326	170
8702	228
12676	234
3712	126
4506	172
2008	112
2070	104
11850	286
1240	104
10538	262
7340	188
690	30
4176	154
5364	164
7672	178
4250	158
5382	222
4954	168
4800	172
2820	116
4474	134
4242	160
1756	118
1220	72
2932	96
5554	180
2816	120
7200	180
3044	104
2958	126
4084	152
27652	370
2654	100
8842	256
9764	222
1614	100
998	94
19	7
3754	182
5174	166
2048	120
1920	106
494	54
8214	214
2568	116
3220	120
10010	248
2852	150
3534	144
2438	98
596	52
9702	222
5106	186
6396	188
5522	178
4374	160
3416	156
10032	240
3178	114
10474	234
2878	94
1662	74
2860	118
2680	152
810	50
3114	120
1578	112
6356	180
2682	124
2740	142
10022	266
1720	116
4040	152
7024	198
930	82
2872	160
5412	176
4464	190
6723	198
11048	216
2024	112
834	74
6232	176
8858	226
1846	84
3954	146
3498	108
2640	110
7354	198
9848	260
1944	118
922	62
7618	146
6816	174
1590	112
5892	200
1112	86
31878	336
1794	98
3740	114
1890	86
2214	120
6702	192
8978	270
2996	118
26466	356
7824	172
1504	72
1034	90
3240	96
5298	138
1404	88
6250	184
2076	108
5126	166
6934	190
2232	120
5396	198
3570	162
1602	98
7108	222
3794	168
4860	176
4328	154
1886	108
1586	98
3208	132
4058	134
1372	108
1444	96
4628	150
2598	110
8862	218
4440	144
7138	210
13750	272
3106	130
1688	106
4408	158
4312	130
880	92
4124	162
3874	146
7550	200
2882	114
2596	132
6860	156
5006	206
4454	146
7184	206
3504	150
5032	192
1072	76
3064	140
3034	134
12080	256
2834	114
1290	102
3008	106
3914	158
3062	134
998	74
4576	122
642	86
5074	182
4592	144
6082	214
3532	162
640	84
2198	118
2508	128
3620	132
8300	196
8543	220
2504	124
2608	94
3318	134
40438	432
1642	100
872	52
2946	146
10308	204
802	78
5730	196
7466	204
4452	172
566	66
7054	196
4602	184
1668	126
23943	372
564	76
9748	240
1606	102
10476	260
6828	142
714	70
8246	220
2184	108
2894	126
4408	172
4180	116
4288	144
8240	250
10982	236
4498	170
19904	344
3140	130
7756	214
3500	146
12412	312
2270	106
3652	148
1932	126
7512	192
16802	304
11268	224
5710	180
1426	74
9078	234
2778	126
4218	184
1490	98
6766	172
1844	132
5626	216
1540	88
7022	198
9514	252
5444	192
5192	146
2304	84
4254	174
2354	118
3440	154
5596	198
3250	134
4956	160
6994	206
72418	528
17360	328
1562	102
7540	208
1594	96
1746	82
2244	96
11138	240
5000	162
5180	204
3050	116
17126	298
2038	86
2988	140
4730	196
2972	114
1612	98
1344	70
1926	108
1950	96
2078	110
22240	300
10900	246
5206	186
1996	110
11978	292
2890	140
7298	222
7362	200
12292	262
2938	158
2668	140
15938	270
2396	92
2494	110
1582	82
5840	184
9274	240
6190	198
1622	106
1212	94
722	90
1074	80
2578	126
6708	196
3966	146
13520	260
7456	178
9490	202
3266	132
2444	128
9720	230
3502	168
14034	276
5822	190
4278	178
4012	158
6214	192
454	50
4756	144
6868	192
6884	150
10074	196
810	86
5564	152
3580	144
6191	198
3508	166
2422	140
31790	394
27860	342
3714	136
3826	188
2336	136
2454	132
7060	212
1068	72
7734	208
3500	148
3604	148
3224	134
5311	154
5548	172
2908	136
5422	158
3780	170
5175	148
824	80
5950	182
602	82
6396	196
3200	112
8841	202
2032	100
14417	254
2908	122
6302	140
2202	88
7758	202
2926	152
3492	156
1632	106
1692	98
2362	150
6816	192
5896	182
1674	106
6862	202
4379	134
7780	152
2824	112
2996	164
9432	252
9626	220
1380	80
6192	190
7290	184
2196	128
9608	228
4328	126
5764	200
2700	102
11592	230
9162	210
7630	204
10688	238
2668	120
2370	122
7997	228
3404	136
1686	104
2084	140
3636	142
3152	106
2148	116
9154	240
3958	152
3084	152
10904	222
4334	138
3032	156
3310	134
1248	76
5660	208
3702	152
11186	214
5374	178
4662	178
2992	136
1720	102
5244	152
1416	100
2252	116
22780	292
5062	188
738	46
5278	142
12192	272
3734	138
3064	104
2660	126
11902	246
1982	112
11406	262
2558	132
2266	100
3636	116
6300	200
10054	262
5988	204
1030	90
7646	204
5610	188
6226	182
9199	208
2342	118
2628	128
11198	236
5606	178
17846	296
3504	156
2420	126
8080	210
8764	218
4588	162
734	56
3306	142
886	86
1868	104
2124	126
1590	108
6536	170
5658	198
7298	198
6340	188
1230	72
6570	228
1198	74
15832	288
1604	126
8776	210
5602	192
1706	108
4164	168
1975	90
6128	180
7264	196
1456	84
11816	248
8908	246
3416	128
9890	256
2624	126
2790	122
1374	82
3512	132
5130	174
29962	344
3202	156
11050	236
3072	158
4336	168
16242	290
1868	116
17896	318
2060	118
4290	154
5638	160
2492	152
6412	172
1694	124
2572	148
1708	118
1096	84
5324	170
1669	128
4024	112
7154	200
1564	108
2976	116
8892	244
5114	178
986	86
6184	188
17350	322
16230	328
10098	252
6030	194
4822	148
1508	104
1452	88
3066	142
3300	112
6600	182
958	58
2346	100
3972	174
5106	198
2340	100
13056	272
13496	254
19	7
12214	246
3458	128
5513	172
6838	226
2840	126
1790	106
1488	104
4292	162
3038	98
2182	142
6562	182
2432	124
3884	136
3960	164
4448	180
3506	118
3678	158
3806	178
3154	156
3788	168
3354	142
3924	166
4864	190
9108	208
1839	110
10668	246
5548	172
3140	156
2712	102
5000	180
4084	116
5262	182
11622	254
11446	238
2702	130
6764	186
7412	228
10830	224
9024	236
1403	88
1364	108
1568	88
3914	162
6696	184
15034	290
3024	156
4656	170
8254	206
1054	84
2082	122
5724	192
3046	140
4506	162
2608	148
3384	146
6156	170
5036	178
14320	256
5088	188
1060	82
7508	232
5506	170
3286	142
6092	206
460	48
3636	138
8288	224
9902	244
1218	114
6008	180
2110	118
12630	252
23590	354
18280	286
2340	148
2258	94
1539	104
13347	242
2222	122
4730	136
8284	222
3926	130
6234	176
7654	202
10184	272
2050	114
3064	152
4376	156
7100	182
4020	154
208	44
1556	92
2032	108
3372	110
4942	194
6942	224
3306	142
1384	102
6912	190
9706	254
1146	94
490	66
16372	288
21628	356
3392	122
2892	136
1944	88
3522	134
2133	86
3980	176
6120	176
4080	132
6748	222
1028	76
9270	220
7611	160
1076	108
2778	136
5940	154
2750	114
3060	162
8074	184
4604	164
7018	164
24592	362
4120	124
6468	202
7534	230
1236	112
4602	110
9183	228
1960	114
1154	76
1702	90
5318	150
1508	90
6692	194
5610	174
7644	194
2142	122
2492	148
6466	196
6596	154
25052	364
7314	236
4770	164
26242	378
1016	72
10702	252
2502	124
2038	102
7198	216
5226	178
5294	186
5248	172
2280	140
13418	270
1708	92
5794	194
4886	168
3666	144
1532	94
2880	130
12964	288
12544	252
9266	238
1500	96
3344	146
13040	288
2578	106
3064	148
8776	254
8054	216
1206	98
4042	172
17552	328
4924	162
3488	160
1784	116
4046	158
24468	318
1778	124
10958	238
1228	104
4412	146
7038	202
542	66
1860	104
5116	144
4190	136
5618	194
6380	196
4066	150
13700	294
6922	194
4552	136
2640	120
3198	122
2686	106
1358	126
10072	244
6735	182
10842	212
7984	224
1876	100
24016	326
4676	138
4550	162
10199	222
5825	186
3986	172
1902	112
7350	184
1314	126
2054	118
2772	104
22588	286
664	80
4794	152
5648	148
2708	144
1422	82
15854	290
10876	246
1658	112
2684	156
2050	110
9616	180
9056	200
3292	154
2176	122
5062	188
5910	162
1244	114
9052	212
7616	236
5386	198
14142	318
3922	152
5740	198
656	40
6658	190
7916	218
712	76
6432	224
6158	176
4274	132
4832	178
7880	190
1058	88
4906	154
19	7
4376	160
4144	136
3152	140
8250	200
1002	78
4504	166
2580	130
6060	212
4222	172
4952	190
3056	126
16340	312
10258	184
2960	140
5168	174
1238	82
756	84
1950	90
4336	156
4914	168
3636	128
1056	94
12062	230
1692	114
2350	122
4766	180
3780	144
1874	114
3564	106
5516	150
4220	160
992	88
4694	164
2440	138
3806	130
2760	108
1464	92
9700	240
6582	180
2954	128
11536	256
1400	48
2198	106
16592	248
1630	130
5086	164
858	62
9428	222
3450	142
2952	158
24172	336
1652	94
1258	88
3518	170
5410	188
8254	198
1382	88
2328	128
4538	174
3342	130
9204	216
1120	104
7742	202
2720	152
10252	242
8530	234
9444	214
9062	242
3412	136
5198	176
9842	166
10724	254
10242	250
1304	92
4032	134
4286	156
7850	216
2210	102
5890	164
11010	244
10292	172
6714	212
4552	164
2536	128
1606	106
4831	176
1036	104
4684	160
6004	200
5050	142
1634	114
4960	154
9344	198
5470	170
3848	180
1906	134
708	72
2984	134
2766	128
1928	72
2382	112
2878	128
1046	50
7340	200
7742	190
1436	104
4420	170
8474	218
2732	116
1892	120
3448	100
9794	194
6410	222
6732	164
3938	160
26376	418
10528	246
3932	122
9138	254
14456	300
1774	82
7802	244
18840	326
9914	246
2124	104
10093	226
2414	110
10054	250
6892	230
1986	116
2586	156
8722	188
4970	186
5836	172
2657	82
3840	136
10665	198
4636	146
788	52
20100	300
8526	246
4444	152
9226	242
2424	136
3974	146
5466	196
9276	174
7334	238
3936	112
2106	150
6162	164
8104	222
5202	156
1272	98
19086	310
9340	204
14612	316
9644	202
3712	132
4012	188
794	70
2978	116
11418	234
2034	102
5176	170
9374	240
1908	92
1132	78
1414	102
19	7
3970	160
1088	92
3542	160
7558	188
4724	182
2974	134
1344	80
2388	100
1960	118
2352	108
4140	172
552	76
5562	180
3040	166
10206	242
1134	98
18598	314
2140	116
502	46
3722	138
1922	134
2238	118
1164	70
2338	132
7826	212
8887	220
6442	196
6134	180
8594	208
2296	116
10146	168
7438	226
1930	106
6726	196
16292	316
5444	148
12894	270
554	42
14050	270
19	7
3844	160
4938	166
5826	194
5078	178
1752	106
22228	336
25648	294
7428	170
7870	196
3726	162
6374	182
1852	128
6431	216
4538	178
2134	108
3558	136
3868	186
1724	82
5216	188
10906	220
5408	176
1944	86
2262	122
726	48
1794	112
5160	186
3136	114
2582	110
3790	132
3358	154
4284	176
984	72
5350	178
1360	44
1560	104
5200	148
2010	124
1992	148
1562	114
1998	90
2580	114
5484	182
2332	116
6642	208
7074	192
5694	176
6720	192
3538	140
7134	208
6986	218
8016	216
5962	204
7634	180
1336	92
1840	118
3878	158
1736	100
5917	146
2102	100
3320	122
1632	108
1486	110
826	58
972	52
528	68
2600	140
2570	122
3030	138
3558	172
3274	116
2960	140
6898	146
13370	248
1996	88
1926	118
5786	186
2000	86
6278	208
2098	94
3320	116
1908	120
3776	138
7882	172
4200	160
1598	110
3800	156
1024	88
7960	218
1412	90
3142	114
4178	180
6528	216
4436	164
12656	262
3696	148
2334	138
550	42
788	84
2406	142
3716	126
1430	106
13225	262
5784	188
13368	244
1712	98
3674	170
4752	146
2466	118
3276	132
9247	222
1100	80
6538	214
7130	178
21404	322
13150	286
21144	302
4654	184
2836	108
2130	134
2916	132
9556	214
5662	158
1824	118
1996	116
4216	134
3316	178
8042	214
1244	88
1706	118
2314	110
2052	138
7316	190
10352	240
2188	150
4064	176
11814	258
6666	196
3588	136
1158	94
7500	234
7030	202
24428	364
5286	148
3492	144
13612	256
1308	84
1488	100
3388	142
1582	122
3700	156
1492	60
2518	134
5779	182
20398	346
2595	114
2846	108
2546	138
6124	216
4972	148
2692	128
10700	238
1966	130
2352	140
1360	120
9826	216
2938	142
5158	184
8356	204
1738	114
5932	162
6424	180
2976	140
12574	272
8204	182
10454	228
2858	126
5992	154
4050	142
2854	150
6538	186
13208	288
796	72
9044	218
12250	272
4652	154
9298	236
2896	134
4074	128
4136	140
15494	290
62964	490
5124	208
18230	256
2784	148
6182	174
1764	72
5400	182
3588	110
3902	148
7128	190
2318	134
2278	104
2918	120
7890	214
1104	76
19718	328
2168	124
4658	158
2276	100
2338	114
1902	104
7950	236
6688	230
5020	182
2714	142
1762	94
2608	136
3720	136
16974	288
1544	102
3264	152
3084	136
4836	172
4308	116
2594	134
2804	126
12020	246
6756	198
1772	102
2352	120
9122	210
13592	284
582	54
3474	126
32634	374
2786	130
2022	130
24036	356
3224	128
2174	110
1034	90
2702	120
2740	124
2598	134
3864	156
950	62
22424	342
726	68
1794	134
5626	190
2054	110
1171	114
4110	164
2050	96
3734	126
6012	208
3452	138
8726	220
2108	108
3816	136
601	17
1340	80
5476	180
1886	94
3832	168
3458	170
19178	288
9426	212
21826	360
8798	158
11062	220
4234	138
1100	80
5752	174
1790	94
13266	278
918	90
2984	96
1734	110
9142	206
6314	198
3220	126
5514	168
8024	236
3172	124
7350	186
4250	166
2514	118
2522	134
4584	174
2734	114
58238	506
27692	372
3852	136
2700	134
6852	184
2582	134
3688	156
1080	112
1170	96
38740	394
2354	126
8946	212
2484	120
6786	204
15556	292
1906	106
6624	204
3460	160
17658	314
5100	174
1700	116
2228	104
2320	132
5458	180
5952	154
13772	272
372	36
7230	160
2870	152
3318	142
1382	94
7096	206
1966	122
3280	140
8576	216
2782	158
1342	78
10250	242
1924	96
5658	192
1118	82
4618	120
4248	176
10696	242
5858	156
19	7
2434	126
9332	250
4898	186
12552	264
9026	240
3196	144
6684	228
1906	126
4130	154
5068	176
5076	168
3020	156
9152	182
5650	200
7070	218
3786	154
3098	130
2380	116
4772	160
8854	220
1662	114
14056	278
7648	210
5248	188
3518	140
2922	126
2564	124
5318	168
3088	138
1844	98
21046	356
2116	122
57790	474
3234	148
820	80
2522	146
2120	80
518	82
6940	180
5270	204
7628	226
5002	170
11020	244
11768	232
4706	164
3168	116
1704	84
2338	106
4536	184
6814	194
3936	182
3580	142
13552	284
40986	442
20204	288
4114	158
940	88
3776	148
1826	106
864	80
1772	106
2634	108
12051	250
2176	126
2220	108
6534	134
3020	136
2626	150
7966	240
13212	216
2186	114
4440	192
14980	316
2244	116
2626	122
5424	192
4358	174
5408	166
1666	104
4916	156
1906	94
5996	184
5518	176
896	56
4186	154
10598	266
3508	124
3024	142
774	58
572	48
4954	178
3710	162
5050	190
8158	186
4528	140
7890	206
13878	270
3712	144
2794	122
3941	144
6960	190
4794	160
1692	112
3256	130
6596	224
3702	176
2270	142
6638	190
5393	192
1422	94
5714	186
7476	178
9118	200
2194	106
794	94
11482	224
862	58
5190	186
3648	146
12654	260
7366	160
4138	162
3654	136
2858	158
1474	90
10268	234
4780	166
1270	110
14943	280
2604	126
2158	116
3208	160
2439	118
4190	176
3458	158
5138	154
5274	148
13064	226
16946	276
2300	92
304	52
1664	78
4528	188
1368	116
768	68
3854	166
5252	148
4698	206
1854	114
1040	88
10122	232
6014	202
7624	200
1724	112
11052	240
6094	180
1586	102
3724	134
6442	178
1714	78
10736	242
1998	96
4348	152
6920	196
2400	124
2162	104
4674	178
2840	120
16164	288
7656	186
13034	254
2534	136
3172	108
3570	138
8160	226
21802	350
7218	146
3492	118
4234	164
2074	98
10022	226
3542	142
1952	108
25044	358
8634	246
1936	112
1172	112
6102	182
4298	152
5300	188
1622	98
5346	214
7594	248
662	66
4322	158
6946	202
2660	132
2344	108
39548	404
39160	414
4729	166
3986	156
1740	90
2344	134
652	88
3918	164
1398	82
8234	196
6682	234
556	48
2074	116
10034	238
9016	230
5674	186
18180	326
8100	226
10764	274
10210	254
4470	170
1126	38
4244	150
3542	130
3944	140
1550	98
6822	202
7951	220
2378	102
2048	116
5294	152
6756	208
2862	140
1814	122
4366	136
4076	110
2982	126
24546	376
2714	156
2622	138
26084	358
6638	208
3116	144
2036	132
4302	160
872	84
2336	112
4094	202
3754	146
6088	188
1914	114
2600	108
19	7
3296	146
11980	282
13554	274
2368	102
2312	114
5552	198
3086	158
3116	126
1880	106
794	54
1678	110
10050	220
2712	104
2036	118
3110	134
11316	232
1084	60
4832	132
5884	206
1198	84
7964	212
6808	190
3702	156
2848	140
1844	120
2400	104
4246	176
4836	150
8344	206
882	72
2958	104
1722	86
2314	114
2970	134
19	7
470	72
4766	160
7982	246
3186	146
9888	214
4756	162
3648	154
1968	84
854	76
3178	152
252	28
3240	140
2034	118
12680	292
4680	150
6052	212
5810	188
8152	204
15246	222
4382	166
12954	254
6020	188
13002	222
8564	252
1004	98
8710	246
10940	236
9013	206
4562	158
10212	238
5014	182
2456	124
602	66
7820	196
2442	122
2536	110
598	58
746	42
1902	138
5622	216
2308	96
3258	134
1074	82
7078	154
1748	138
4064	156
4512	154
4622	176
2444	124
5586	178
3250	118
1858	128
3652	128
3996	144
1584	108
2118	136
4124	148
4396	178
5268	170
24976	340
782	82
3292	138
7288	172
2036	124
9986	234
7656	188
1536	136
9410	216
7678	224
5582	176
4500	166
12552	240
7398	164
5556	172
662	68
2810	112
7340	218
2632	132
5028	204
1858	130
3594	132
3596	160
4996	180
5944	198
3758	168
8064	214
3422	180
2262	98
3172	116
4450	170
2428	134
6766	180
31660	432
3344	158
9028	232
2510	100
3424	168
3680	138
14302	274
3194	152
3282	124
11792	238
3418	138
4548	146
3858	142
8792	226
3956	172
12702	260
5184	144
8992	208
3946	136
8816	222
3392	156
658	78
3546	142
4002	146
7182	218
9224	240
5502	196
7830	176
2396	118
2790	118
3876	122
364	56
1286	74
19724	318
5038	146
1168	76
8222	186
3724	162
2180	132
15376	298
4432	184
1888	112
4662	166
2362	162
11976	264
6256	178
3216	144
4656	176
3676	152
1404	88
2566	116
3038	140
624	44
2202	124
8332	232
1130	74
2044	136
3608	124
4656	180
3994	134
2416	150
3926	150
3890	138
8550	220
1872	120
1030	74
908	68
6182	166
6268	174
4960	190
6470	190
2418	142
4705	156
5108	198
1740	120
3793	130
4358	194
2702	140
8334	218
1346	98
4422	168
1248	112
1990	106
1206	82
4028	182
2090	118
10210	244
5350	170
4606	182
2824	132
2868	146
3198	150
3514	154
14030	286
1926	126
4574	140
4932	188
3574	156
4022	122
4355	138
3642	122
3820	180
2752	132
12348	270
3458	120
1472	92
3080	134
12112	188
4774	150
4944	148
2606	134
2794	108
6716	190
2562	132
4004	140
4268	176
2078	122
1998	120
1516	92
5314	180
5092	160
5612	184
2824	100
3086	150
19290	344
6628	204
4472	144
1636	104
2386	130
1524	104
3408	156
14732	280
1414	82
3094	142
1072	80
6830	202
8416	240
3288	144
2454	126
3242	110
27572	404
2272	132
1048	80
11770	232
7104	182
2254	124
2246	138
882	90
4386	158
21152	390
1806	116
12762	226
3460	160
4408	158
3690	138
4814	170
3392	142
5672	166
2710	134
6242	178
22018	348
3960	152
13680	248
7146	210
12836	218
3572	116
3474	142
6802	206
3686	158
1452	80
2006	102
1724	102
2088	140
3932	130
2426	104
6852	184
5498	182
1912	128
4066	186
2926	126
10258	196
2340	116
2322	110
588	66
1412	74
9582	238
7164	212
2778	106
4682	162
5688	154
2564	140
708	44
4718	158
1856	116
3572	150
3736	160
4322	158
5880	186
5354	168
16146	266
2378	110
5182	176
3554	146
2296	116
4330	150
3296	140
1190	62
2172	118
3210	142
3448	158
2590	128
4574	194
7116	228
1028	76
12044	216
2388	88
666	68
4262	202
4950	168
1982	126
3480	164
1434	66
4906	138
1924	128
11374	228
7718	232
3252	134
8682	178
1198	78
2238	106
3220	124
972	76
30696	356
10090	234
7152	224
6414	182
5564	184
3710	128
1864	122
2994	158
4550	164
6190	200
4903	152
14858	286
1822	106
2454	122
3118	132
5976	172
2128	108
1520	70
7404	204
5404	188
4080	122
1456	116
2684	144
4616	140
3942	170
3252	122
1732	100
1952	108
2920	122
34100	410
6678	210
1328	94
1388	88
2142	82
4828	156
506	42
3002	118
10258	254
9234	238
3406	98
7922	210
1140	52
20555	320
3364	112
10666	220
5024	196
6820	208
7098	186
2322	110
3362	138
10530	232
540	76
2772	146
19111	318
3580	124
3216	124
1674	104
4948	164
2212	116
4254	170
4778	166
9224	184
1306	94
15460	290
1516	114
1272	84
3152	140
3892	160
19442	318
1292	92
2358	94
1812	100
6502	186
4052	152
2650	88
1948	122
850	72
1588	116
534	38
1826	106
5882	170
2974	134
2992	144
2318	134
3188	138
13402	270
12384	268
3532	144
1448	104
7468	204
19	7
6874	174
3036	100
3016	136
4406	152
1606	100
26160	348
1136	82
4528	168
13224	282
1054	82
2996	162
542	42
6808	182
1256	96
5100	188
7214	182
2174	126
10294	264
3654	138
14662	276
3428	140
1558	94
5860	188
3464	140
16694	234
12684	242
4700	184
4068	152
3207	168
3040	144
9708	182
4368	126
4270	154
4244	152
840	100
1778	102
4894	176
12956	266
12848	246
2360	112
2748	116
11172	246
2252	128
2818	134
956	88
2990	128
7488	202
11636	208
2328	146
3944	146
5206	176
2340	112
3346	120
2540	136
2876	126
2118	106
1874	112
4710	164
11830	238
19	7
4534	160
1010	90
3446	96
2040	136
5574	162
3124	130
3364	166
4616	164
778	78
4566	138
4058	126
4008	144
9588	212
930	82
3330	114
1498	76
4932	164
2658	118
8486	210
688	60
2154	130
7460	170
12896	286
1592	108
7402	214
4146	168
1536	100
2732	138
998	86
3062	146
3039	130
11714	244
9176	196
2878	136
2720	114
1278	94
1490	86
2836	108
10962	210
5998	178
1744	112
6874	184
3356	148
1132	56
4530	136
6116	162
2532	122
12114	290
2834	132
4026	162
8666	202
1028	52
3180	134
9420	220
1016	92
4982	176
3308	128
3060	134
4066	162
1874	110
1210	102
1150	82
6832	136
681	82
3608	130
2226	126
564	52
3828	166
5268	166
7254	218
14452	220
8372	212
16804	302
2916	110
3168	128
618	68
2720	122
4640	176
13364	284
18152	274
1702	92
4392	164
1210	88
2774	124
2944	156
3186	100
2004	114
722	70
4930	176
428	64
1806	100
6386	230
1570	98
1248	96
1627	104
22440	300
3786	138
6760	164
3842	138
5446	178
2784	140
2404	120
7206	196
4722	214
4200	134
6600	190
4826	172
8370	208
7718	204
6108	184
2380	116
5108	174
1886	102
5636	210
12124	230
3720	148
4102	130
4412	132
1741	116
9822	220
2488	130
2558	122
11510	258
5810	144
8606	212
1966	88
5626	186
3936	152
5058	154
2654	126
13824	250
6856	188
8328	208
1212	90
2216	114
2258	118
3348	164
10308	204
1440	86
2220	124
25646	384
3350	150
3466	158
1790	106
5572	166
6264	180
7762	218
1946	110
2300	112
22416	338
13636	268
1902	126
2172	102
2548	116
2192	108
2446	124
10126	234
1064	70
240	72
18712	338
17846	288
2126	106
5618	170
6458	192
8380	188
2098	124
20646	334
7618	230
5786	196
3040	132
22498	342
2570	114
2324	124
736	56
2744	120
906	100
3444	118
3424	154
1106	88
8522	250
1780	96
6560	188
9078	228
5994	170
4764	164
3914	142
7858	208
5670	162
5708	162
2058	110
5648	160
2838	146
2270	122
14036	292
1656	104
10794	254
8197	228
4622	194
9944	244
6430	148
1854	116
3586	150
12716	228
2322	94
3924	134
4600	158
17906	272
3230	146
4308	128
7852	210
19954	344
3078	122
5518	176
13794	266
2074	114
984	76
4878	166
14978	262
1516	88
2232	120
4606	148
4174	158
2636	132
22626	318
4120	192
952	60
12186	258
3840	180
3594	126
2922	116
6864	204
2150	128
7126	134
2442	118
3852	146
5964	232
1144	92
1448	96
4324	152
684	80
5262	198
1586	90
372	68
1886	114
2456	170
4546	162
4542	194
1878	102
5204	180
2468	110
1776	132
3542	164
5242	202
7498	206
1740	112
34752	370
1000	100
3198	118
7974	214
7412	212
2370	132
5896	200
8904	220
3552	142
7838	206
6220	186
1968	100
1068	72
9156	212
2274	118
1344	76
2172	96
4178	154
5460	194
2482	110
10456	246
746	70
1684	98
2406	118
10404	228
2652	128
12082	266
7868	232
3286	156
1064	86
4716	156
22554	342
5398	164
5198	176
3644	160
660	76
4127	130
3412	142
7216	186
1160	88
2972	124
2314	114
4448	142
4804	160
9076	224
23574	380
10180	228
1934	110
2512	116
6600	190
10914	238
1300	92
5484	184
4586	166
11374	242
1778	86
2702	128
6216	184
3360	126
4894	156
552	84
16869	316
42252	456
668	72
11200	218
12114	274
3846	174
9718	236
13536	222
2918	138
3208	132
10188	214
9126	220
2754	114
16974	296
4164	146
5284	156
2088	132
1822	90
3060	146
3942	172
18925	318
2284	140
3198	118
5556	174
7452	208
1638	98
7332	184
8254	244
6203	194
5906	202
8724	178
2908	132
5194	192
8770	200
3210	144
10730	234
13836	262
2382	106
2039	106
1970	94
8506	212
1628	86
1690	106
2182	88
1798	122
758	58
3990	122
4368	152
46024	478
4892	166
12724	256
2156	124
4956	172
7000	204
2282	146
3816	156
9484	206
8860	196
2640	126
1386	106
3254	162
2930	136
6578	150
5664	190
1300	92
4166	162
7750	194
4048	160
996	76
1948	114
1396	100
9642	234
1344	116
6258	184
4170	144
1684	90
2702	130
13964	268
1540	76
1108	76
2712	122
5562	138
1672	70
3222	160
6246	190
676	56
1916	136
13262	240
1780	88
3912	166
9374	216
2346	118
3704	154
1230	78
4146	182
33980	264
3820	154
5850	180
6676	212
1750	108
6256	196
18052	316
17843	320
3886	136
1998	116
1892	124
6480	190
9366	240
1432	90
6260	186
9786	228
1594	116
4276	156
2580	106
6500	174
11362	250
3398	110
2576	112
4318	184
7132	182
2166	154
7002	184
35326	458
2354	132
652	52
1060	76
2796	144
552	72
4654	194
3864	144
14072	274
1748	98
1046	74
1606	96
9526	264
1820	122
2670	138
6978	178
5906	152
5192	172
1544	106
1404	96
4684	206
3424	146
1146	90
8484	238
4608	172
1052	96
920	96
6686	198
9096	256
2042	130
12422	258
6978	224
3620	146
4862	174
5464	188
1298	64
3254	126
8862	246
974	96
6848	188
3628	148
10230	214
7838	214
1000	80
1710	106
1600	112
5642	176
15666	332
7364	196
7752	202
3944	156
856	60
7020	206
5294	206
1446	106
1950	112
26074	362
9586	224
2334	134
5418	170
12226	242
2862	122
2248	108
1502	110
764	76
2718	118
2468	116
780	36
40133	384
7180	176
3296	152
4045	130
3644	162
17601	294
4424	164
2752	148
3640	128
8376	214
696	56
3762	168
15262	292
3050	128
1250	86
3946	156
4974	156
3954	158
3782	154
2958	102
2912	144
9802	272
6782	178
2438	114
2178	108
2266	144
1058	70
17454	322
19	7
4314	134
5594	202
15108	282
7218	248
1598	94
4488	140
3392	136
2778	122
7582	222
4230	156
27028	384
3860	138
1508	78
5746	198
1524	92
18754	300
1412	84
7670	216
6350	192
2394	94
3694	156
4446	164
7110	228
688	56
1825	130
1964	112
6894	168
6240	194
9224	226
1876	124
3882	166
4652	160
7012	194
1466	114
4266	160
5218	190
1624	76
8074	228
1706	98
528	46
6402	174
11744	218
4184	172
10574	242
8290	214
2582	116
9456	226
4906	176
4290	154
904	90
8054	210
1606	102
6168	148
2258	106
1580	112
6400	160
5972	180
4620	172
4740	158
2244	116
15636	306
11141	258
5526	174
3866	172
7634	222
914	86
4884	148
13876	232
1672	80
4492	140
424	44
3166	146
9118	190
5042	194
4062	132
740	60
10734	214
4158	170
6668	182
2852	126
2614	132
1526	92
2030	112
10660	216
3232	152
1370	114
24844	324
18700	310
2484	124
1446	74
692	62
526	38
2320	114
3210	162
1210	72
3882	138
2826	130
3088	112
2658	134
5952	202
3076	162
4914	146
4416	174
14952	302
1806	98
8048	240
1024	76
7764	226
4912	166
23486	338
6358	142
3596	138
1934	110
2626	138
3994	160
1914	98
3904	140
4932	154
3122	120
1520	96
2800	132
1186	82
3270	126
5292	200
2022	102
624	100
2416	116
7470	212
4862	160
8070	200
1400	72
4794	158
2774	124
12258	264
2452	112
6636	234
11506	240
5746	172
1586	86
5252	186
24172	390
6172	216
6186	194
10158	242
2282	114
3122	166
9698	240
4236	188
2852	132
2304	150
12608	256
12158	254
6076	176
5992	186
1464	116
1766	94
13170	254
3342	180
5878	164
1102	94
1966	106
4510	148
3328	154
6888	216
11467	238
1174	82
4800	170
6866	188
1848	96
3776	168
1724	98
2304	132
7298	198
2418	100
4078	170
5254	172
3512	152
11408	250
8308	236
2604	116
1042	72
6082	172
25646	292
2440	134
2494	132
3224	154
19	7
838	78
2372	118
3262	142
5892	156
4086	116
7234	218
1012	76
9456	228
6532	208
2934	114
2410	114
1416	80
5372	158
13898	290
3054	120
1670	90
3520	142
6706	178
15944	254
1516	84
2446	126
4526	170
2042	98
3062	138
3148	124
1896	108
6184	212
9070	236
3860	136
350	62
5262	134
3646	150
2446	106
3184	134
3592	144
10058	220
1264	94
3158	124
2836	134
2966	162
1376	100
9274	226
5878	172
2996	122
1620	124
936	76
2124	124
6376	228
11656	268
2458	142
2386	106
16519	262
2278	110
3510	118
3650	150
2276	128
10758	206
2836	154
1288	108
3302	138
8088	226
10880	218
4348	140
3120	124
496	48
3652	124
7384	252
1344	116
2818	112
1904	108
2950	166
4172	178
1236	84
1268	96
4658	166
2148	148
1454	90
1950	110
876	28
1272	94
7414	194
17951	334
548	68
13656	246
31284	378
1218	98
778	78
276	36
17252	274
4234	160
1756	112
5066	158
2240	116
12422	266
14670	262
2158	128
4018	146
1514	122
3378	102
7436	182
4122	146
9160	212
4450	170
2078	134
6638	174
2382	130
2414	142
2928	150
1578	98
1166	98
7450	198
6016	208
2346	126
4528	146
5132	196
1168	92
4788	178
2134	112
4794	144
1192	110
4882	214
3966	168
3194	138
1196	96
4658	194
1682	118
5726	190
8984	194
5994	182
5218	202
10350	240
6064	188
2818	168
1426	98
3058	130
4958	162
13824	262
1848	108
7248	204
2802	128
6780	204
1758	102
22263	318
2604	136
2494	138
5186	194
2768	90
1758	126
4758	186
3360	124
5710	160
654	74
3404	126
1984	128
2848	152
2498	130
5064	174
4624	180
3914	186
1742	94
1908	116
1374	98
11374	250
4270	154
4834	170
9912	252
1960	96
6662	158
3252	146
10266	186
1034	86
5558	184
5548	174
8702	232
3206	140
7444	220
4148	174
5844	136
3250	172
11558	284
4174	128
1198	76
14538	262
2342	134
1450	98
4698	138
11334	214
1500	100
3440	152
13340	316
6108	164
11856	276
2878	110
7910	222
4180	142
4350	152
12980	274
6970	206
2582	134
888	88
6444	196
8932	206
10144	246
8704	196
1304	116
4388	150
4466	136
10090	228
2856	122
3724	162
2228	130
1614	98
8164	196
2050	112
11076	260
526	54
4332	142
3918	136
4254	182
15251	250
1530	82
734	86
2348	144
2758	106
5786	178
16024	308
1372	84
3228	118
1174	82
3066	134
6208	208
1426	80
2404	112
2766	136
1244	96
8972	238
6740	204
4804	186
4490	170
2080	112
4952	180
3250	124
6743	228
2750	128
14902	298
4138	144
2172	116
2620	116
2426	130
1586	122
9602	242
4220	132
19954	302
1688	108
4882	134
2336	112
712	100
8890	244
7550	186
4388	172
5518	170
3892	132
8216	186
3004	136
4388	184
8578	220
7584	210
1330	80
7410	202
23388	374
5676	168
3900	126
10442	224
874	90
4158	160
5748	172
1184	86
2082	106
9260	238
4379	146
2756	138
3920	132
9404	228
13232	246
7746	222
2510	128
6648	178
5486	170
5150	178
5480	180
2400	120
1742	98
2450	110
9218	220
19216	336
7786	206
14598	296
1468	74
16002	312
13892	252
3176	164
6512	180
4292	166
606	54
1824	80
6556	218
12594	276
5336	134
9226	230
3364	132
2078	118
5774	162
8645	186
2030	98
4422	142
1552	76
2888	112
17066	330
2092	84
1954	78
10106	266
3718	134
1776	104
18790	326
4064	154
8562	226
2222	94
2898	106
2950	126
6750	208
1712	92
1162	66
6740	200
2842	122
3160	128
8560	244
4336	126
4936	154
5770	166
10964	236
4628	140
3246	142
4050	154
1754	108
3600	138
2182	106
4446	144
4918	176
2512	136
1754	92
1026	114
10370	226
1732	100
2128	92
3036	148
2034	102
3736	164
9996	240
8398	228
2934	132
912	40
1400	84
6668	198
3122	108
4614	154
4700	166
5232	174
4124	132
3150	94
2740	138
1236	86
7636	218
3340	148
6330	176
9538	202
6338	206
16048	318
7864	178
2208	138
6320	172
7948	168
2224	138
2064	96
3642	158
3914	140
6600	198
3350	134
4446	150
6608	200
3786	166
954	94
16018	286
35092	392
4162	140
784	76
4458	134
2122	118
11146	208
2042	128
3210	144
3986	166
1142	74
6094	206
7486	206
3992	152
2570	84
2498	142
24890	370
1176	80
1124	110
1548	92
4116	166
1794	74
3274	126
3186	164
4932	164
4074	170
4270	158
3052	124
2836	104
5972	196
700	52
3426	118
2910	106
8904	236
6128	196
1550	98
28380	376
5172	164
5722	210
4848	162
3810	156
4046	126
3296	136
2276	154
12072	262
2064	84
12380	264
2214	122
3214	120
5510	174
7050	208
2810	130
3638	128
15098	252
2202	140
19	7
2804	138
15788	278
2662	128
2742	130
2366	106
2058	106
760	56
2198	138
5586	164
20376	316
2270	114
2974	136
3268	154
1800	90
2022	98
3794	142
4382	160
18240	296
1812	104
6248	202
2520	182
6972	192
5459	170
1636	112
4692	182
21874	350
1424	92
10832	230
9548	248
2622	118
9350	228
3270	108
2912	130
4042	166
1616	116
5020	188
3184	98
4887	150
2320	118
748	68
5792	180
3656	134
5982	178
2856	96
8816	204
4802	160
8110	182
5008	176
208	32
4500	142
966	94
2500	126
30040	430
6234	202
3854	140
5396	176
1068	92
9928	230
7600	228
2396	112
1132	96
3700	150
9076	226
6288	212
5884	168
3104	110
2410	130
3048	132
3126	150
2154	106
5158	168
8334	218
7944	204
1622	110
4762	192
5868	170
10062	206
6690	174
1436	116
7332	212
7340	220
11968	266
1596	104
5132	180
2662	114
2030	118
3150	126
5578	214
1506	116
3288	144
4710	174
786	50
390	42
3088	140
3326	140
3214	140
530	54
4970	178
1894	114
3728	144
7202	186
2228	126
2486	126
3248	172
4558	164
2874	88
6754	222
5754	174
4068	172
2114	82
7950	210
1484	80
1086	86
1870	104
18474	306
8764	182
2190	90
1972	104
1620	92
2464	156
2276	112
3230	150
1620	108
5494	198
168	80
3274	164
1308	84
2080	120
19242	328
4379	188
6358	226
1370	86
2310	118
15774	306
2364	120
5048	168
1912	124
896	80
5338	200
13976	264
1216	92
2016	94
14874	274
6806	184
442	54
7914	200
7256	210
8912	210
1398	86
2772	132
3270	110
3788	150
4664	168
3264	112
5014	182
2450	102
3186	126
4248	134
14436	272
12132	226
1820	108
3264	148
3828	158
4152	156
2708	106
7676	220
5362	170
2662	134
6114	174
8318	204
2256	96
2688	116
10062	228
11812	270
2338	118
2380	106
2002	104
554	66
2862	118
4516	214
11970	232
6208	212
1648	98
10458	260
4370	152
7410	214
2672	130
8352	204
3274	130
4520	138
8948	240
31946	420
6918	198
1488	76
6916	214
6676	174
4882	158
3476	108
20903	310
7854	198
2158	114
686	74
1536	100
8292	244
5570	172
8302	218
3568	126
2974	146
6012	200
6218	210
7724	166
3324	168
2096	104
3938	154
2300	116
4906	146
8462	260
1418	94
9702	230
2082	120
1192	96
16392	298
5164	182
4324	154
2874	124
3456	116
6476	180
7652	230
1284	80
2128	120
4958	184
8428	222
3490	146
1246	102
2408	134
2056	136
2496	82
3868	182
1134	54
2398	96
4228	152
15880	234
13896	268
2046	88
6428	182
3362	140
28396	296
2022	96
626	66
3394	134
7096	184
5364	178
204	40
5220	164
1770	114
4378	130
10120	224
8072	186
10686	294
16956	292
9170	240
10454	238
1218	100
6434	172
2348	128
2048	112
15558	280
1966	116
1476	96
1780	106
12200	248
6782	188
3250	158
1254	108
9110	222
5608	154
1774	110
864	74
6076	184
2782	132
2258	124
4842	168
3100	156
3642	182
2424	96
5206	162
3031	120
5478	180
2030	156
736	80
2570	126
1546	66
3508	124
1060	98
5594	202
6644	198
2356	130
1680	120
4166	124
3608	160
3438	126
5418	190
3688	148
2774	82
7864	222
860	76
40482	388
5440	134
1692	116
2196	100
9140	218
6002	162
42538	462
8380	194
4196	142
836	88
2706	114
5702	198
8832	208
12802	244
1948	118
4634	176
6459	188
2476	112
15788	268
1028	78
11626	256
4670	174
1064	96
9742	224
984	76
7482	178
4514	154
1764	82
3728	134
1896	96
8234	206
1594	108
1388	80
3178	152
1862	108
844	70
1438	90
9192	214
7254	198
2050	108
1628	72
6393	178
13116	242
4160	164
2284	122
1560	110
6394	202
8526	200
11046	210
13193	256
8898	190
13190	264
3688	122
17424	312
724	70
7326	212
11146	248
4586	148
17040	288
1162	78
4244	164
6782	182
1886	90
9942	228
2468	144
3716	124
2660	108
8919	218
2982	134
7198	216
6516	168
638	66
3112	130
796	72
1668	114
6518	206
2982	134
2868	116
10774	260
5872	188
1426	94
3172	116
9224	194
5460	180
9834	194
4090	154
2986	142
6368	172
342	64
5014	162
3448	122
4346	158
1190	82
604	60
6810	202
1228	96
7494	222
9628	244
6660	210
2486	114
6122	172
1580	122
4064	184
2856	124
1622	120
1512	84
6716	192
3112	122
5580	180
3812	138
3032	132
13334	236
1176	96
4644	160
7786	202
6190	176
6446	182
11382	206
5232	176
4684	156
19	7
1240	90
6146	196
4090	138
8668	206
10056	256
5442	178
2916	124
4846	162
4076	160
6154	196
786	80
1572	106
6382	158
7410	190
8148	190
2540	98
9820	258
8366	208
2156	104
4330	188
1668	102
10474	258
566	70
7172	232
650	54
38774	458
11484	246
48380	450
9418	252
1322	92
4477	168
2284	118
1600	104
1556	74
850	86
3174	102
17668	312
10122	236
4024	170
2730	122
12622	244
1424	92
5296	188
7054	214
3986	160
19290	332
1352	88
10336	246
4232	166
6466	200
1918	98
6674	154
11402	252
54	18
1712	84
9234	204
4968	164
790	58
6824	196
7902	222
4794	152
5480	158
6964	188
5170	174
3248	148
1076	84
1614	82
3352	136
3940	142
3380	142
19676	270
15272	262
3762	136
3518	146
2426	130
2358	102
6738	178
4678	174
1772	100
1284	104
16304	264
2894	112
5878	186
2818	134
3224	130
2656	132
1212	100
1742	106
2148	96
2398	142
4388	140
1818	94
6822	202
12692	268
7542	216
7010	170
2602	102
2762	110
4012	148
5082	170
6946	202
15836	276
5506	164
3670	140
2434	116
19346	328
5464	166
6318	214
6438	190
1698	98
4514	178
1248	84
8002	210
7054	166
2790	132
5458	170
4590	172
14278	274
7178	248
15522	280
9922	242
3544	142
22494	310
2300	114
1008	86
3260	124
1802	136
1242	76
15946	286
10596	246
5246	170
3648	158
8864	212
8954	248
2622	130
1730	114
16482	310
44486	492
2114	122
7270	230
2168	132
7128	216
5908	170
4548	160
3968	160
3432	138
2650	86
2166	112
5764	156
16500	330
1050	98
2074	112
4086	172
7074	156
4184	182
11716	216
1722	106
4496	172
29614	426
1250	86
2468	96
4092	168
4316	170
1094	82
5298	136
2870	136
1172	84
9174	222
3710	146
1142	86
2006	112
3268	132
2868	134
4302	156
9384	234
1602	126
1560	88
31212	364
4648	166
2672	152
8218	230
2808	120
4394	198
2662	108
2562	146
7252	184
5278	158
10662	256
3122	146
3094	130
2754	142
6866	174
894	102
17542	278
17582	310
3956	140
2390	122
9896	252
3832	152
3248	144
3758	134
2564	126
3178	150
4056	160
18094	342
2172	116
24518	358
2522	130
1004	80
11100	254
1636	120
5008	186
5498	196
1686	104
5846	140
1088	76
712	72
11092	234
584	68
8511	210
2124	116
4092	144
8290	222
1418	102
3794	146
2854	146
2658	98
3672	120
5364	184
1046	82
1592	98
4328	176
10794	190
18678	282
2328	108
2642	144
2964	132
3658	118
12236	270
4614	168
11454	228
11552	248
2508	100
1830	118
6850	202
14094	324
13112	268
3916	168
2858	124
7678	180
19338	336
6126	194
4334	166
2612	126
2100	106
3967	176
1282	86
792	52
674	78
3528	132
1474	110
4276	174
5950	208
1830	88
5132	198
3690	126
2682	132
680	72
27156	352
1879	98
2278	118
14362	302
19156	336
5004	154
2468	134
2754	118
5548	134
472	50
1900	104
1386	112
4502	168
10354	240
3096	140
3064	122
5388	182
2300	120
2000	132
12480	254
10064	210
2530	110
3436	174
2578	134
11264	250
3230	176
3600	136
6496	144
9586	246
3962	162
4632	120
7588	208
2412	118
1786	122
4781	164
1742	86
4362	162
16400	280
5474	164
2750	126
1000	96
5356	168
7386	176
5096	138
21044	308
5928	140
3434	124
2250	100
3298	148
12750	290
5392	172
1622	88
3574	176
4222	150
2352	120
1014	82
4152	158
6864	176
1914	102
6358	198
3542	120
8828	204
10654	250
9844	240
1372	124
2480	144
4244	144
8533	260
3270	110
2112	102
7362	204
26474	368
9664	256
2996	136
2226	98
5496	148
3886	128
8138	180
4626	150
2314	114
1842	110
16331	244
2940	126
3428	158
7854	192
3768	152
2040	94
1148	66
3150	138
5492	182
8692	218
4512	140
4702	144
1834	122
1968	132
4870	168
13924	272
14058	272
1204	92
4678	188
1634	106
5786	174
11224	260
5278	198
3490	144
25542	350
13782	286
7382	226
3252	184
5260	170
7590	198
2660	140
5528	160
6030	200
2818	114
2182	102
3268	134
2298	106
1228	96
1440	94
1982	102
1072	80
10682	220
4436	158
1930	122
48718	388
1260	100
1374	92
3645	150
1140	60
7884	222
1416	88
386	86
3100	128
6629	188
5298	184
1320	108
3176	140
4100	140
4416	138
3874	140
8354	250
7162	192
13447	234
8680	222
3922	154
3826	146
8958	234
1696	80
2644	130
2598	144
2610	138
2344	124
2724	120
2762	112
34489	380
4194	168
3370	146
4440	146
3492	180
29040	392
3744	118
1188	92
3636	170
6584	180
4498	140
1886	96
2028	112
2436	106
1376	108
5620	184
6016	160
2074	74
3268	136
3942	176
3502	138
4884	166
4920	140
16052	310
7598	172
2034	106
1484	96
854	62
40638	464
448	56
6966	206
3138	114
11612	264
4886	172
5996	182
4336	156
332	36
19588	314
1174	86
26222	326
4272	162
3056	140
2724	120
4130	148
8314	254
2104	84
21390	336
1700	92
1216	86
2230	112
8180	212
3444	140
9926	224
1636	92
4176	138
1382	106
1438	110
1608	114
2636	116
4652	160
1660	88
2116	112
4248	146
14154	266
5358	154
2462	118
2100	116
6026	194
23094	350
1630	86
3706	130
1112	104
2274	90
3788	148
9430	198
4778	158
5196	148
3244	120
4714	148
1624	104
3170	102
6052	166
4328	132
3400	146
4428	150
2802	150
2686	128
5464	188
8782	198
2246	134
3862	124
5654	148
4510	148
3478	152
2702	114
2030	134
12944	242
2788	140
5258	186
986	58
4788	182
3674	130
2264	136
4574	148
5018	156
28224	378
2684	128
4780	184
8104	234
4976	176
2338	132
6010	180
8582	208
2120	104
1618	82
1584	114
9768	220
1578	98
5416	214
6736	206
1022	78
7510	222
3150	134
13810	246
4562	138
3798	134
2826	102
5840	164
7516	218
1534	100
3102	142
810	46
19234	286
3510	166
4521	146
26389	326
23234	360
8992	226
976	64
1338	98
2146	134
6170	236
2162	118
5264	176
1250	88
3302	148
9668	196
2892	114
3330	122
8030	188
2336	108
4978	146
3322	112
2068	118
17646	324
9450	210
6148	210
11498	252
2930	126
19	7
9630	230
620	100
3508	106
7376	204
3772	148
8414	206
6864	234
8076	200
7028	194
6074	172
5314	166
5726	192
564	72
6774	216
1178	90
1556	64
6564	172
3820	136
6004	186
3576	132
1894	126
958	98
3612	134
1076	80
9394	266
2644	120
13432	246
7176	204
7994	218
6484	220
8016	182
14022	266
1466	88
4790	168
3950	178
8506	224
6818	226
4650	138
3820	160
4590	158
9800	244
2470	106
7588	212
3426	134
2400	136
3794	138
5010	168
1744	100
7154	152
3448	134
1242	70
2454	132
13726	250
1824	102
1052	72
5252	188
57412	554
3018	162
6844	176
9390	234
3356	122
5556	190
2446	124
1602	102
3816	134
3984	182
1896	104
6936	184
2512	152
2724	130
4444	200
2152	106
2200	120
13152	238
1714	74
940	76
13790	270
2270	126
11528	270
2426	106
9126	206
9410	230
1858	130
5346	162
14322	262
16016	334
15358	266
9786	282
9294	242
5382	176
2482	152
3798	146
3314	142
4754	154
1344	72
4210	146
2080	102
3014	136
5974	214
3790	148
6020	184
3618	166
9695	224
7582	220
3762	146
6450	206
1534	86
7736	228
2398	146
1374	110
8676	216
2834	130
1528	112
2142	118
3244	138
1626	94
11700	264
7112	224
3046	128
11562	264
764	88
4418	168
1264	96
2268	122
8248	218
3238	128
8066	230
2560	92
1686	106
5332	130
5802	186
636	50
1384	76
1008	76
1680	106
2350	112
4282	166
8060	228
1616	108
12068	278
3658	146
2414	126
5384	164
8888	220
1254	102
3786	138
4896	172
1342	82
7702	176
2122	118
3538	130
10730	240
5512	170
4390	176
7628	166
13004	226
4238	140
7806	150
2800	124
1428	96
5252	170
12668	220
2798	152
1886	82
3028	142
3036	130
5400	172
510	78
10384	238
19	7
4950	190
2522	110
10768	254
2210	106
9170	206
1866	104
1296	92
2358	138
3632	112
14096	310
7258	210
5906	196
3492	150
10122	214
2298	120
3240	122
4404	168
10456	186
39658	468
3186	152
2668	148
7646	202
5512	146
2584	112
2886	144
576	62
13590	258
1612	104
3552	128
4804	174
1168	96
4370	160
1776	108
5176	156
5674	192
8414	238
2652	114
6090	180
2298	118
4740	162
4114	166
8230	250
2030	114
5266	186
3074	162
2568	126
8702	224
4980	156
1008	88
11160	262
9116	228
1914	110
3266	150
4152	172
8416	184
7848	210
4608	196
1712	112
5682	208
3440	144
6326	196
5850	164
650	90
9080	220
2906	120
2886	108
17784	318
4526	164
2134	120
1226	102
2128	112
2826	104
4944	186
2350	82
1954	110
3078	152
2620	120
3864	164
22152	332
3708	120
17168	296
4490	158
9170	214
9198	208
14224	296
6264	174
5840	170
5640	192
3630	170
12389	218
6088	188
2136	94
6728	184
1432	92
1974	130
8698	216
1978	70
1508	98
12451	260
2070	88
3034	130
2204	114
7776	212
2036	118
10526	266
4966	186
8716	216
6734	206
2648	126
4334	176
6130	166
2024	96
4408	164
1712	92
1358	78
2768	164
270	58
1106	86
2626	110
6388	202
2934	154
1568	120
2364	100
2960	134
7504	214
6090	178
6332	162
5354	156
804	68
1636	126
20904	340
7650	200
7692	206
3626	136
2634	104
2622	90
1036	80
2724	152
18546	310
6848	194
3810	156
1532	104
4148	162
9298	230
7716	182
4100	132
7830	230
5228	194
1226	86
1866	110
2958	130
1582	82
1500	82
6174	190
1628	116
6150	210
15158	300
3176	138
5008	172
1282	94
298	74
2673	128
6356	192
1992	128
3540	150
4664	184
3006	150
1856	104
700	80
5914	196
5732	180
1258	102
8088	206
3178	136
5612	212
3520	144
1526	98
456	40
18920	310
24534	338
1706	78
1640	102
6128	164
3076	108
4266	166
7662	208
8034	196
1282	74
2108	118
4012	154
5777	168
4794	170
392	28
3826	138
7944	218
6258	188
7486	206
2944	140
882	78
1302	84
5070	172
2288	108
2362	138
2918	144
3212	152
1338	90
3386	154
5848	214
4110	186
3564	146
6222	158
7166	200
5672	198
1092	82
4374	158
12154	232
5622	178
7832	188
1706	106
1586	118
4144	176
1444	88
2044	120
1750	94
23550	364
7188	186
10374	202
7658	186
2880	122
2372	172
22406	352
6120	194
568	68
2204	118
1968	144
2906	126
3370	134
4390	158
3444	140
1754	86
3016	150
5860	196
1442	88
52576	482
3976	148
2780	120
5736	172
4344	184
13008	216
2796	114
8410	208
2348	124
840	76
1252	68
920	84
11468	278
1882	100
3290	142
2164	128
4062	180
3954	152
8454	222
2406	130
3204	130
4196	140
3966	146
4870	162
3286	142
2318	94
7520	220
3432	146
2240	110
1444	94
4668	184
2630	84
1348	60
4590	142
738	94
822	84
3282	126
2774	118
2050	86
2354	110
4084	168
1494	98
2356	96
5906	162
13988	276
11102	248
