Score	Length
286	30
170	42
216	48
212	46
416	32
400	52
80	28
264	32
1298	80
610	58
776	74
202	42
60	28
3906	126
538	42
60	16
432	36
194	34
3674	102
872	76
600	44
112	32
162	22
516	60
222	30
238	34
24	24
154	42
254	38
506	38
160	36
1860	84
858	70
886	66
102	22
200	40
390	30
92	28
732	72
64	20
242	38
40	16
230	38
454	58
264	32
68	24
226	26
180	48
454	46
344	36
280	28
1564	82
106	34
190	46
200	36
150	42
588	48
324	36
540	76
442	36
46	30
188	28
86	30
50	26
1596	74
236	48
434	38
176	32
944	66
532	36
250	38
164	48
834	54
724	54
848	64
314	36
370	58
102	34
320	40
494	52
1070	70
46	22
498	46
510	38
70	14
584	46
276	42
102	30
638	62
242	38
162	30
740	52
784	64
148	28
388	44
1664	88
42	14
136	22
728	66
144	32
350	34
72	20
38	30
234	38
418	38
96	32
824	68
616	50
202	30
946	66
318	50
138	30
238	34
444	44
166	34
220	28
652	52
232	32
430	48
48	20
214	42
1416	70
444	48
74	26
428	52
162	42
946	70
178	34
150	40
64	24
578	42
450	30
884	64
394	50
396	36
88	24
1012	84
662	54
904	60
100	28
1908	86
420	44
166	34
1116	64
334	34
246	42
174	22
330	40
72	24
216	36
360	56
500	42
160	36
360	52
372	40
54	30
570	46
610	44
1218	76
1776	92
60	24
2074	78
268	44
406	58
98	30
712	60
750	54
634	54
608	60
742	50
292	36
564	42
412	40
222	34
1076	56
228	28
508	48
1534	64
208	28
284	36
1018	90
64	24
772	64
438	54
150	34
1812	92
2632	102
252	32
19	7
248	28
406	42
238	30
248	28
744	62
492	48
222	36
100	28
2024	100
492	36
2386	102
1340	68
244	28
206	30
210	30
394	50
2052	100
418	38
560	52
24	24
30	14
228	24
312	40
496	50
230	34
674	50
246	38
1088	100
38	14
26	26
334	42
438	42
610	62
978	62
342	30
88	28
704	56
722	46
2226	96
164	32
854	46
614	46
22	22
1552	84
258	42
96	36
108	36
704	32
266	42
110	26
538	50
940	46
330	50
124	34
196	28
678	62
1098	62
456	52
140	44
444	64
514	54
3584	112
368	44
264	40
924	68
986	66
184	36
742	62
310	34
19	7
2154	86
286	46
50	30
392	46
242	36
612	48
468	50
188	28
84	24
474	42
196	20
448	28
1964	96
510	46
1620	84
750	58
450	78
218	28
590	30
278	46
1218	78
2124	92
104	28
1466	78
2198	90
1556	76
364	36
512	48
836	64
562	56
198	38
326	44
274	46
5002	142
282	38
300	44
356	40
174	34
9586	174
186	20
1568	84
444	52
318	34
602	42
124	32
374	30
72	24
932	78
284	36
690	58
972	68
580	60
484	36
336	48
24	24
94	38
848	52
530	34
814	38
130	26
406	38
540	64
450	50
362	34
786	54
396	44
374	38
292	32
256	32
188	24
598	66
132	34
378	30
292	40
196	36
502	46
962	64
422	48
50	26
174	26
610	42
698	48
74	18
976	76
830	58
2424	100
1058	78
666	50
166	34
260	40
52	28
622	54
616	48
108	24
60	20
266	34
744	68
1980	78
558	48
420	44
170	34
98	30
90	34
498	34
864	52
1982	84
436	28
512	38
286	38
154	30
156	36
590	50
518	46
506	66
240	32
238	38
522	48
964	60
304	40
96	28
56	24
816	64
502	50
126	30
204	36
640	48
30	14
514	30
1580	88
316	44
640	34
238	34
390	46
112	24
1740	88
758	58
1534	70
524	40
404	52
66	18
798	50
238	46
24	16
2370	98
754	50
300	48
534	44
200	36
426	34
168	36
56	24
210	46
400	32
630	46
402	42
222	38
1402	66
604	56
78	26
96	24
104	32
190	30
134	30
168	28
78	26
1022	76
584	60
894	38
280	60
242	50
1278	78
220	40
216	20
366	30
1168	66
782	62
478	50
214	38
88	24
352	54
1676	88
518	34
178	26
1500	60
142	34
200	32
612	58
396	40
666	58
210	26
442	58
82	22
66	22
462	66
19	7
380	44
64	40
334	42
60	24
954	70
38	22
264	40
346	42
760	62
362	50
1066	64
634	46
550	50
224	40
94	30
820	52
1738	86
334	40
328	40
98	30
288	36
390	46
180	32
444	44
242	30
348	48
1468	92
542	54
294	38
36	20
148	28
850	58
386	40
1062	82
382	46
468	56
6306	146
1020	78
694	46
242	34
19	7
552	48
106	34
1024	84
184	28
98	30
392	36
952	60
1914	80
256	36
56	28
600	36
228	40
62	18
286	46
350	46
1318	74
1394	66
840	58
82	22
410	58
170	34
478	38
472	46
44	36
572	36
74	30
960	82
276	36
736	42
1050	58
428	48
210	34
332	42
602	58
140	28
98	30
600	46
2464	100
828	46
964	60
1188	70
528	44
82	26
180	32
1410	70
110	30
302	34
768	68
762	70
204	32
60	28
1032	70
348	36
242	30
288	48
842	68
248	24
72	24
160	36
202	40
122	30
342	64
330	42
304	36
130	26
416	32
64	24
382	50
304	40
54	30
462	62
454	42
522	66
144	28
508	40
446	48
96	28
164	36
420	48
722	34
38	22
84	24
116	28
102	30
572	48
1176	52
814	74
154	30
1908	76
1096	68
1136	80
162	30
926	66
42	14
92	32
664	60
470	50
176	40
120	20
620	66
132	36
262	30
182	34
896	66
390	30
82	26
1130	64
308	44
476	52
706	70
996	56
1504	80
554	58
716	56
256	48
302	38
204	40
764	70
294	38
150	38
86	30
274	38
64	32
876	64
116	28
448	44
278	38
722	38
218	34
128	24
1366	86
90	26
144	32
392	48
1562	86
432	44
284	48
1282	74
744	48
116	36
1322	70
54	14
50	22
362	46
120	28
814	66
388	44
1116	68
148	32
800	48
624	68
358	42
156	32
9489	170
48	24
590	58
566	46
58	18
164	28
442	38
190	38
518	38
1686	88
538	50
90	22
250	54
120	32
152	46
772	60
816	44
1088	74
246	34
314	34
342	30
86	30
522	54
486	50
448	44
582	42
538	46
1688	68
494	32
206	26
436	36
598	62
462	42
570	54
638	52
166	38
428	50
78	18
601	66
546	62
642	54
298	42
260	40
426	50
162	42
216	32
326	42
1554	92
676	48
634	50
474	58
318	40
460	44
674	58
800	64
448	44
376	36
590	36
802	66
160	40
458	50
1222	76
32	16
286	38
644	56
146	34
174	34
362	46
974	58
284	44
82	18
2424	86
1564	84
300	48
1944	92
34	26
196	44
1180	68
1448	58
404	32
54	22
362	42
428	52
410	26
172	20
418	26
480	44
5006	136
1140	68
930	46
188	28
64	24
468	44
226	34
278	42
408	40
1800	100
144	32
704	56
588	52
1170	82
578	42
96	32
742	46
74	30
598	46
46	26
384	32
58	26
200	36
794	58
308	32
1288	82
972	48
452	52
154	30
620	40
366	38
382	26
172	32
508	48
242	42
1012	66
90	26
118	30
504	44
118	30
110	30
1032	76
186	50
80	32
120	40
212	40
530	62
42	22
204	28
730	54
144	36
336	24
92	28
234	38
454	42
598	66
128	36
476	50
482	50
692	32
940	74
652	52
74	22
322	34
302	32
154	34
814	54
252	40
232	40
1182	72
80	32
550	56
110	30
616	42
142	42
172	32
88	28
464	52
60	28
2306	86
1888	94
1874	90
92	28
520	48
386	34
302	38
536	52
2168	92
246	38
140	32
114	28
118	30
78	22
104	32
616	40
254	30
206	18
508	44
78	26
84	28
102	34
84	36
4836	140
222	26
566	44
1304	64
1358	76
122	32
382	42
114	22
748	50
176	36
298	38
1594	78
894	58
644	60
320	36
1300	76
216	34
1096	68
58	22
60	20
216	44
110	30
450	50
462	42
58	22
270	42
516	40
68	24
974	54
512	52
580	36
102	30
1376	76
108	28
714	50
324	52
558	46
244	42
68	36
198	38
19	7
1138	70
162	34
588	54
400	48
590	42
278	46
274	38
646	50
154	38
662	58
1098	58
124	24
300	32
892	52
458	66
120	40
462	50
504	48
422	42
1492	76
1058	80
2288	120
314	34
204	52
132	32
298	42
666	44
166	50
246	42
644	40
436	50
404	60
106	30
160	32
956	52
1206	80
650	54
96	32
616	60
638	54
356	28
320	36
820	66
788	60
198	42
186	38
926	74
19	7
290	34
1428	86
70	28
1126	66
238	34
1484	76
716	64
378	30
124	32
174	34
1848	116
90	38
728	58
178	38
184	40
148	36
68	28
508	48
204	32
386	38
484	40
172	24
268	44
156	38
268	36
1010	78
170	34
222	34
790	44
252	28
140	32
196	40
156	32
38	14
528	38
238	38
1082	58
114	22
248	44
336	40
1180	64
388	48
286	50
40	24
368	42
204	36
1432	76
756	54
564	50
670	46
540	56
1228	72
138	34
414	62
112	26
254	42
306	30
768	56
1256	72
1398	84
194	30
556	44
378	54
76	28
160	32
508	44
476	44
524	48
30	22
1794	98
298	42
56	32
218	36
278	42
262	34
370	50
150	30
510	46
340	40
282	38
760	52
514	52
386	46
474	34
174	38
470	38
1850	116
24	24
620	48
240	52
690	54
116	28
976	60
320	48
550	50
3264	98
448	32
260	40
1328	78
140	32
62	38
34	26
150	34
146	38
82	22
52	24
378	44
702	46
918	58
2420	112
94	26
166	22
98	22
1810	86
646	54
986	58
2620	90
136	24
312	34
660	60
646	46
1164	74
798	68
66	42
128	32
288	40
1268	80
164	40
1522	64
132	28
564	36
320	32
402	46
98	34
64	16
418	38
1852	88
500	40
122	38
94	30
594	62
110	34
316	36
178	32
392	56
540	48
466	48
434	50
562	46
942	62
252	36
1878	82
19	7
1320	92
42	26
146	30
252	40
56	28
1850	86
708	48
228	42
328	52
658	74
318	38
326	42
112	24
112	28
420	40
472	44
1158	82
726	58
622	46
966	58
468	40
452	56
566	46
70	26
148	28
1156	56
334	58
410	34
852	54
570	38
278	34
434	42
456	44
242	34
682	48
278	34
86	26
656	38
290	38
372	46
26	18
128	36
208	36
92	32
1312	72
338	30
620	48
194	32
378	54
778	66
652	64
3432	132
484	40
44	24
368	36
226	34
828	68
60	44
700	56
544	60
88	24
608	36
634	54
474	34
148	40
178	30
72	28
178	26
432	44
1018	66
38	22
924	60
436	36
98	26
354	36
366	42
280	44
208	36
402	58
1478	80
206	26
52	28
184	32
56	28
690	52
648	60
770	66
116	36
48	24
336	48
46	30
214	46
754	40
388	44
608	56
408	52
174	22
524	52
206	34
334	38
1138	70
156	28
308	38
216	30
618	50
286	38
398	44
332	44
454	58
570	30
194	28
98	26
298	34
152	36
310	50
70	26
424	32
464	56
292	28
574	44
640	72
226	30
1716	96
188	32
524	60
692	44
64	24
406	42
550	46
312	46
422	30
782	50
732	52
378	42
644	60
344	48
1154	68
1038	80
250	46
1200	84
1380	80
62	30
358	62
302	38
284	36
472	48
79	15
380	36
30	14
1072	60
64	24
144	28
124	28
340	44
702	42
192	40
210	32
19	7
220	68
19	7
104	44
246	38
402	42
514	42
472	56
136	36
52	28
2602	106
344	44
198	54
1376	78
268	48
146	24
704	64
474	46
276	60
62	22
480	40
1052	68
224	40
1190	66
258	30
338	58
150	32
116	28
258	38
340	28
64	24
476	40
112	28
464	44
206	34
512	40
1392	96
170	26
80	32
86	26
216	30
258	38
480	44
62	26
50	26
52	22
288	32
256	24
670	54
368	32
734	68
96	32
604	60
904	52
598	58
624	36
48	32
232	28
388	28
48	28
44	24
1254	78
374	62
684	56
814	58
66	22
448	36
1054	76
90	34
184	36
168	28
4892	130
236	40
236	28
494	46
532	48
368	36
336	40
280	44
76	24
412	36
342	42
172	28
188	44
2158	104
148	26
222	30
580	40
226	30
450	54
494	44
312	48
866	78
236	40
1714	88
362	34
488	44
364	40
286	30
238	26
120	32
414	38
206	38
1332	62
868	60
570	50
554	46
400	52
990	82
96	28
254	38
408	44
70	26
142	30
862	66
1182	58
298	46
128	36
486	38
1026	80
86	30
190	34
592	48
618	62
160	34
74	26
408	28
90	34
70	22
200	32
274	46
166	30
144	44
2074	98
464	44
3282	100
354	38
469	54
62	34
412	36
532	32
382	50
652	44
202	38
52	16
440	48
116	24
150	30
1578	84
76	24
526	54
102	36
110	38
262	38
690	66
374	38
548	52
1068	60
150	38
68	28
2128	92
366	46
848	50
4366	138
468	50
84	24
464	52
98	30
646	52
270	46
414	32
228	36
764	60
1490	74
190	34
194	30
176	30
692	66
180	44
308	40
478	38
392	20
364	48
322	34
786	54
742	54
60	20
240	36
612	44
180	32
662	42
990	50
408	52
192	40
192	32
274	34
832	64
78	34
190	30
28	20
560	44
344	32
60	28
382	50
184	36
134	34
1754	94
334	46
136	24
152	30
466	46
356	52
154	26
512	52
430	38
750	62
426	46
226	30
336	40
48	28
686	58
558	38
554	42
464	44
804	48
198	42
340	44
1002	70
632	58
362	38
546	54
1862	96
548	42
334	46
316	36
96	36
72	32
108	28
916	64
278	38
458	36
348	28
268	28
464	48
48	24
472	48
452	62
122	34
102	32
192	28
374	54
512	48
156	28
268	40
1354	70
118	30
2262	98
310	34
644	40
760	60
1622	78
1216	72
1572	92
230	30
570	58
240	36
330	38
64	16
1092	64
346	44
512	28
1866	92
128	28
372	40
296	44
72	16
528	48
1426	94
152	48
1116	60
300	44
1186	72
106	30
124	28
434	54
312	40
2566	96
162	26
398	26
206	22
23	9
642	54
350	32
594	66
294	26
102	26
264	32
352	44
306	38
296	36
308	44
1362	86
532	44
208	40
92	24
546	54
856	48
202	22
196	52
380	36
534	48
416	32
7072	172
82	26
246	26
252	32
318	50
788	60
420	52
304	36
566	58
166	46
334	46
1188	78
1462	72
56	16
296	44
274	34
844	60
952	68
46	22
150	26
488	32
78	30
254	36
600	72
548	56
476	40
866	66
600	40
138	42
218	36
1174	58
264	32
596	36
1032	76
750	50
188	44
22	14
1096	78
342	42
138	34
242	42
980	72
32	28
1038	58
36	28
156	28
2472	92
2344	90
234	42
622	46
482	40
390	46
368	32
32	20
220	32
118	34
494	58
394	46
104	24
320	40
934	56
78	34
478	62
142	30
656	72
410	38
170	38
482	34
40	16
144	34
442	42
148	36
860	48
84	20
252	32
84	30
254	38
176	32
410	38
756	60
76	16
872	56
128	32
278	42
210	42
62	18
566	50
256	28
574	48
546	54
1346	72
488	36
158	26
488	32
544	50
178	34
1132	88
338	42
194	42
768	52
238	26
126	38
1024	76
440	46
374	42
132	32
502	48
502	42
376	44
420	40
690	58
158	30
106	22
160	38
272	36
200	24
712	44
590	58
284	42
264	36
656	60
36	24
308	36
202	38
542	58
164	36
244	32
264	36
218	48
148	32
254	38
2566	116
642	66
366	38
304	48
190	30
1434	88
1172	64
1384	72
268	32
882	66
138	30
686	72
404	60
286	34
328	48
242	26
484	40
454	54
26	22
188	40
4314	134
334	34
492	44
688	50
352	36
1264	82
308	46
248	40
292	28
44	16
360	38
1612	88
934	82
116	36
780	56
388	38
562	54
182	46
176	36
538	56
928	48
762	58
506	42
248	40
592	50
76	38
304	44
602	64
526	42
36	24
934	46
298	42
778	50
464	60
366	50
334	50
534	46
1110	60
498	54
118	26
1200	68
102	30
206	32
192	40
526	46
242	38
106	26
218	38
566	54
382	48
536	36
914	66
182	34
198	38
1222	74
256	44
144	28
62	30
146	34
2928	100
156	40
590	54
144	40
1954	90
454	50
1296	82
476	48
314	46
434	34
270	42
86	34
1830	80
662	46
234	30
588	48
152	32
678	46
512	50
542	54
86	26
348	44
314	42
702	38
562	66
864	52
756	44
626	52
96	20
1260	68
1164	68
1344	76
180	40
140	32
34	22
502	50
1136	60
500	40
838	74
260	52
616	68
318	36
748	60
190	38
88	20
202	46
518	60
326	54
26	26
100	28
36	28
150	34
980	64
1034	66
402	58
256	36
102	34
298	42
592	48
144	32
1732	80
176	36
1080	60
972	68
568	52
720	52
352	44
1884	82
152	34
142	42
250	30
510	38
1068	80
416	44
478	50
138	34
768	76
160	24
1142	70
836	62
274	40
154	30
430	44
90	22
198	14
1786	74
754	50
796	50
336	36
50	26
956	78
478	66
264	32
170	38
192	32
250	38
486	58
340	42
470	58
786	54
636	52
604	60
1004	70
290	46
112	28
236	48
40	24
364	36
542	40
182	34
148	40
362	42
22	22
962	66
63	15
562	50
372	44
388	48
298	34
76	24
280	52
180	28
256	44
390	34
346	46
348	32
162	42
2470	106
1231	78
682	44
480	36
658	54
134	50
208	28
288	44
276	40
1328	64
420	44
452	40
298	38
446	38
388	44
224	40
680	40
810	70
300	28
280	40
200	36
368	40
724	52
3180	124
224	52
422	32
440	48
122	34
460	52
164	32
36	24
2058	86
88	44
78	26
206	42
752	44
168	40
184	36
510	40
788	48
96	32
244	40
428	48
406	34
3314	122
2164	80
244	40
54	22
98	34
1186	74
1722	80
100	28
204	36
270	46
140	26
122	34
54	26
206	30
204	40
52	32
1922	76
536	44
308	44
528	52
208	40
222	34
210	34
64	32
1352	74
42	14
428	40
310	26
84	24
2234	86
148	40
470	46
290	38
262	42
378	50
668	40
482	34
234	38
3456	134
120	32
92	24
1038	58
1070	72
456	56
296	32
50	26
118	30
70	22
410	42
934	66
164	36
870	58
122	22
544	48
94	28
302	36
182	46
300	24
868	72
1184	56
512	64
3932	106
240	28
36	28
192	32
344	44
578	50
1026	54
128	40
70	26
950	48
800	44
1992	90
112	28
408	60
124	36
264	28
132	36
386	54
240	40
314	42
358	34
352	40
452	56
374	50
26	26
24	24
24	24
64	24
124	32
1496	88
290	46
92	24
578	50
384	48
216	28
432	40
144	32
250	34
446	42
178	22
68	36
1302	74
50	22
308	36
1008	72
410	50
232	36
876	56
66	26
92	28
64	20
1030	50
546	46
276	32
208	20
1174	78
2218	100
782	46
676	52
446	56
172	48
976	58
794	62
472	52
132	36
68	28
126	30
570	46
758	66
868	52
54	22
570	44
528	40
334	38
1216	72
592	46
174	34
1246	80
192	32
1068	68
244	28
124	22
358	30
266	36
1060	64
422	42
194	48
180	44
206	30
56	24
114	30
246	46
270	30
202	34
64	32
786	46
862	54
56	28
2536	100
552	40
5084	152
134	50
1200	68
200	40
364	48
148	32
648	48
208	36
1064	76
96	32
594	54
224	28
834	48
3032	126
252	36
636	64
4212	126
1430	62
242	30
365	48
332	36
62	30
236	48
1166	62
436	42
1148	68
94	26
956	56
260	44
236	40
500	56
492	32
340	40
88	32
718	62
1710	72
154	32
1114	82
1276	70
398	40
210	30
196	32
440	52
320	36
172	24
620	44
536	60
384	44
1472	86
154	38
408	36
602	58
406	50
194	30
530	40
290	38
748	60
504	40
186	42
466	36
448	40
2402	90
314	42
308	32
156	20
324	44
160	36
450	50
276	36
158	34
152	36
1280	78
196	40
154	26
738	62
224	24
816	72
286	38
54	22
776	52
132	24
540	50
238	30
468	48
592	44
372	44
382	36
620	48
700	52
118	34
900	68
144	24
3624	124
342	30
284	36
138	38
652	52
448	36
106	34
286	46
674	54
70	22
126	28
108	32
3032	96
814	46
458	38
560	48
218	34
1308	74
362	36
62	26
354	30
482	42
64	28
318	34
36	36
128	36
2158	106
2274	98
278	38
1282	80
154	42
112	24
190	34
150	38
732	58
600	52
366	58
166	38
2570	124
864	56
374	54
468	44
376	40
2098	82
44	16
2850	106
140	28
364	44
434	56
2204	84
250	42
362	26
992	52
710	42
560	48
74	16
250	50
400	46
154	26
110	30
736	76
770	66
2764	100
452	40
1354	76
2260	96
220	30
254	42
924	64
72	24
258	22
584	56
1050	66
300	40
346	42
476	64
222	54
170	38
462	38
840	68
232	36
38	26
520	48
246	22
1912	72
1258	82
868	50
144	30
308	40
646	60
1018	56
440	48
766	46
56	16
766	78
334	30
70	30
360	38
208	28
116	32
1836	100
752	56
396	44
100	24
392	28
636	50
770	62
272	24
238	30
298	34
58	34
498	50
246	38
616	48
78	34
24	12
126	24
178	34
96	32
1364	76
514	36
598	70
458	48
836	54
510	46
434	38
88	26
1216	72
214	30
316	48
406	52
562	54
330	40
110	22
888	50
768	48
250	38
644	48
312	44
940	64
112	22
766	72
316	32
1062	80
414	46
176	30
422	34
364	28
1048	72
202	30
494	40
380	44
88	24
532	56
46	30
64	24
268	32
320	40
348	52
388	48
432	32
1764	84
366	54
74	30
92	28
1274	74
638	50
300	36
1496	68
256	30
232	32
176	32
186	34
916	52
92	24
212	32
948	64
480	56
66	26
2488	96
158	34
64	20
222	34
350	50
1008	64
156	28
622	46
884	76
242	34
418	34
650	36
434	52
734	70
866	68
916	58
97	52
478	50
1218	80
384	44
986	46
896	56
114	34
100	28
508	60
396	36
348	36
126	30
238	42
964	68
600	44
1486	68
518	38
189	34
66	26
442	34
318	34
996	64
268	36
470	50
438	34
1478	74
436	44
216	32
142	30
62	22
222	30
92	24
164	36
224	36
616	44
598	58
576	52
160	32
610	58
1366	66
370	50
200	36
222	38
430	30
1050	66
432	52
196	32
210	50
196	40
284	48
484	40
434	54
226	30
312	44
1115	68
5104	140
104	38
1054	70
358	50
460	38
42	26
92	24
540	48
102	30
86	38
300	32
6386	162
366	46
284	36
584	66
332	40
678	54
132	24
96	32
126	26
990	58
412	62
672	52
398	30
310	56
494	50
596	48
216	56
160	36
302	46
720	48
1248	76
1118	60
248	32
232	32
52	28
174	34
406	46
458	42
414	40
1443	88
1642	86
604	76
42	18
230	34
162	26
82	22
882	64
302	34
254	40
906	74
534	42
414	54
78	30
194	38
294	34
190	36
152	36
1088	64
408	46
216	36
58	18
572	44
272	32
600	56
158	34
186	44
210	38
384	52
1470	80
126	30
256	28
1126	66
266	30
256	38
372	44
224	44
66	30
504	52
866	50
92	32
712	68
174	32
512	46
104	36
90	34
1174	70
80	16
534	42
236	34
262	46
1024	60
302	34
450	50
410	58
48	24
114	22
558	40
522	64
206	30
174	38
226	38
2366	94
1910	86
644	56
118	38
246	30
1030	64
492	44
212	40
2068	100
432	40
132	40
132	32
52	24
542	46
710	58
1350	74
788	76
190	42
600	50
48	32
176	40
380	48
754	70
394	26
316	36
770	74
788	58
104	40
54	30
268	36
418	40
588	40
220	32
104	36
26	18
248	28
36	28
1594	72
674	58
102	34
110	34
254	62
174	38
212	42
50	22
446	38
54	26
840	72
190	30
46	22
620	48
60	16
52	24
90	38
450	50
236	32
232	32
32	24
532	52
430	38
1598	84
102	30
19	7
90	30
1078	74
358	46
1064	68
332	48
768	74
114	28
222	38
1714	110
94	30
948	60
120	28
564	48
452	40
948	72
790	48
4838	124
510	54
70	22
196	32
280	48
434	46
2006	96
126	22
126	38
138	42
240	40
712	60
356	36
594	50
678	52
386	38
110	30
50	14
506	42
182	38
588	40
882	58
432	46
282	38
1004	60
980	80
328	48
192	38
618	38
634	46
276	36
32	24
214	38
524	44
220	36
256	46
40	24
476	52
604	62
184	44
388	48
188	30
616	60
544	52
318	40
232	28
718	64
338	50
492	40
268	36
462	58
186	34
2218	106
436	40
364	32
48	24
540	60
2104	92
302	34
944	54
354	38
420	52
176	32
616	68
302	38
700	40
1602	70
148	40
42	22
1156	64
1436	72
1792	86
106	34
538	46
208	44
416	44
266	46
436	36
739	42
876	48
308	44
90	26
436	44
858	54
1468	78
108	28
530	58
432	32
318	34
374	48
340	52
178	14
92	28
64	36
228	36
462	38
200	36
442	42
422	40
806	54
122	26
58	26
262	42
394	26
368	44
1200	72
486	42
3534	92
80	28
782	54
748	62
230	38
458	50
558	44
814	68
1970	90
286	38
102	38
228	36
2452	88
460	40
328	36
474	54
880	60
808	56
626	46
68	36
1218	82
120	36
246	26
1390	84
748	56
668	68
190	34
212	44
152	32
384	32
480	32
380	48
422	44
436	44
180	36
238	38
658	42
1138	66
124	30
66	34
622	60
190	30
320	44
352	52
34	26
804	58
172	56
260	32
440	60
1044	52
292	32
152	40
318	42
1080	66
810	54
504	44
254	42
228	40
100	28
770	50
124	32
332	36
402	52
1962	106
48	24
632	56
316	32
36	24
28	28
424	52
814	90
184	36
94	26
42	34
270	38
858	62
564	44
188	32
38	30
346	50
696	52
206	42
270	34
734	50
620	50
130	38
158	42
556	44
130	26
82	42
1526	82
296	38
126	26
1558	94
464	40
324	28
3522	104
918	62
240	28
82	26
1004	60
170	30
192	32
396	44
338	38
520	40
186	38
598	50
108	40
784	40
70	30
414	44
464	48
74	26
82	22
1784	80
162	30
1094	66
500	58
264	44
266	42
244	32
1134	94
816	54
280	36
206	22
228	32
244	44
1538	66
30	26
786	44
1284	76
304	48
394	32
564	72
300	32
218	26
264	52
326	26
456	44
474	42
366	50
980	60
202	34
418	38
532	46
386	46
42	22
656	56
118	30
338	46
962	66
266	26
538	60
22	22
866	60
412	36
968	80
304	44
28	28
76	32
116	28
354	38
568	56
688	58
676	44
410	44
358	54
198	34
306	42
242	34
3214	120
440	38
162	26
124	36
184	32
240	40
62	22
86	30
122	34
180	24
386	38
280	44
266	34
304	28
328	64
1012	64
458	42
274	42
1066	86
168	32
1488	74
1462	74
470	50
1006	58
92	24
222	38
718	46
574	42
42	14
148	32
204	36
368	24
152	34
176	32
822	66
316	28
882	58
686	66
82	26
64	32
232	44
460	44
622	62
568	52
958	60
262	44
1470	88
418	46
272	32
332	46
240	40
44	28
454	58
266	38
22	22
1376	82
1154	70
204	52
460	64
300	34
1898	82
476	52
3550	128
280	36
1992	102
254	42
5976	160
432	52
970	54
312	48
460	32
2002	86
734	54
62	26
336	44
1118	80
628	50
372	40
338	54
214	40
78	30
388	40
336	34
334	34
180	32
246	38
1232	76
336	44
148	24
1498	86
1286	76
628	52
1366	84
150	46
1084	56
3272	116
840	52
19	7
704	70
498	44
1815	88
80	36
862	60
92	20
38	30
108	32
430	38
256	36
494	50
330	30
152	38
484	56
790	66
216	28
1916	88
2070	106
944	70
918	58
64	24
372	38
732	68
150	34
350	34
4616	140
860	64
94	34
52	20
870	74
350	36
788	44
32	26
438	38
306	38
440	44
52	28
270	38
189	40
684	64
548	50
76	28
606	46
104	44
710	54
82	22
356	40
1258	70
436	56
28	16
446	54
328	28
664	56
124	40
636	36
104	32
54	14
280	32
834	54
510	58
232	40
128	28
394	22
328	44
916	58
3146	110
70	22
486	46
1074	62
3958	114
194	38
590	54
212	44
40	32
200	36
666	58
2400	92
394	30
750	70
138	28
1086	78
76	36
304	48
248	32
394	38
452	52
680	42
218	40
40	20
392	40
808	64
648	52
480	48
162	30
484	48
160	28
670	54
1584	82
264	30
80	28
760	66
338	38
104	18
86	26
656	52
126	30
484	40
946	60
474	42
1124	60
744	64
258	42
100	24
914	80
154	26
782	74
288	44
716	60
396	36
512	44
474	50
638	66
1960	78
324	24
352	36
316	48
218	44
340	44
514	58
1756	92
832	76
336	32
62	14
310	38
1084	60
158	30
120	28
1808	84
352	32
408	48
282	26
216	40
162	34
228	44
114	34
70	26
288	36
40	24
410	58
1998	92
100	28
248	40
254	42
198	30
212	40
178	34
150	36
552	64
362	34
358	38
538	62
696	68
640	54
466	42
160	28
2136	76
210	34
1410	78
88	24
362	58
1512	76
452	42
278	42
816	52
196	32
2744	124
106	30
226	34
524	52
142	38
456	46
6176	136
112	36
684	44
478	58
300	32
662	62
78	22
19	7
1464	78
480	32
260	36
592	48
804	48
536	58
228	28
2014	94
190	34
114	30
246	50
910	56
134	34
276	36
46	18
1010	74
388	44
296	52
612	48
19698	268
914	70
692	52
488	40
122	30
168	32
84	36
264	32
220	36
92	32
162	28
146	46
72	24
258	34
796	64
50	34
8190	178
232	48
434	42
80	28
248	40
352	48
338	22
932	72
466	52
562	74
60	28
172	36
422	46
336	44
426	56
96	24
212	56
254	46
582	44
312	28
152	28
1776	76
3624	136
354	42
2176	104
130	38
242	34
140	40
136	24
152	28
608	60
2984	104
506	50
184	32
322	32
268	30
360	40
1242	74
48	24
98	22
114	34
1922	94
320	28
274	38
654	54
818	74
566	46
290	46
644	32
360	48
602	54
702	62
654	34
640	52
434	34
480	36
402	38
1722	84
1396	80
230	42
604	52
376	60
252	36
1252	68
354	46
134	26
304	44
402	46
52	24
1406	70
462	50
374	38
458	42
122	34
790	54
2068	96
2318	106
1112	70
560	58
114	44
606	48
246	38
666	58
146	42
1056	60
60	24
890	54
456	48
276	34
382	34
2142	98
3420	124
78	26
652	44
1264	64
338	26
1384	68
120	28
2416	88
308	32
128	24
92	36
3452	110
352	40
252	36
1016	104
272	36
276	32
898	50
318	34
1642	100
708	52
88	20
252	44
544	52
904	66
362	26
382	30
76	28
1030	56
484	48
314	42
262	34
330	46
564	52
754	40
212	32
598	42
212	36
438	42
102	30
1100	56
820	84
708	52
88	20
626	58
88	36
26	14
852	72
88	24
64	20
176	30
42	26
212	36
366	38
120	28
262	50
172	36
150	30
514	46
1208	78
202	38
314	58
244	40
184	48
922	56
450	42
320	52
128	36
2590	106
656	46
170	42
270	50
46	18
170	30
78	20
830	70
476	88
310	54
70	30
344	50
112	32
410	42
344	38
732	40
648	48
742	58
114	34
1532	78
1669	100
210	50
540	58
182	42
410	36
272	48
30	14
878	62
72	28
942	68
100	32
146	38
1560	78
1642	82
284	44
410	30
1090	84
1128	56
1082	70
138	34
292	48
22	22
522	46
62	22
1896	96
158	30
194	26
680	60
234	34
104	32
660	52
572	46
222	34
628	64
606	56
718	64
782	52
2112	102
386	50
100	32
54	14
286	34
202	38
166	38
1096	60
460	36
222	26
692	56
472	48
500	60
184	28
230	42
974	72
628	50
60	20
420	40
96	40
228	50
392	32
790	54
768	64
648	64
444	40
1174	82
144	36
1142	76
204	46
328	20
188	32
736	48
19	7
268	52
1086	98
240	44
710	54
572	60
442	56
2234	92
508	52
330	34
574	40
922	74
1208	76
348	36
186	26
74	26
756	64
50	18
576	48
1116	56
502	50
134	38
128	24
300	60
1632	70
130	26
896	60
162	30
90	18
854	54
676	44
218	30
190	36
384	44
360	48
92	26
266	38
300	50
1138	78
132	24
1322	74
432	52
620	52
516	52
130	42
470	54
228	36
926	50
396	40
286	54
268	36
54	14
572	62
980	54
180	40
1046	50
252	36
816	60
348	60
654	62
392	48
458	58
582	42
98	30
908	54
48	32
586	44
146	34
2386	124
576	32
318	26
838	74
256	36
58	34
710	58
1104	66
1366	86
262	36
392	54
376	40
132	32
182	38
298	32
204	40
278	30
424	52
316	36
40	24
1368	84
674	58
178	34
960	60
564	44
252	36
414	50
288	44
260	48
328	40
406	26
426	58
316	48
128	28
112	32
320	28
296	28
552	46
496	36
46	30
284	32
268	32
452	44
460	46
138	42
296	52
1768	90
240	36
124	42
550	54
132	28
230	38
576	76
210	42
238	30
726	48
1154	70
378	34
152	28
300	48
1440	74
736	72
210	34
566	50
198	34
858	66
1142	94
502	52
208	38
286	42
696	52
164	32
638	50
386	38
114	26
682	74
294	42
450	52
19	7
392	32
120	40
130	34
230	18
242	34
136	28
552	64
928	50
512	40
318	46
1182	76
544	48
458	46
570	50
76	28
460	36
686	48
230	26
320	40
58	30
382	50
254	42
62	26
210	30
776	68
352	60
108	36
1534	84
1092	64
114	30
1622	66
316	32
100	28
390	46
428	36
92	40
148	40
386	26
916	76
704	50
244	40
372	34
110	22
710	54
1422	66
218	34
82	34
262	30
894	62
184	44
434	58
626	50
80	28
468	40
266	38
718	52
372	52
208	36
160	28
262	38
58	26
716	52
674	62
320	36
50	14
80	20
538	48
60	20
572	40
38	26
724	54
1016	68
212	36
228	44
188	44
64	16
672	68
216	36
632	48
224	28
740	50
48	16
264	32
268	28
64	20
254	50
84	28
1966	92
1506	88
290	38
2188	104
624	44
1194	70
700	48
338	38
330	30
698	66
390	46
638	52
460	52
56	16
618	52
542	38
90	26
296	40
234	22
584	52
150	34
818	58
336	54
152	34
232	28
88	36
52	24
100	24
794	68
496	42
364	28
134	22
230	26
132	32
240	44
266	30
1162	90
50	14
388	36
1744	84
410	62
136	32
190	34
220	40
1564	72
402	38
2320	88
208	32
342	50
138	30
246	62
580	52
1124	62
440	60
688	44
322	42
24	24
174	26
26	26
1940	92
756	48
212	36
380	28
224	36
480	50
106	26
134	30
56	28
112	24
150	38
534	38
72	20
162	30
1322	70
1344	70
208	32
1160	80
316	36
632	64
456	36
224	32
608	46
186	42
110	30
700	56
216	28
592	50
1242	58
524	50
340	28
216	36
134	38
84	26
256	32
274	34
1034	62
468	60
3018	118
330	42
484	48
246	42
136	40
384	28
152	28
102	38
1060	66
444	56
194	26
108	36
88	28
168	32
166	34
100	30
92	32
630	52
876	60
404	44
576	36
74	30
912	72
932	68
678	56
738	38
746	38
138	30
468	28
154	30
540	50
124	32
112	32
1734	88
182	30
774	54
740	52
246	32
1288	54
404	52
802	54
594	52
608	54
74	18
108	32
386	42
1026	62
54	18
678	58
676	52
52	36
222	26
448	60
360	40
440	38
210	50
758	62
2392	94
2452	110
996	60
244	36
224	40
132	36
562	58
172	32
62	30
220	36
262	38
634	52
792	56
192	36
772	52
384	40
86	26
744	60
1094	66
392	52
58	18
268	44
472	42
400	32
512	48
306	34
574	54
48	36
172	32
240	40
184	24
378	38
92	24
188	32
246	30
186	38
282	42
488	44
670	54
382	30
244	32
570	50
284	52
988	72
56	24
760	56
532	40
466	38
638	62
394	22
222	46
428	40
330	54
550	48
176	36
706	48
744	60
32	28
260	42
180	32
1094	58
322	52
624	62
282	50
90	30
704	44
6446	162
302	46
68	36
580	44
352	32
74	22
1006	62
188	36
314	42
624	60
628	72
1522	94
348	32
90	38
908	52
466	56
1454	76
62	34
42	26
356	32
86	34
344	24
98	30
300	36
48	28
222	22
282	26
428	40
480	32
416	44
146	38
238	38
160	40
838	58
726	68
308	56
688	64
514	52
1186	86
470	34
666	50
3128	112
652	50
212	36
526	42
150	18
294	42
432	54
770	58
98	24
128	28
1584	76
692	56
824	54
46	26
1660	80
104	28
286	34
362	50
82	30
1502	70
1198	78
552	76
776	48
76	28
192	40
270	38
312	44
362	66
68	16
124	28
126	26
842	44
378	42
166	26
358	46
672	64
186	34
264	40
134	34
106	34
216	40
86	46
160	28
392	52
412	48
172	32
518	34
152	28
54	22
252	32
142	22
282	30
198	34
476	50
1292	64
332	40
190	38
242	38
606	38
622	44
128	32
954	74
46	34
178	30
216	40
256	36
466	42
774	42
658	46
106	34
660	56
88	32
132	36
626	42
294	46
78	18
104	28
628	42
622	48
1490	82
330	38
740	52
410	62
428	52
124	32
188	28
402	38
576	56
390	34
88	20
410	70
556	42
74	26
132	40
264	28
544	44
50	18
258	38
116	28
674	54
304	28
182	38
906	50
374	34
48	22
298	46
66	26
60	28
254	34
34	26
480	48
280	48
488	56
2180	108
286	38
248	36
438	34
210	30
34	26
280	56
1632	86
152	28
132	28
896	60
166	30
436	36
224	36
436	40
1184	60
406	46
826	74
70	34
1368	88
3346	116
328	40
878	82
116	28
34	26
354	42
882	70
2968	112
180	36
26	14
866	44
670	38
422	42
1570	78
420	52
452	40
82	46
982	50
212	32
166	38
390	42
796	64
88	28
160	32
358	42
1412	76
498	46
918	66
1612	80
246	30
884	56
200	24
1088	74
36	24
880	62
400	40
208	32
68	28
1786	84
68	28
796	56
234	46
396	48
362	46
2450	110
254	50
444	52
320	40
366	42
312	32
182	30
770	54
348	52
266	38
1446	76
282	34
1648	88
156	36
750	46
62	30
510	50
560	36
376	60
106	30
448	44
182	30
252	52
576	58
566	50
100	36
464	54
88	24
574	50
910	72
346	42
138	26
700	52
274	54
966	70
82	22
64	24
874	70
126	28
96	28
1152	68
98	34
326	38
252	28
364	48
272	32
222	34
236	28
636	56
212	36
158	38
436	48
350	38
394	50
890	68
142	38
234	54
200	34
720	56
396	50
170	34
398	22
294	26
136	36
264	48
180	28
232	44
428	40
344	44
164	36
56	16
82	26
68	28
3214	114
180	28
930	72
730	54
472	52
580	48
5300	140
86	30
64	24
476	48
230	36
198	42
160	30
450	42
282	34
1254	70
190	34
1576	76
324	28
496	50
470	46
612	52
1108	66
368	48
546	42
66	26
332	36
938	78
19	7
420	28
780	72
624	48
48	32
688	46
112	32
972	72
594	34
3420	110
516	52
218	22
212	32
754	70
190	32
988	52
252	32
1102	74
418	34
684	56
72	24
1018	52
152	32
40	24
504	64
852	56
2026	86
214	30
968	60
536	52
120	28
464	44
788	60
84	28
400	32
952	56
146	36
34	18
420	32
172	24
448	32
202	40
156	36
132	36
474	46
114	30
140	32
94	38
122	26
450	46
2008	86
170	30
192	44
482	46
442	46
344	36
148	32
142	30
814	62
114	30
888	40
124	36
228	40
506	50
196	20
482	50
110	26
136	40
198	38
958	78
54	14
414	48
692	44
94	26
650	46
84	24
1022	74
616	52
354	30
570	42
204	44
76	32
1096	74
258	34
538	54
898	60
68	36
1014	70
764	62
346	40
2848	108
56	32
690	58
80	32
960	64
702	46
102	26
1124	64
54	22
2740	104
610	38
42	30
424	30
50	22
590	50
340	68
288	48
442	42
216	36
838	54
268	32
68	24
242	38
282	42
186	34
222	42
114	38
454	34
252	30
422	38
112	28
850	66
134	34
266	42
94	30
294	30
198	22
460	52
958	62
138	30
268	44
328	40
96	24
210	38
1046	54
620	48
110	26
462	42
564	52
118	34
1958	98
1830	90
202	34
1484	80
850	64
680	48
520	40
100	28
142	38
370	52
58	22
912	58
312	48
288	36
644	72
200	30
1142	54
19	7
412	32
468	52
262	30
158	32
636	52
930	64
1178	66
536	56
338	38
116	36
1174	74
662	54
490	38
54	18
328	36
98	30
562	46
142	30
144	20
74	26
308	46
122	46
148	28
1816	96
676	54
318	48
1726	86
712	56
968	58
130	32
66	30
100	36
70	22
534	46
374	38
410	38
1106	74
1126	68
704	56
698	46
50	30
596	48
280	36
306	46
828	58
1002	74
90	30
126	34
1086	74
118	30
86	34
66	26
282	38
2070	90
366	44
264	40
912	68
162	34
238	26
70	22
468	52
692	54
116	24
476	52
96	28
810	58
326	42
44	24
162	30
134	30
282	30
496	52
19	7
522	38
228	36
148	28
1100	80
332	36
174	34
600	40
172	32
134	26
416	48
310	46
94	26
326	40
134	30
530	46
570	34
54	14
178	26
378	22
254	26
278	38
518	38
242	22
780	44
200	32
1638	94
954	56
1036	64
828	56
586	54
1260	76
624	56
126	26
118	30
104	26
316	32
360	52
448	48
298	38
264	40
214	26
792	48
134	30
378	50
244	40
70	18
402	34
56	28
1912	90
88	28
576	44
716	68
136	32
210	54
400	48
378	50
62	30
582	60
362	52
402	50
50	34
1056	80
1768	80
704	62
488	52
328	48
490	36
50	18
260	40
630	44
66	26
586	74
690	46
846	46
1368	68
982	52
222	30
86	34
580	50
168	28
128	28
292	34
258	42
420	36
78	30
176	36
538	42
134	34
82	34
620	52
86	26
1210	64
156	32
162	34
46	14
52	16
436	56
612	48
166	34
1274	90
226	30
312	36
1488	82
138	30
546	60
494	38
246	34
298	38
38	30
434	42
520	46
1324	92
240	36
324	40
318	38
618	64
132	36
948	70
312	32
644	56
88	32
434	46
126	42
348	32
488	48
572	56
114	26
502	56
786	56
504	48
336	32
290	38
317	52
182	30
420	52
980	68
554	42
248	36
64	28
1196	76
326	38
334	34
686	54
980	56
198	38
200	36
136	28
216	36
190	42
38	22
370	34
1366	90
628	64
158	26
852	62
588	56
302	46
274	38
744	64
298	42
114	30
716	52
74	26
614	36
1258	78
100	28
172	34
376	44
670	42
824	68
388	36
570	38
42	14
132	34
784	64
492	48
778	52
138	26
244	40
1550	94
244	28
260	54
254	46
240	48
110	30
754	66
332	48
188	48
190	30
246	30
264	30
260	48
778	46
74	22
314	42
46	34
192	38
280	40
304	40
190	38
66	26
536	64
406	46
698	70
362	42
558	46
66	30
254	26
458	40
550	54
180	40
566	50
1322	68
400	40
800	48
162	26
282	42
1114	52
426	42
276	44
554	34
892	54
1096	72
282	46
1476	80
170	30
432	52
194	34
80	28
194	22
1996	104
186	30
1202	82
396	58
162	30
34	26
144	40
950	68
332	36
588	52
226	34
148	36
648	40
718	62
402	42
1020	84
554	46
326	42
178	34
4390	114
314	34
98	26
208	24
340	28
296	46
360	24
412	36
240	36
198	38
352	48
94	30
224	28
52	16
70	28
524	46
1314	82
760	60
744	54
240	24
330	38
778	50
296	36
166	54
1092	64
356	32
152	32
268	32
254	42
532	48
150	38
38	14
198	38
256	40
240	28
932	54
1082	50
86	30
266	34
19	7
234	38
616	48
326	34
84	28
756	60
238	42
162	30
74	34
68	28
390	54
252	36
50	14
230	42
1470	84
638	58
152	28
648	64
752	48
790	64
1706	76
1064	48
1630	72
486	54
390	34
104	24
114	30
326	42
1000	72
94	34
736	46
68	28
178	38
888	60
316	52
90	26
862	66
1968	100
128	32
78	26
710	56
274	46
72	28
746	46
128	34
630	44
1010	62
158	38
408	52
600	36
556	40
214	42
630	30
192	32
552	44
128	30
270	38
418	30
836	58
764	48
582	58
538	46
698	66
270	38
1136	74
1358	78
60	28
202	34
716	52
19	7
142	38
500	40
132	24
184	40
204	36
344	44
90	26
360	40
432	52
448	60
140	24
266	30
190	34
212	44
308	40
378	50
572	68
1020	68
1168	80
738	62
1390	94
216	36
598	46
336	40
520	34
136	32
384	46
244	44
308	56
704	66
370	34
294	42
648	48
482	58
228	40
216	36
460	48
202	42
318	46
156	36
2287	98
446	46
146	32
498	54
310	62
34	22
104	36
164	34
146	34
116	32
1248	80
276	44
528	60
476	36
202	30
224	32
78	34
236	36
302	34
620	48
124	36
962	66
32	24
520	56
1496	88
666	54
946	70
340	32
156	32
168	44
252	52
1410	76
220	36
180	44
952	64
354	42
974	78
48	12
184	36
2180	124
404	44
1478	90
1006	66
308	32
582	44
116	32
212	32
324	40
594	50
46	26
1082	72
336	36
414	50
1494	80
330	34
340	44
1118	58
330	52
212	32
1104	80
306	38
408	36
1772	90
2052	96
196	32
164	32
328	48
4050	148
952	66
186	34
398	58
294	34
96	40
676	52
58	22
252	52
442	42
242	30
206	50
654	54
90	30
388	36
146	30
132	28
186	28
92	32
1874	76
88	20
230	34
216	54
676	64
84	24
2230	98
410	38
210	34
56	24
248	32
244	48
276	44
196	48
2774	108
644	52
70	30
1174	80
150	38
118	34
148	32
1016	44
1312	60
208	16
96	32
274	30
620	64
30	14
76	32
152	44
1826	80
144	48
226	36
1800	76
254	30
302	38
78	30
456	48
82	30
896	72
68	24
60	20
254	38
156	36
576	60
350	46
284	36
56	32
428	52
348	48
280	32
178	30
238	30
288	30
160	28
744	80
948	68
194	30
844	58
1422	78
270	46
216	48
52	28
946	70
70	30
936	58
78	38
696	56
138	26
180	36
248	36
798	54
86	26
268	36
216	36
338	46
296	36
108	32
146	34
974	58
402	22
126	38
120	36
372	32
762	60
1188	80
668	68
482	50
578	38
376	40
828	76
280	28
144	28
344	36
390	42
328	44
364	54
556	50
210	26
184	40
468	52
50	34
188	40
304	32
60	20
372	48
402	30
146	30
166	38
562	50
514	46
524	36
214	34
174	34
380	42
208	32
238	30
1090	84
814	58
218	32
46	22
284	28
108	28
66	26
430	42
282	42
178	28
900	64
510	50
44	28
124	24
586	42
338	42
204	28
78	26
456	60
100	20
1124	56
98	34
650	40
206	30
490	46
688	60
274	44
642	48
212	40
368	36
414	42
48	30
176	32
936	76
678	54
358	42
712	56
142	38
374	46
622	62
404	52
312	56
346	46
3060	112
944	48
178	34
2262	84
722	50
230	38
1310	86
470	34
592	60
76	28
1138	78
762	58
658	50
1160	52
356	32
486	46
152	36
610	50
1264	76
960	68
396	32
7264	146
46	26
1940	78
230	46
424	44
682	54
2140	74
552	48
490	42
178	38
460	44
1038	58
718	46
74	26
120	36
106	30
54	30
268	40
134	34
260	38
78	26
552	44
756	68
104	24
60	24
220	40
522	38
19	7
1298	74
516	68
168	36
434	42
436	48
106	22
352	48
108	22
664	68
2168	84
468	36
1030	58
820	64
694	52
642	58
58	28
108	24
270	38
140	24
430	38
1898	102
56	32
316	40
380	32
828	50
984	64
86	22
584	48
2350	90
392	52
784	72
204	28
510	50
142	30
338	46
358	58
646	52
1072	72
40	24
830	52
104	28
131	23
1058	58
96	32
94	30
298	30
186	26
738	62
1568	84
112	28
1116	58
972	54
68	20
266	30
164	36
488	32
562	38
172	48
242	34
1136	92
538	58
1318	70
532	56
706	42
770	72
1774	70
278	42
386	34
294	42
186	42
170	30
94	26
506	46
736	64
358	34
554	42
1036	92
142	26
638	48
146	34
1014	66
598	34
126	34
564	48
384	44
296	36
1288	68
734	42
202	30
70	18
1404	100
248	28
1222	86
1304	56
478	54
54	32
234	38
254	54
768	56
372	38
2540	110
346	48
2046	98
870	58
448	52
228	52
448	54
238	42
256	40
524	64
116	28
500	44
526	30
102	22
2280	92
172	44
168	28
32	24
180	36
1322	70
318	42
176	40
150	36
1710	84
824	58
134	34
248	32
896	48
448	60
674	66
452	44
184	24
1148	72
2834	106
56	24
614	70
160	40
532	48
122	26
866	68
1322	88
1466	66
236	40
328	20
386	42
208	32
352	48
684	50
586	48
70	30
836	48
322	42
224	36
514	50
106	30
206	38
110	34
66	22
526	42
614	46
198	34
124	36
806	50
148	32
754	56
252	48
696	52
464	56
286	46
156	32
894	58
142	26
286	50
680	68
516	48
350	54
144	32
48	24
678	44
370	44
160	28
574	38
176	40
128	52
362	46
334	44
124	34
996	80
1054	72
1056	74
394	46
364	36
114	34
250	46
424	52
116	28
242	42
82	26
136	24
200	28
1206	62
4376	130
64	48
216	40
436	48
416	52
46	22
494	54
86	38
430	46
1796	80
378	30
796	80
600	36
298	42
130	26
146	38
428	32
186	34
2748	104
72	20
694	54
278	26
124	34
138	30
210	26
394	38
106	28
482	50
454	42
994	58
186	34
180	32
326	46
72	32
72	28
58	34
540	38
460	52
256	36
522	42
584	34
24	24
282	30
138	38
38	22
760	56
84	36
80	24
264	48
210	42
80	32
246	26
214	26
108	28
250	34
436	40
190	34
218	50
288	56
424	44
420	40
1564	92
194	38
128	28
204	28
592	56
438	58
244	28
1136	80
558	46
586	38
1548	84
22	22
304	52
152	32
134	30
2116	90
554	46
252	28
300	52
594	66
686	64
1752	68
850	48
82	26
126	34
98	38
106	30
310	52
164	36
574	46
236	28
120	28
382	46
1116	72
116	28
404	56
132	34
476	36
130	26
52	28
378	30
68	20
512	44
2706	114
106	30
320	44
536	60
1822	80
424	36
138	26
124	24
812	56
266	30
704	42
378	54
1758	88
108	24
90	26
76	28
650	62
446	66
558	46
232	40
752	56
454	46
450	62
304	44
812	52
636	46
476	48
334	54
2990	102
722	58
528	40
396	42
374	38
1266	70
472	56
1376	60
764	48
810	62
174	34
224	36
648	60
248	50
554	42
234	34
1060	64
1614	74
418	50
396	48
136	28
136	32
362	40
582	52
114	26
442	42
154	38
60	24
532	48
766	76
334	38
510	62
364	32
64	28
236	32
2050	92
328	52
282	54
2156	84
88	20
500	36
1530	90
326	50
88	24
148	40
336	28
1292	84
368	24
1040	100
162	38
386	42
304	34
912	58
42	22
544	40
28	28
216	28
860	52
186	34
690	52
98	34
128	32
736	68
1244	58
838	64
320	44
414	42
932	52
52	36
310	46
246	26
580	60
492	40
348	36
258	36
500	36
434	38
902	74
446	38
108	28
1288	90
1386	90
222	38
140	28
116	32
870	56
380	32
524	56
178	50
420	54
1114	82
84	28
1750	86
472	36
810	50
82	30
716	52
240	28
32	16
290	42
488	36
566	46
552	52
100	24
240	40
1468	76
412	36
96	28
234	38
548	44
1360	82
444	60
316	40
640	56
914	40
54	22
986	64
184	36
194	38
352	36
418	30
608	62
378	38
696	48
896	76
362	30
366	54
84	28
230	38
746	58
546	50
544	52
340	32
368	38
332	44
268	42
90	34
238	46
104	36
832	68
690	66
690	74
840	48
680	64
650	34
938	58
388	40
896	60
204	40
186	42
158	38
134	26
342	38
278	46
224	48
532	48
66	30
748	72
452	32
86	30
498	66
484	52
126	34
990	52
268	44
512	52
194	26
2132	96
1682	80
380	32
82	30
698	66
576	56
494	46
138	38
458	44
410	54
438	42
266	46
420	36
282	60
518	58
848	56
748	54
492	40
238	54
464	32
212	16
202	34
780	70
274	50
840	56
536	36
114	38
242	26
88	28
934	58
1236	64
430	34
58	34
2228	92
376	40
134	30
258	42
284	56
536	44
416	26
68	24
1282	62
688	40
38	14
816	52
328	32
374	42
1624	68
872	60
360	44
398	34
368	36
514	60
278	30
114	28
212	36
498	46
288	36
2146	94
1132	68
1328	68
352	46
680	70
398	26
174	42
424	48
590	50
80	24
236	28
1010	70
248	30
872	74
1090	74
438	50
264	40
210	30
1444	82
162	42
304	42
60	20
416	32
720	52
48	24
588	52
19	7
186	34
556	32
116	26
40	24
726	54
158	30
64	32
158	34
214	36
1028	80
56	24
36	28
146	30
60	20
776	80
164	36
942	72
52	36
140	24
38	14
756	72
856	60
3316	98
340	52
552	36
390	50
154	18
160	32
510	54
140	32
1206	58
318	46
296	48
252	36
1602	104
60	16
928	64
146	50
544	48
164	36
284	36
480	36
292	48
120	40
354	54
682	46
698	54
138	38
430	50
796	56
244	44
720	64
802	46
4772	138
664	54
60	24
164	36
484	48
978	66
424	48
428	44
684	76
152	28
1060	72
342	42
746	58
636	66
110	34
482	42
134	26
126	30
718	60
406	58
670	62
1986	106
1100	56
720	48
68	40
798	82
686	42
154	34
962	52
304	36
804	62
248	36
600	44
272	36
284	46
274	38
300	42
102	26
182	38
412	48
406	48
252	32
204	26
374	38
264	40
172	36
966	70
562	46
674	66
344	44
124	24
142	26
254	34
24	24
442	48
320	40
232	30
54	30
98	26
132	28
458	48
19	7
206	38
126	26
412	46
2456	112
242	34
184	38
554	44
548	46
604	56
110	24
740	40
928	56
66	34
770	58
726	60
310	34
98	34
664	44
1070	54
240	52
374	50
38	14
526	54
124	44
1656	86
290	38
166	30
174	38
180	38
536	32
736	60
440	50
182	34
1106	74
1524	88
406	44
740	48
186	34
396	36
1342	58
54	22
62	22
378	40
344	34
226	38
334	50
336	44
452	68
208	32
40	24
488	56
288	32
44	24
608	48
588	40
1192	60
996	80
140	40
296	52
78	22
2132	98
316	40
454	36
388	44
1704	106
734	76
262	42
260	44
94	22
394	50
354	46
120	40
518	46
100	28
234	34
1460	84
914	70
288	28
134	26
184	36
1178	74
152	32
146	30
210	30
524	32
56	32
350	42
54	14
28	28
420	36
1328	66
214	34
268	40
496	36
148	28
162	34
126	30
348	48
398	46
602	54
2050	86
202	46
1114	74
154	38
2902	112
424	46
1110	74
1100	58
204	36
152	40
64	28
444	52
258	34
274	46
104	24
150	30
70	26
448	44
68	24
544	48
416	40
342	34
186	30
406	30
572	46
366	38
2378	114
150	38
144	36
112	56
540	50
116	28
178	30
720	44
596	56
404	46
1036	76
284	52
574	42
1910	98
100	40
610	46
1056	58
84	40
224	36
574	50
456	64
180	32
406	46
548	40
1170	70
976	58
346	32
1020	60
162	30
378	38
96	24
534	58
588	44
48	24
290	34
19	7
344	34
218	38
500	56
156	28
58	14
312	36
384	26
656	48
424	44
508	60
414	54
662	42
194	34
408	52
806	44
218	42
466	38
54	26
92	40
540	38
1372	88
216	32
130	38
162	34
86	30
342	48
98	34
154	28
440	40
32	24
398	34
516	48
306	28
1682	82
80	24
50	26
362	42
340	46
1030	78
240	36
198	30
330	38
532	44
824	64
70	26
622	54
124	24
136	36
286	38
430	26
602	66
30	14
88	28
36	12
60	24
568	52
1184	72
62	26
1738	74
362	58
788	68
166	38
656	44
66	18
304	52
110	34
242	26
290	42
646	52
626	50
210	38
172	28
420	44
194	34
343	40
130	38
390	42
1010	66
420	36
556	32
106	30
1570	72
166	42
418	42
582	54
80	32
882	58
536	72
50	14
396	44
186	34
80	32
856	64
762	62
620	48
144	36
40	24
286	42
74	30
88	32
372	40
192	44
840	62
518	38
116	28
232	36
256	48
1980	82
150	30
854	68
482	50
158	34
128	36
1058	62
724	48
648	56
564	48
206	34
602	42
252	40
92	24
152	32
464	48
76	36
1164	68
414	46
388	56
776	68
268	68
236	24
446	40
340	46
328	40
1786	88
412	48
350	48
268	48
790	74
48	12
1042	58
200	40
212	32
856	74
632	48
92	24
1650	84
80	20
336	48
150	42
194	42
344	36
572	58
336	40
784	58
214	46
900	52
1450	82
102	34
324	52
126	30
122	34
384	44
204	36
924	48
398	46
252	36
2052	100
816	52
124	28
288	44
1172	80
428	50
672	60
428	48
838	42
82	30
284	32
1292	64
130	34
164	28
626	66
40	16
522	26
350	46
300	44
398	38
1740	80
124	28
46	18
204	32
284	32
332	60
88	28
92	32
900	58
160	36
642	82
184	32
1534	70
536	48
416	40
172	40
1298	74
34	22
206	34
782	54
450	38
324	28
84	16
300	36
426	38
388	48
382	44
68	28
346	38
82	18
90	26
1044	58
306	38
832	64
702	54
568	38
1482	58
608	40
312	28
144	36
368	50
342	42
472	52
72	20
1412	98
536	36
338	38
366	50
1166	72
196	28
506	38
276	28
120	36
406	54
460	28
808	52
486	46
64	24
58	22
370	42
580	40
320	48
388	44
1058	62
588	40
128	24
246	38
382	46
412	48
134	30
422	46
38	14
474	34
256	40
1458	80
62	26
460	32
244	36
1122	70
232	38
194	30
204	24
116	36
544	60
250	46
638	62
104	32
676	60
876	68
70	26
86	30
2220	82
202	26
166	34
412	36
724	44
262	42
252	28
60	24
144	28
274	34
74	18
230	46
754	54
336	42
398	36
582	52
894	74
828	52
556	36
162	30
1036	78
1580	82
356	54
230	46
60	24
406	38
438	42
892	56
312	20
280	40
90	30
278	50
908	72
620	60
214	38
500	44
42	18
490	50
278	32
714	54
276	32
442	38
104	30
1010	62
86	30
118	34
114	30
394	44
22	22
156	28
120	40
498	44
244	40
82	26
260	48
354	42
1786	100
634	54
176	48
56	24
1894	78
190	34
108	28
76	20
1574	96
1152	70
370	36
180	28
458	56
356	60
874	66
648	40
1214	78
126	26
352	40
342	54
76	20
248	36
632	48
2657	114
268	44
260	32
948	84
700	46
290	32
316	48
222	34
252	40
248	36
122	34
1082	66
508	48
46	14
494	46
706	50
154	38
55	13
448	48
326	34
272	32
2392	92
292	36
738	60
1750	86
192	32
162	30
428	52
374	46
670	42
480	40
62	22
258	34
282	34
808	68
158	38
802	66
102	26
1428	74
964	52
560	44
152	28
124	28
118	30
830	64
466	46
532	56
148	32
28	24
74	22
712	60
166	42
70	22
222	26
1058	64
302	38
38	30
236	24
518	46
40	28
352	36
668	56
104	32
408	36
278	54
230	46
120	36
262	42
302	30
124	36
232	48
334	30
382	40
304	24
298	30
150	34
288	32
436	40
180	32
58	26
1614	86
776	68
498	46
176	36
3972	136
362	42
296	24
990	58
1134	62
456	46
136	28
80	24
340	52
156	32
288	40
180	36
48	24
144	40
814	70
448	36
554	34
108	28
806	74
172	36
448	52
22	22
306	30
196	36
184	32
66	30
502	38
128	42
1328	84
212	36
274	34
116	28
266	46
42	14
882	60
304	44
160	32
106	30
604	76
718	54
306	46
1916	72
638	50
514	42
764	56
232	44
178	42
1048	70
354	34
54	14
112	36
188	40
410	34
58	16
80	32
702	54
2434	100
488	44
254	38
2074	90
322	50
486	46
174	34
528	44
110	26
100	44
812	52
246	26
662	50
86	26
1040	62
136	28
200	28
736	54
1040	52
144	32
1536	84
242	20
84	28
2160	110
230	34
462	46
330	30
188	24
364	56
148	36
64	24
372	40
618	42
136	36
1298	82
1390	86
180	44
762	54
172	28
150	34
388	44
90	30
520	52
428	40
544	44
186	34
104	28
68	20
232	32
624	56
182	14
164	36
1292	78
1044	60
142	30
46	34
74	38
272	60
386	54
208	24
66	42
52	36
626	42
338	32
172	44
442	50
484	44
416	32
342	42
19	7
548	32
612	48
376	44
322	50
470	46
48	24
170	30
474	58
418	46
1056	66
286	38
58	26
972	50
72	32
2274	102
290	38
122	34
308	40
474	50
278	38
196	32
636	56
690	54
118	30
3082	142
54	22
4283	128
76	28
202	38
868	76
164	44
230	46
116	28
428	36
156	32
238	34
156	36
818	62
598	58
278	30
200	28
42	34
306	46
994	74
434	42
444	32
314	34
220	30
44	28
152	36
72	28
108	40
280	36
198	36
800	60
244	36
2034	92
298	38
62	28
197	28
88	32
516	44
98	26
446	46
1378	90
90	38
19	7
364	44
540	48
130	38
164	36
80	32
608	36
208	40
626	52
776	60
686	62
138	32
290	42
590	62
272	40
150	30
270	36
754	50
1938	88
1308	72
212	36
228	48
1820	74
52	28
220	28
456	56
474	50
110	30
900	68
164	32
2770	96
690	54
216	40
456	48
148	40
68	32
486	52
276	44
618	50
282	44
1374	74
40	16
358	38
862	50
1306	86
620	44
1108	52
2536	102
538	34
650	54
236	28
5698	154
822	62
260	40
990	66
2254	126
358	46
120	28
112	24
524	28
196	36
612	44
202	30
288	32
166	38
238	26
684	60
1248	72
428	44
156	32
410	54
584	56
390	46
716	56
284	36
432	52
446	46
228	48
528	48
244	36
74	34
236	60
1244	90
470	58
74	34
660	44
518	46
62	22
250	34
2218	102
966	62
36	20
262	36
2878	98
216	36
674	46
892	56
140	36
556	32
1628	80
170	50
120	32
258	34
374	42
88	36
106	34
730	46
528	52
1736	88
682	62
276	32
720	60
162	38
202	34
1246	66
170	34
80	24
190	30
434	50
50	14
62	30
416	24
600	58
1100	72
388	40
376	44
454	46
614	52
450	66
178	42
304	40
564	40
342	30
936	56
164	32
562	48
352	56
58	18
978	84
470	38
254	38
186	38
324	32
1896	100
498	50
206	50
56	14
914	48
56	28
628	56
302	40
428	44
732	52
110	22
1962	90
142	24
1372	80
398	38
194	32
6654	164
852	64
54	14
206	42
274	34
298	38
298	32
264	40
362	62
22	22
1384	76
584	44
170	26
68	28
584	76
512	30
504	50
154	22
492	64
214	22
288	44
110	30
1168	72
96	28
916	56
930	66
258	42
186	30
142	38
248	44
19	7
1548	64
174	34
752	56
228	32
98	18
306	42
386	46
312	38
98	28
482	30
1084	60
116	32
1584	76
296	48
340	38
696	68
84	36
472	36
556	52
226	36
94	34
458	30
164	32
146	30
122	42
250	30
596	52
274	36
158	38
788	50
336	40
126	26
542	46
474	54
258	30
636	60
674	64
198	36
740	68
514	58
952	60
596	64
62	26
712	60
660	40
878	66
918	70
346	42
412	64
324	40
666	46
38	22
380	36
714	44
468	52
68	40
110	34
454	50
100	36
254	34
810	68
168	32
746	60
422	34
102	30
634	48
182	34
630	56
240	32
260	32
258	54
636	64
752	60
164	32
208	32
440	42
304	48
474	56
60	16
50	14
672	46
422	50
1126	74
828	72
1070	76
170	26
244	40
32	12
356	36
286	34
1060	72
136	30
146	30
2216	104
284	28
346	38
416	48
260	32
416	42
284	52
962	64
146	42
308	40
1558	64
1512	70
1660	84
438	46
186	42
78	30
646	62
240	48
204	36
324	44
792	56
802	50
270	26
272	32
882	70
72	24
602	58
168	32
290	42
3684	126
206	34
868	56
134	34
354	46
270	42
226	30
32	24
682	56
194	38
592	44
30	14
634	42
114	38
330	46
356	48
412	36
64	32
518	52
1742	98
19	7
274	42
114	26
192	24
64	32
446	38
238	26
188	24
284	40
616	40
2058	94
104	52
600	52
200	28
274	38
330	22
392	30
19	7
500	44
306	38
298	42
590	46
836	52
1212	68
160	36
388	44
202	46
584	50
726	58
468	36
456	32
196	36
164	24
914	64
370	54
1632	92
442	42
112	28
1602	86
188	28
596	52
668	64
1348	62
232	40
192	28
22	22
284	32
1708	90
418	42
518	54
64	16
372	36
198	46
42	14
116	32
598	46
310	42
608	60
430	50
242	26
510	38
394	46
180	38
510	40
774	66
604	56
150	30
64	24
182	26
1538	90
364	50
288	24
1202	58
1458	64
90	26
370	34
1066	70
172	32
1286	78
102	26
58	26
228	28
930	70
1450	76
1520	90
392	48
146	26
230	30
734	50
232	34
114	34
186	30
458	38
396	32
544	52
646	54
686	62
346	34
76	28
4234	134
776	68
1038	66
704	52
19	7
918	48
364	36
118	26
556	56
280	32
74	34
44	28
206	30
378	54
150	34
872	48
350	42
354	38
672	44
222	30
120	36
352	44
730	46
1094	78
232	24
118	26
108	20
1478	82
396	60
426	34
828	68
492	48
294	30
170	38
46	18
518	54
382	58
60	24
280	48
268	36
150	26
1300	54
538	50
2094	114
226	34
268	40
532	48
600	60
44	16
452	42
270	50
448	48
618	54
214	26
358	30
108	28
178	28
228	28
50	30
62	34
246	46
172	30
2262	94
532	54
196	44
46	18
246	42
60	24
910	60
596	40
378	38
404	68
76	24
1086	74
112	36
482	42
676	40
292	36
578	36
782	58
1192	68
662	64
76	28
38	26
120	32
450	58
22	22
258	46
210	30
98	32
1046	58
244	24
90	26
620	42
92	36
1206	60
226	46
40	16
1018	66
614	50
82	18
340	40
190	34
1770	86
446	30
22	22
58	26
2788	104
982	48
168	36
376	48
278	42
560	40
274	32
194	34
1176	90
78	26
1874	80
196	26
66	36
46	26
40	24
426	30
1596	84
252	40
882	74
158	46
484	56
284	44
388	62
19	7
886	86
40	24
72	24
320	36
19	7
306	42
386	34
296	36
800	48
76	32
210	46
408	60
1070	62
106	30
864	58
360	40
682	70
196	44
262	42
684	48
464	28
36	12
666	50
270	34
298	38
206	26
64	24
488	44
824	76
786	54
206	40
134	26
788	56
362	38
464	48
214	34
118	26
548	56
1386	58
176	34
100	32
298	40
100	32
286	42
680	58
210	26
384	40
112	24
1510	86
290	54
94	30
1040	64
358	38
258	30
130	30
610	56
1582	104
136	26
1440	76
500	48
314	34
534	38
60	34
204	38
1562	74
1426	84
346	50
116	32
322	42
892	56
354	42
130	30
478	46
762	58
850	48
528	64
814	54
1004	80
492	36
910	50
296	52
2682	90
276	28
386	38
104	22
336	40
382	42
967	56
78	18
432	40
128	32
166	38
200	40
458	46
148	36
70	26
742	78
1884	78
2232	100
376	40
56	24
324	32
850	54
814	62
72	16
56	24
1486	88
22	14
200	56
1146	60
136	40
68	24
178	34
350	50
108	28
86	30
338	44
876	68
408	36
286	54
1084	84
136	36
900	54
19	7
850	62
1076	60
66	32
200	40
184	42
212	30
352	52
96	28
164	32
770	50
68	16
470	42
166	38
286	46
84	30
630	44
792	54
88	32
124	32
60	18
144	36
224	28
206	38
574	54
494	38
306	34
762	58
104	24
78	26
422	42
294	42
704	52
436	44
124	28
2622	120
70	34
248	24
186	38
322	38
128	32
350	34
84	28
328	40
1310	66
268	24
834	70
424	40
126	30
48	24
412	40
1268	80
127	40
354	38
420	46
490	54
138	38
192	32
1392	76
74	26
120	28
670	58
134	38
720	74
222	34
190	26
200	28
682	56
674	62
432	60
1608	88
428	44
110	26
604	44
1806	86
190	26
580	42
594	50
66	26
560	54
200	28
1318	82
1128	72
662	38
248	40
22	14
1882	66
440	48
108	32
536	48
468	46
54	34
124	36
68	28
428	36
482	50
318	34
206	30
250	42
78	26
464	52
414	46
398	46
658	64
86	26
812	56
630	50
180	34
238	42
544	70
58	34
186	34
688	46
19	7
508	52
862	74
1042	62
360	44
674	54
218	34
514	38
352	36
284	36
280	52
1296	76
32	24
1754	76
612	72
906	58
292	62
146	38
182	42
1092	64
1584	96
1184	72
760	56
198	30
1146	80
562	54
4324	132
742	58
436	48
172	44
526	46
370	50
408	40
532	44
28	28
1160	92
204	28
180	32
290	38
720	56
182	34
158	34
268	32
994	50
482	46
180	40
532	48
148	32
434	40
642	62
152	32
138	50
1264	74
376	36
182	28
484	40
404	48
1980	84
370	46
152	38
444	56
350	30
800	66
178	38
1194	66
384	32
286	30
284	32
328	44
196	32
728	58
448	48
646	54
528	44
280	48
236	36
558	42
496	44
790	52
818	58
336	68
254	42
2854	118
286	38
258	46
19	7
778	54
844	76
1244	60
110	30
364	48
3276	128
1286	68
670	38
198	38
22	22
282	34
564	52
210	34
370	34
702	54
198	22
118	34
678	54
556	40
38	22
316	28
70	30
860	58
270	46
472	48
296	40
82	30
80	28
164	32
382	34
220	32
70	18
580	52
82	34
446	56
294	40
1750	102
288	40
66	22
704	48
196	40
66	20
474	46
520	40
228	36
810	44
382	42
388	42
2586	112
196	42
248	52
1348	72
152	28
140	40
50	22
208	36
182	34
966	100
826	46
174	30
406	46
614	46
800	68
122	34
380	34
394	40
118	26
442	30
484	48
6294	148
124	44
368	48
38	34
266	30
54	30
348	44
302	42
504	40
118	30
36	28
1534	90
1116	80
348	40
80	28
562	46
420	48
716	46
434	42
1506	86
118	38
330	38
374	34
626	56
300	32
102	30
146	38
840	64
406	32
472	56
454	48
882	42
40	24
554	46
82	22
314	34
300	44
470	56
1268	72
684	60
456	56
710	56
444	50
704	48
344	40
1062	74
416	52
86	30
366	38
42	30
140	28
594	62
880	68
1154	62
1030	58
240	36
1656	98
900	52
254	38
136	40
292	60
56	32
130	26
208	32
654	74
134	22
34	22
358	30
922	50
254	36
312	32
1912	100
64	16
880	52
19	7
648	52
330	46
738	54
2162	98
716	52
482	38
70	14
356	20
314	34
896	64
82	30
360	40
178	34
106	26
846	66
422	34
120	36
208	36
90	30
168	32
392	32
650	66
188	40
88	20
114	30
306	40
186	46
600	52
310	42
72	32
916	84
608	56
418	42
470	50
228	40
440	44
364	50
234	34
190	34
184	32
510	62
292	48
542	62
1478	86
630	46
398	38
190	42
28	24
380	72
490	34
538	46
224	40
472	40
400	44
522	50
474	42
38	14
294	38
620	48
808	72
340	44
746	50
1026	70
356	40
420	56
252	52
368	38
352	48
120	28
88	32
1118	76
94	34
474	26
494	52
402	46
1104	72
734	46
76	24
1370	74
342	30
496	52
312	44
600	40
58	26
106	30
212	36
28	28
504	40
436	44
130	30
256	36
950	64
94	32
196	48
274	30
792	56
386	50
826	58
230	26
980	76
520	56
58	26
544	40
688	50
548	56
638	50
156	28
550	42
1822	106
416	36
658	62
150	38
932	68
1040	68
348	36
174	30
82	26
394	34
72	24
1062	62
1192	84
292	36
680	56
148	38
452	44
3010	116
92	20
466	42
132	32
162	34
44	16
214	34
2196	88
226	38
316	36
352	48
548	52
286	56
268	36
124	28
186	36
214	62
494	46
198	38
322	38
256	40
282	38
934	44
172	40
710	48
1076	64
330	30
528	44
92	36
448	56
1126	78
132	50
504	44
100	24
484	34
56	20
854	78
240	36
192	52
362	34
658	42
218	30
202	42
652	48
238	30
506	38
116	36
488	46
226	30
274	38
1228	68
750	50
112	40
19	7
662	58
4732	110
514	50
46	14
640	52
68	22
336	40
868	52
880	56
330	46
1196	72
19	7
440	34
414	56
184	40
126	32
466	56
130	30
84	32
3107	100
530	58
2136	102
852	52
220	28
626	42
566	64
184	44
1352	82
28	24
214	38
462	50
97	21
664	44
402	38
872	58
478	46
168	36
344	40
1252	76
164	32
1554	62
178	14
568	56
124	40
1274	78
86	30
150	26
348	54
400	52
478	42
372	46
550	66
172	40
172	44
974	84
72	24
646	58
112	40
2872	120
260	36
890	78
2266	102
252	36
172	28
548	44
140	24
266	38
79	15
942	60
634	56
150	30
60	24
2330	108
388	28
102	34
626	58
306	30
1864	94
684	40
172	32
46	22
50	18
102	26
1036	76
462	46
94	30
148	32
482	54
332	36
696	48
608	60
250	30
1588	72
564	52
550	44
3228	114
94	26
580	44
386	42
132	28
1220	60
296	34
758	48
362	38
1236	50
1080	72
612	42
158	32
160	32
170	26
64	16
972	64
226	32
352	42
266	46
310	38
156	44
254	46
150	26
1548	80
498	54
114	42
68	28
648	40
578	30
324	44
962	58
442	38
276	40
488	48
708	54
432	32
148	32
80	28
110	30
928	58
920	68
30	30
664	44
196	40
404	34
194	34
126	42
406	38
568	48
240	32
70	30
262	26
104	32
848	60
58	26
196	36
56	28
690	58
272	36
316	28
482	30
510	50
274	42
1130	66
104	20
328	52
808	54
274	42
104	28
572	44
102	26
1552	76
654	38
156	36
1768	84
290	50
222	30
254	30
94	30
134	34
174	30
452	36
280	32
48	24
586	36
106	26
2332	100
1126	62
296	36
742	70
1608	114
388	32
348	36
122	34
82	26
514	54
764	72
700	72
1632	64
854	66
450	34
362	38
200	32
84	40
40	32
76	28
80	28
76	36
848	64
74	26
220	48
936	60
346	46
426	34
42	30
40	32
248	36
232	34
40	24
1320	74
150	34
440	30
1322	64
332	28
112	28
484	60
590	56
1940	84
350	48
440	40
1092	58
254	34
234	38
318	40
486	58
678	34
1684	84
596	48
580	44
284	40
276	38
64	20
294	46
544	52
1072	60
998	64
2540	98
102	34
570	38
176	28
106	22
200	28
272	40
360	36
1150	62
180	40
150	30
950	66
368	28
684	78
316	60
482	50
94	20
126	38
326	50
422	42
114	26
2460	94
536	48
270	38
92	28
472	64
238	34
1262	66
1274	66
282	44
492	44
160	28
364	52
94	30
158	34
296	32
376	44
504	46
58	22
264	48
326	38
232	24
976	64
830	62
560	52
264	46
360	40
150	38
590	54
86	26
110	38
438	30
444	60
156	28
430	34
710	62
158	26
254	42
532	34
1136	68
562	42
676	60
184	40
2068	82
9022	198
688	56
926	50
492	48
684	48
148	32
108	32
1338	72
272	32
338	38
126	34
134	26
592	52
48	16
490	38
156	32
334	34
308	36
314	34
1046	64
52	28
580	64
260	52
32	24
548	40
586	42
78	26
1126	78
512	50
268	28
90	26
102	28
510	58
734	60
500	40
332	52
1248	68
534	46
144	32
126	34
192	44
500	52
56	24
132	44
398	46
462	42
22	14
338	42
514	54
192	40
946	54
52	20
72	20
414	42
386	42
808	64
870	64
1544	78
600	48
172	36
534	42
208	40
838	56
436	52
610	44
406	42
422	48
98	26
80	32
880	64
110	30
142	38
678	50
424	32
662	54
134	46
696	60
348	44
94	26
62	30
310	42
901	60
734	62
474	50
276	44
100	28
178	38
1136	76
60	20
912	60
370	38
270	26
430	42
310	38
846	62
150	46
196	36
106	26
520	40
236	42
1546	66
1690	100
244	28
454	48
526	52
1036	78
436	52
328	56
226	34
364	44
370	46
208	24
186	34
484	40
58	22
590	40
944	42
546	50
266	38
222	42
720	68
264	48
384	40
202	38
66	30
1410	86
316	36
120	28
74	22
600	52
306	34
316	36
506	42
434	56
3306	126
546	46
94	30
1292	78
698	46
78	26
56	24
794	50
176	32
320	44
2118	90
352	48
1294	76
588	52
876	60
726	36
66	26
36	20
2598	82
230	42
450	66
570	58
34	26
2502	96
366	30
216	36
146	30
386	22
270	34
788	46
288	36
232	24
900	56
1668	92
1284	88
1018	62
258	42
92	24
172	32
308	44
604	44
168	36
50	26
1068	82
368	40
360	46
2216	104
104	24
274	30
78	38
136	24
602	34
312	36
104	32
350	34
172	28
266	30
1590	90
686	54
646	54
138	30
132	24
1008	74
222	54
984	72
912	62
268	44
172	48
194	26
316	42
278	34
166	38
1038	70
120	28
338	38
120	32
278	38
418	36
280	32
190	32
172	36
242	34
124	36
242	34
456	44
62	22
86	26
374	42
246	38
836	72
86	30
322	38
400	40
952	64
576	30
248	44
76	20
310	34
360	32
324	32
106	32
262	58
862	54
386	50
706	50
1078	66
272	32
488	48
168	36
126	42
234	38
320	32
176	32
584	40
964	64
412	56
458	58
2388	100
122	34
150	30
182	30
106	30
226	42
482	50
680	44
158	34
206	38
336	42
552	28
364	48
984	68
154	46
110	30
84	28
570	42
278	42
138	34
412	52
564	36
242	46
766	72
300	36
346	42
294	42
92	44
350	38
190	30
394	46
702	46
58	26
582	32
82	18
50	26
1998	98
684	48
366	36
1096	56
140	32
528	56
474	54
1814	98
442	38
542	56
416	52
134	38
460	64
384	52
340	44
1092	80
426	36
52	16
19	7
146	22
426	46
440	36
314	48
70	26
234	30
62	18
96	20
310	30
178	14
40	16
426	22
1180	80
298	42
114	30
258	30
302	30
456	32
2314	82
206	42
684	54
60	20
1466	82
566	38
664	58
72	28
418	46
602	38
564	36
96	28
202	38
116	28
642	46
52	16
194	30
246	30
876	58
270	44
522	48
122	34
320	44
234	34
342	34
296	44
260	28
416	32
644	46
214	34
140	32
5894	138
770	46
342	54
366	38
112	28
638	46
950	50
1356	78
1038	58
700	64
688	44
258	30
852	62
534	42
19	7
358	38
346	50
358	46
398	42
1102	82
30	22
918	46
436	36
318	34
106	22
518	38
308	40
696	68
464	40
54	14
92	32
524	44
650	54
972	70
1648	76
84	28
76	28
382	42
94	34
268	28
54	26
298	50
670	56
168	36
146	38
190	30
808	44
70	26
112	32
160	28
66	26
1568	72
422	46
516	56
278	46
56	32
264	32
372	40
330	34
532	64
362	42
670	62
704	76
42	30
456	36
76	24
1234	62
702	54
130	34
1194	54
116	36
318	30
180	34
288	28
154	30
840	56
116	28
378	34
296	44
354	42
182	34
306	48
206	34
634	38
52	20
644	50
446	34
678	54
22	22
346	42
966	70
484	44
40	16
1144	72
120	32
150	28
478	50
218	30
1038	82
342	36
1074	66
576	48
498	48
508	48
924	60
354	46
2266	84
432	44
54	26
64	20
1660	84
434	70
1516	88
2500	120
318	34
112	32
308	40
672	60
108	44
490	34
160	36
198	42
486	46
242	30
254	30
264	44
176	32
84	28
352	28
88	32
534	48
618	52
102	38
412	42
234	46
244	36
1052	60
798	78
134	34
180	32
140	32
790	50
588	72
68	24
1228	80
190	34
938	70
184	32
980	58
154	22
56	32
62	22
164	44
108	28
954	46
2511	96
78	22
96	26
82	22
510	50
198	34
264	44
1336	82
570	66
314	50
98	34
318	42
836	80
938	58
190	38
188	32
518	50
526	54
102	26
970	54
702	58
556	52
132	32
238	38
700	48
1544	84
42	34
640	32
1462	86
82	22
2034	96
184	32
702	64
214	30
288	56
410	58
574	58
216	28
254	40
432	48
188	32
134	30
106	30
82	38
354	38
344	48
716	56
202	42
2860	116
516	32
936	56
124	36
992	76
486	54
304	48
354	62
186	38
244	48
932	64
636	52
1414	84
102	26
590	66
1456	102
876	68
154	38
808	64
166	34
518	46
908	56
3736	106
176	32
300	36
192	28
392	40
648	56
566	54
480	56
248	36
140	32
1962	74
1580	68
688	64
100	36
138	38
138	40
1662	78
200	40
618	46
1602	82
394	38
1066	84
378	34
144	28
662	50
604	44
622	66
182	42
1774	78
658	62
550	42
1642	102
510	50
670	46
910	62
72	16
112	28
368	40
814	58
638	68
438	42
360	36
516	42
312	28
198	46
854	62
1222	72
330	30
532	46
238	30
378	38
60	24
66	22
622	70
446	44
438	46
470	62
50	18
466	56
732	72
124	28
118	30
366	34
168	28
914	58
388	40
984	48
86	26
394	42
606	56
656	56
1778	82
554	46
178	30
348	16
288	44
498	34
108	28
1076	76
64	20
602	50
550	46
776	40
134	46
730	58
386	34
214	42
1620	96
438	38
700	48
400	36
538	46
116	28
164	36
102	34
134	34
390	50
342	42
754	42
110	34
176	36
134	34
886	50
198	26
530	40
222	38
678	58
90	30
514	46
174	34
622	62
322	34
490	42
124	28
106	34
150	42
60	20
62	30
196	32
280	48
102	34
1074	66
460	32
3816	132
224	52
350	38
1066	70
108	32
3546	130
1106	76
164	28
542	42
424	48
214	38
248	44
434	54
1074	70
160	36
242	26
602	46
50	14
82	50
356	40
74	34
218	30
402	50
608	52
520	42
578	38
588	48
310	46
1156	88
110	22
658	46
760	60
616	64
108	28
370	42
360	44
452	46
3762	96
1738	90
954	82
352	64
788	48
478	50
604	72
304	42
54	14
186	30
122	30
386	42
262	38
62	22
330	48
142	26
174	42
1194	66
692	56
598	34
206	46
392	40
178	38
630	42
270	38
528	32
352	44
140	32
550	46
868	58
1090	64
80	40
188	36
1170	82
282	62
550	48
2038	102
492	46
230	34
686	54
546	48
104	24
68	28
140	32
261	36
834	58
118	34
476	56
1216	72
1492	84
44	16
110	30
702	54
2202	78
490	44
300	28
716	48
340	48
648	58
290	50
250	42
460	48
498	58
114	34
52	16
542	50
1468	84
208	44
496	44
1280	68
98	30
1070	72
270	46
230	46
570	62
566	50
482	46
386	38
298	42
182	26
122	38
1300	76
120	40
1362	78
178	38
570	46
140	36
24	24
98	34
64	16
528	60
942	66
322	46
68	24
966	58
286	30
380	52
388	24
526	44
200	44
462	46
76	28
250	38
1448	72
286	34
458	54
780	58
576	54
440	38
566	50
232	32
192	28
1870	84
484	36
698	50
148	30
510	42
90	34
1056	62
292	32
242	42
538	58
862	58
276	36
690	60
984	64
658	42
3000	100
120	32
286	42
76	36
520	52
36	12
808	68
1404	72
906	70
540	48
58	14
1050	76
436	36
74	22
204	36
2194	94
112	40
842	56
306	34
610	68
356	32
298	30
1068	60
902	58
212	28
76	28
612	52
158	26
2466	102
320	32
222	34
414	42
944	56
252	40
436	58
342	38
508	52
178	30
416	44
48	24
142	30
284	36
406	34
568	60
908	74
316	44
156	36
562	62
320	42
32	24
456	44
390	46
542	54
246	34
608	56
218	26
476	42
42	26
612	52
282	50
206	34
300	40
244	40
338	40
196	36
982	74
306	54
292	26
716	48
416	32
216	36
344	44
288	36
46	30
192	32
434	46
1054	74
96	28
368	40
184	40
32	24
218	18
220	56
678	42
188	40
122	30
872	68
636	60
74	28
138	32
1532	94
146	30
442	38
58	14
488	60
46	22
22	22
720	68
236	32
1280	88
36	36
298	48
82	38
52	32
200	36
126	34
360	48
796	52
300	28
972	60
392	44
502	42
186	34
96	28
122	26
264	28
188	44
164	36
418	38
1016	66
66	22
1052	64
846	74
588	52
966	64
2920	92
128	32
74	34
188	24
952	52
1082	70
416	44
188	36
636	52
778	46
102	30
492	52
226	26
830	58
926	58
58	22
128	24
388	40
178	40
3278	110
1316	82
236	30
374	42
192	34
44	28
652	52
38	30
304	42
434	46
94	26
884	64
590	54
404	40
292	36
262	26
414	46
680	68
78	18
354	34
2620	100
1042	58
660	56
384	44
202	42
286	34
286	38
34	26
3228	124
116	26
250	46
436	40
912	58
64	36
540	64
628	62
364	40
92	32
86	22
662	56
688	48
2060	112
262	28
292	52
598	48
66	30
256	40
80	28
274	46
282	44
344	48
298	34
756	70
978	80
154	54
240	44
526	42
364	52
88	24
294	38
238	38
220	44
384	52
58	30
168	40
276	28
5320	158
356	32
576	36
486	46
96	28
876	48
328	32
392	36
190	34
282	30
42	14
168	40
156	28
590	44
254	30
54	30
248	40
848	68
304	36
720	48
1082	74
150	38
412	36
1912	108
404	40
84	28
366	50
270	34
56	24
42	14
440	36
340	40
19	7
434	46
150	26
182	34
112	46
46	22
74	34
696	46
196	36
312	40
174	32
688	64
290	42
102	30
340	44
700	68
330	42
270	32
824	56
116	44
802	62
348	44
212	30
134	38
652	40
246	42
526	42
188	36
126	34
330	42
502	42
696	56
202	30
818	62
344	32
104	48
304	52
188	44
276	40
306	30
76	28
78	18
1102	58
98	32
592	40
552	54
22	22
414	46
808	68
256	32
108	36
310	66
110	26
640	56
592	64
216	48
272	40
422	62
570	42
108	32
228	28
1002	74
430	54
264	36
190	46
202	58
552	52
502	46
2034	88
604	56
422	34
80	28
508	44
82	34
334	38
158	26
714	78
122	34
82	18
352	44
488	40
304	44
62	22
530	38
594	58
1192	78
730	58
134	26
404	36
164	48
150	38
390	46
556	52
502	42
270	30
178	26
2638	110
330	38
418	66
352	52
92	36
632	52
3054	126
376	44
144	36
272	52
278	26
608	52
950	74
60	32
1898	98
896	70
322	50
64	24
306	34
494	50
1540	84
1628	80
1486	72
394	38
1678	82
200	56
44	32
562	46
404	44
428	48
1042	62
196	32
214	30
318	42
394	50
882	58
560	56
146	30
322	34
146	30
78	28
112	36
556	56
110	22
508	52
352	32
456	40
340	24
942	58
344	48
570	50
440	32
128	32
292	36
264	40
70	38
80	36
388	32
338	38
36	24
716	48
1374	94
524	40
540	58
164	56
74	18
424	40
74	30
512	48
130	30
372	36
1466	64
270	36
1016	76
242	46
524	56
128	32
732	52
396	56
34	22
78	30
80	20
44	36
378	30
114	26
300	60
52	44
250	34
108	22
526	36
70	14
616	64
360	40
390	42
42	14
298	50
192	24
826	58
70	30
564	44
1094	64
182	34
394	54
38	14
304	28
394	38
132	40
172	40
410	56
426	38
674	38
436	48
556	40
240	28
2076	74
214	38
102	26
320	44
330	42
922	58
246	38
604	52
378	40
474	50
384	24
114	34
120	36
38	18
802	64
238	42
638	50
1322	70
472	54
798	58
178	30
568	36
676	48
82	30
440	52
776	64
1088	62
90	18
376	36
246	38
780	44
68	20
1024	72
112	24
158	34
74	30
328	44
762	50
80	32
392	44
118	30
78	30
284	52
752	64
148	32
262	38
578	46
256	24
1152	52
404	48
422	34
266	34
258	54
244	36
636	44
224	38
304	36
338	50
326	40
534	54
872	64
372	32
388	56
118	26
724	58
1002	72
166	30
306	46
206	34
318	34
294	42
110	34
888	64
2370	74
212	32
644	56
682	56
208	38
596	46
832	50
232	46
3314	104
856	68
164	32
298	32
2604	116
170	34
210	34
260	32
1230	68
372	32
448	44
144	48
88	32
706	54
908	76
1294	90
504	68
270	30
80	32
158	34
48	40
300	32
302	50
418	54
440	36
616	48
174	38
2068	88
1782	78
1944	84
2428	128
354	38
234	38
224	38
336	44
316	36
416	36
2242	110
390	42
444	36
582	66
1112	76
112	24
452	36
504	68
582	34
868	48
270	42
252	32
128	28
50	18
594	70
284	52
1720	92
212	36
124	22
1064	84
1600	92
832	68
26	22
90	26
698	62
56	32
216	34
252	32
54	14
298	44
1142	66
210	30
106	30
568	40
272	28
116	36
604	62
148	36
276	44
1780	84
1038	82
206	34
164	32
176	56
156	36
1186	78
474	46
478	54
814	64
54	22
26	26
2004	88
178	42
1910	74
236	28
116	20
160	32
1014	58
238	46
880	60
44	16
1228	60
418	46
1432	72
124	40
70	22
1048	82
156	40
230	38
824	56
96	44
474	34
72	24
356	48
804	60
300	36
104	28
252	28
1980	92
134	30
344	36
90	22
326	54
42	26
70	30
170	38
60	20
444	38
902	62
134	26
328	44
184	32
540	48
82	30
470	46
440	28
378	38
758	50
1064	68
432	44
112	20
266	46
302	30
502	66
466	30
580	56
124	28
142	38
1130	90
356	40
420	40
1476	64
154	26
562	58
164	28
1464	74
108	40
656	40
234	50
46	30
144	32
74	26
250	40
1530	70
970	66
460	54
550	54
292	32
310	38
518	46
136	32
180	44
122	34
934	80
144	32
236	40
130	38
48	24
590	42
154	30
122	26
346	26
562	60
180	28
138	34
82	26
1032	60
106	34
248	36
922	80
96	32
878	58
416	38
322	48
510	58
222	34
2316	96
228	28
52	16
282	40
308	32
608	64
268	36
766	52
90	42
170	26
250	38
332	36
606	42
170	30
192	36
666	66
2092	86
854	66
232	36
146	32
1612	68
966	70
284	48
488	40
826	76
384	40
178	30
744	48
106	30
242	26
2802	118
528	52
748	50
190	34
590	52
200	28
398	42
754	42
2098	90
248	36
110	26
310	30
132	28
480	56
118	30
300	36
204	34
298	54
108	20
412	40
138	38
216	28
110	34
1358	66
218	34
126	34
19	7
2504	96
238	34
124	28
256	46
384	40
1068	84
1518	68
466	42
158	38
756	44
1490	68
42	14
178	14
312	48
174	34
1480	90
88	52
480	32
366	42
1338	78
462	38
90	38
148	32
508	56
258	44
662	52
128	36
766	58
444	40
270	42
932	66
178	34
306	34
328	38
1562	78
204	48
334	54
230	34
380	40
102	26
160	32
26	26
338	38
1568	84
260	32
372	66
348	44
76	40
328	40
914	64
78	18
610	48
152	32
100	28
562	36
226	22
118	42
644	56
664	64
302	34
896	64
200	44
88	32
352	38
48	32
782	60
134	30
434	44
82	22
400	46
506	42
1156	60
266	30
1078	64
122	34
106	34
68	14
486	50
174	34
1324	78
752	48
554	30
258	38
340	36
400	36
212	44
80	24
188	36
344	48
164	40
548	50
1268	64
52	16
462	50
462	62
474	36
962	60
564	58
402	34
822	54
772	60
72	18
60	14
228	28
242	30
278	30
264	40
172	34
270	50
642	42
1024	68
814	58
76	24
80	26
1318	70
198	42
2134	90
258	34
582	50
354	50
262	38
40	24
132	36
94	34
328	48
1194	64
282	52
160	32
484	48
148	32
1500	72
76	36
19	7
78	30
1220	66
464	60
340	40
470	30
264	40
56	20
452	52
238	30
272	40
374	46
1896	84
756	56
204	36
370	46
354	34
44	24
3732	108
122	30
312	40
66	26
772	48
266	50
442	48
782	64
244	34
702	62
1614	92
46	14
344	36
906	58
386	58
414	42
502	54
658	42
484	32
19	7
308	48
92	32
312	52
704	56
126	38
234	38
290	42
1926	90
508	40
170	42
60	28
592	56
486	42
810	52
