Score	Length
30113335	7886
3197726	3041
775462	1734
26717842	7607
1680412	2481
3280411	3110
11487075	5217
2367937	2681
200035	960
1015344	1940
5353668	3845
1006303	2040
10559737	5018
1168631	1877
2999648	2893
882691	1928
6007539	3809
7923374	4241
7890768	4359
631877	1714
239312	1162
6630217	4114
328852	1254
756757	1732
2560905	2775
5364556	3677
30854051	7761
1241659	1929
605390	1596
6319025	4058
2523974	2789
3536697	3158
15905518	5908
3297260	3217
2387734	2614
2590426	2896
53984	616
5170256	3726
6420557	4066
10203694	4900
2470665	2617
2200159	2668
2633075	2821
5639478	3737
12524527	5265
2001666	2518
25700396	7207
575590	1510
1568513	2250
4351445	3444
1123681	2028
13751297	5409
1244914	2264
9063818	4722
22877632	6997
1048073	2076
1790886	2400
4203058	3247
4941013	3387
638685	1552
4103777	3149
41732182	9005
1856003	2384
2913922	2878
12703903	5343
2467083	2697
19	7
81169	708
1858540	2399
8207750	4482
11308510	5071
2976501	2949
1169035	1931
1356055	2153
3504563	3190
14588809	5850
5067614	3612
179343	913
10330824	5143
7392034	4241
8159060	4628
565799	1409
698438	1724
1578560	2348
1022654	1757
1286602	2198
12309760	5396
16292140	6138
1164724	1962
3574396	3148
5625819	3673
1738842	2342
1854882	2431
5617035	3569
1141707	1995
1310537	2139
3786767	3039
4913631	3680
8976552	4712
4104217	3233
14165453	5481
5015039	3636
6440758	4068
1294788	2025
7393578	4232
23407638	7017
1472059	2207
1554406	2399
3854254	3274
