Score	Length
26	10
10	10
70	14
16	8
24	12
8	8
10	10
18	10
8	8
26	10
8	8
14	10
38	12
168	20
8	8
28	12
158	22
16	8
20	12
8	8
8	8
14	8
10	10
8	8
8	8
22	14
24	12
22	10
8	8
96	16
8	8
40	12
22	10
30	10
22	14
8	8
20	12
20	12
106	18
8	8
16	8
20	8
72	16
8	8
20	12
8	8
26	14
148	20
43	11
20	12
8	8
10	10
44	12
20	8
22	10
8	8
16	8
30	10
8	8
10	10
12	8
20	8
112	20
8	8
18	10
14	10
8	8
20	12
22	10
22	10
18	10
8	8
10	10
14	10
8	8
16	8
16	8
20	12
8	8
16	8
8	8
8	8
20	12
16	8
12	12
18	10
28	12
26	10
38	10
10	10
8	8
18	10
10	10
22	14
70	14
26	10
8	8
28	12
12	8
110	14
80	16
26	10
18	10
30	10
8	8
16	12
16	8
24	12
8	8
48	12
20	12
22	14
20	8
16	10
8	8
26	10
20	8
44	12
26	10
102	18
30	14
18	10
30	10
8	8
92	16
12	8
26	10
26	10
14	10
8	8
20	12
38	14
40	12
30	10
8	8
38	10
40	12
22	10
12	12
16	8
10	10
8	8
22	14
16	8
18	10
14	10
92	16
10	10
10	10
38	14
12	8
70	14
30	10
18	10
20	8
76	16
20	8
12	12
24	12
8	8
36	12
22	10
110	18
16	8
19	7
32	12
120	16
26	10
16	8
70	14
12	12
26	10
54	12
8	8
8	8
19	7
12	12
38	14
16	8
10	10
22	10
12	12
8	8
16	8
16	8
8	8
10	10
8	8
20	8
10	10
18	10
92	16
18	10
32	12
8	8
88	16
8	8
36	12
18	10
8	8
22	10
100	16
22	14
20	8
16	8
10	10
14	10
86	14
44	12
16	8
88	16
24	12
10	10
22	10
18	10
20	8
10	10
20	12
168	24
20	12
8	8
36	12
8	8
20	8
18	10
16	8
40	12
102	18
10	10
20	8
94	18
10	10
20	12
10	10
16	8
22	14
8	8
24	12
70	14
12	8
74	14
10	10
10	10
98	18
10	10
30	10
10	10
16	8
26	10
18	10
72	16
28	12
8	8
8	8
12	12
20	8
20	8
10	10
18	10
30	10
8	8
28	10
18	10
18	10
80	16
106	18
20	8
8	8
8	8
47	13
10	10
16	12
18	10
20	12
19	7
18	12
20	12
16	8
10	10
14	8
18	10
12	8
8	8
38	10
12	12
14	10
19	7
12	8
16	10
8	8
10	10
58	14
18	10
16	8
76	16
10	10
110	14
14	14
104	16
26	10
18	10
28	12
19	7
10	10
26	10
8	8
16	8
46	14
8	8
20	8
22	10
26	10
8	8
44	12
19	7
8	8
40	12
102	18
20	12
8	8
18	10
18	10
20	8
8	8
8	8
16	8
22	10
16	8
18	10
38	10
12	12
20	8
70	14
76	16
19	7
38	10
8	8
26	10
14	10
16	8
16	12
8	8
8	8
16	8
16	10
70	14
18	10
18	10
8	8
8	8
8	8
70	14
26	10
10	10
8	8
8	8
12	8
130	18
64	16
10	10
46	14
22	14
28	12
102	18
22	10
16	8
8	8
10	10
8	8
10	10
8	8
12	12
8	8
8	8
26	10
30	10
12	8
30	10
22	10
8	8
38	10
18	10
22	10
36	12
8	8
8	8
16	8
12	8
20	12
10	10
22	14
8	8
30	10
28	10
22	10
10	10
20	8
8	8
30	10
18	10
22	10
20	8
20	8
8	8
20	8
16	8
20	8
16	8
12	8
12	8
22	14
18	10
14	8
44	12
70	14
20	8
88	16
12	12
8	8
10	10
10	10
10	10
12	12
16	8
26	10
28	12
20	8
22	10
72	16
16	12
8	8
20	8
24	12
12	12
10	10
18	10
8	8
38	10
8	8
43	11
8	8
26	10
8	8
30	10
12	8
10	10
8	8
22	10
96	16
12	12
8	8
16	12
20	8
18	10
8	8
16	8
8	8
120	16
38	10
20	8
26	10
8	8
19	7
36	12
20	8
8	8
108	20
10	10
8	8
32	12
8	8
8	8
10	10
28	10
22	10
10	10
10	10
8	8
19	7
8	8
18	10
18	10
8	8
22	10
14	8
70	14
22	10
14	10
10	10
16	8
10	10
34	14
26	10
12	8
10	10
10	10
8	8
20	8
8	8
44	12
38	10
26	10
20	8
78	16
28	12
20	8
8	8
22	10
16	8
8	8
8	8
84	16
8	8
32	12
19	7
8	8
16	8
8	8
8	8
58	14
28	12
10	10
70	14
16	8
38	14
10	10
92	20
10	10
38	10
90	14
30	10
84	16
8	8
8	8
16	12
8	8
26	10
10	10
28	12
92	16
10	10
26	10
8	8
20	8
8	8
22	10
16	8
8	8
18	10
18	10
20	8
26	10
20	12
26	10
20	12
8	8
14	10
28	12
8	8
26	10
8	8
22	14
22	10
44	16
8	8
8	8
20	8
10	10
28	12
22	10
18	10
8	8
22	10
14	8
10	10
14	10
8	8
8	8
186	22
8	8
8	8
8	8
20	8
10	10
80	16
8	8
8	8
20	12
18	10
10	10
8	8
8	8
16	8
8	8
80	16
38	10
8	8
10	10
36	12
26	10
20	8
26	10
10	10
16	8
8	8
110	14
10	10
16	10
8	8
108	20
20	8
18	10
22	10
30	10
22	10
8	8
8	8
82	18
72	16
58	16
19	7
16	8
30	10
22	10
38	10
20	8
16	12
18	10
22	10
70	14
8	8
8	8
30	14
10	10
18	10
8	8
108	16
18	10
16	12
16	8
22	10
12	8
26	10
8	8
12	8
18	10
12	12
10	10
8	8
8	8
8	8
20	8
42	14
8	8
20	8
10	10
68	16
22	10
8	8
40	12
26	10
10	10
10	10
20	12
12	8
8	8
8	8
82	14
22	10
8	8
14	10
32	12
10	10
12	12
84	20
12	8
43	11
20	8
8	8
20	12
30	10
48	12
20	12
16	8
10	10
8	8
16	8
26	10
40	12
308	36
22	10
26	10
8	8
10	10
8	8
10	10
18	10
84	16
94	18
10	10
20	8
12	12
8	8
8	8
8	8
12	8
18	10
12	8
20	12
16	8
8	8
18	10
38	10
12	8
10	10
8	8
8	8
20	8
86	18
26	10
20	8
82	14
22	14
20	12
12	8
30	10
30	10
12	8
8	8
8	8
8	8
16	8
12	8
18	10
14	10
16	8
10	10
26	10
8	8
110	14
38	10
168	24
146	18
19	7
38	10
38	10
18	10
19	7
16	8
8	8
16	8
43	11
8	8
104	16
38	10
16	8
8	8
18	10
20	8
8	8
26	10
20	12
18	10
8	8
20	12
22	10
70	14
78	18
20	8
8	8
38	10
14	10
20	8
16	8
12	8
26	14
32	14
20	8
22	14
10	10
8	8
19	7
26	10
12	12
8	8
16	8
18	10
90	18
20	12
24	12
30	10
28	12
24	12
19	7
22	10
26	10
12	8
10	10
22	10
10	10
12	12
70	14
8	8
8	8
19	7
16	12
70	14
20	8
26	10
19	7
8	8
10	10
92	16
40	12
30	10
19	7
22	10
16	8
12	8
20	8
18	10
8	8
18	10
28	10
10	10
16	8
54	12
28	12
30	10
32	12
12	12
22	14
18	10
12	8
26	10
19	7
8	8
30	10
8	8
8	8
16	8
19	7
8	8
10	10
22	10
8	8
14	10
18	10
22	10
26	10
8	8
18	10
22	10
19	7
12	8
20	12
8	8
10	10
20	8
30	10
10	10
72	16
8	8
18	10
10	10
88	16
28	10
8	8
8	8
22	14
12	8
8	8
20	12
12	8
10	10
20	12
10	10
18	10
22	10
44	12
10	10
130	14
8	8
20	8
16	8
16	8
12	8
26	14
12	8
32	12
12	8
12	8
22	10
12	12
38	10
16	8
86	14
20	12
10	10
10	10
16	8
36	12
19	7
108	16
62	18
26	10
18	10
12	12
10	10
8	8
8	8
10	10
8	8
8	8
26	10
22	10
8	8
10	10
10	10
8	8
8	8
18	10
14	14
8	8
22	10
18	10
8	8
10	10
8	8
92	16
22	10
8	8
16	8
10	10
18	10
36	12
20	8
8	8
20	8
8	8
18	10
18	10
20	12
8	8
8	8
30	10
22	14
46	14
70	14
40	12
8	8
10	10
8	8
10	10
8	8
12	8
16	8
8	8
12	8
82	18
12	8
8	8
16	8
36	12
10	10
18	10
30	10
8	8
26	10
16	8
14	10
8	8
10	10
8	8
8	8
8	8
8	8
16	8
12	8
26	12
38	10
28	12
124	20
43	11
8	8
30	10
76	16
44	12
10	10
50	14
20	8
74	14
8	8
35	11
20	8
44	12
18	10
12	8
10	10
20	8
100	16
10	10
12	8
19	7
22	10
22	14
20	8
18	10
16	8
10	10
26	10
16	8
18	10
10	10
16	8
20	12
10	10
18	10
10	10
28	10
8	8
22	14
18	10
32	12
20	8
92	16
44	12
16	8
10	10
10	10
16	8
36	12
110	14
8	8
8	8
10	10
8	8
16	8
12	12
10	10
8	8
70	14
10	10
8	8
22	10
19	7
8	8
10	10
19	7
30	14
8	8
12	8
8	8
38	12
10	10
8	8
58	14
8	8
18	10
18	10
20	12
8	8
18	10
20	12
12	8
19	7
16	10
20	8
18	10
12	8
10	10
20	12
10	10
18	10
30	12
19	7
28	12
19	7
16	8
22	10
28	10
82	18
8	8
10	10
36	12
8	8
20	8
16	8
16	8
18	10
34	14
26	10
108	16
14	10
8	8
10	10
12	12
8	8
16	8
18	10
14	10
12	8
14	8
8	8
8	8
16	8
26	10
32	12
22	10
12	8
125	19
30	14
74	14
12	8
19	7
26	10
22	10
42	14
8	8
10	10
32	12
18	10
14	10
70	14
8	8
38	10
12	8
8	8
8	8
12	8
20	8
12	8
20	8
30	10
14	8
22	10
8	8
12	8
10	10
20	8
38	12
18	10
20	8
10	10
8	8
22	14
10	10
8	8
10	10
126	18
8	8
70	14
18	10
8	8
20	12
20	8
22	10
16	8
20	8
26	14
100	16
10	10
32	12
34	12
12	8
22	10
20	8
12	8
22	10
19	7
10	10
22	10
20	12
14	10
70	14
30	10
12	8
24	12
8	8
22	10
18	10
14	8
19	7
20	12
22	14
40	12
18	10
8	8
36	12
12	8
16	8
16	8
16	8
32	16
26	10
8	8
82	18
16	8
18	10
120	20
20	12
20	8
16	8
10	10
20	8
18	10
18	10
20	8
40	12
20	12
10	10
20	8
18	10
8	8
20	8
8	8
16	8
26	10
146	22
40	12
16	8
8	8
10	10
20	8
8	8
20	12
8	8
18	10
26	12
26	10
26	10
32	12
8	8
10	10
8	8
19	7
16	8
8	8
16	8
18	10
36	12
70	14
8	8
26	10
44	12
138	18
8	8
8	8
16	8
28	12
122	18
8	8
30	10
12	8
19	7
12	8
10	10
18	10
14	10
42	14
18	10
8	8
18	10
232	28
20	8
82	14
26	10
18	10
20	8
14	10
30	12
24	12
18	10
30	10
18	10
19	7
10	10
30	10
26	10
18	10
70	14
8	8
10	10
36	12
14	10
28	14
28	12
14	10
26	10
28	10
10	10
30	14
10	10
8	8
20	8
20	8
16	12
20	12
36	12
124	20
8	8
44	12
18	10
28	12
8	8
8	8
46	14
19	7
10	10
10	10
18	10
10	10
12	12
20	8
8	8
16	8
20	8
16	8
10	10
110	14
19	7
26	14
8	8
16	8
26	10
50	14
14	10
8	8
70	14
20	8
19	7
19	7
19	7
10	10
8	8
8	8
10	10
26	10
80	16
22	10
16	8
12	12
18	10
20	12
24	12
20	8
8	8
8	8
16	8
44	12
8	8
8	8
8	8
8	8
18	10
10	10
8	8
10	10
16	8
8	8
22	10
8	8
26	10
16	8
46	14
14	10
18	10
26	10
38	10
28	10
16	8
30	14
8	8
20	12
24	12
8	8
12	8
28	12
16	8
20	8
22	10
40	12
8	8
122	20
8	8
28	12
16	8
26	10
18	12
20	12
8	8
16	8
14	10
18	10
20	12
10	10
36	12
20	8
22	14
22	10
10	10
10	10
36	12
12	8
16	8
12	12
16	8
10	10
46	14
10	10
8	8
160	16
44	12
8	8
30	10
8	8
8	8
8	8
8	8
28	12
16	8
20	12
132	20
16	8
10	10
22	10
8	8
28	12
16	8
18	10
8	8
18	10
30	10
26	10
8	8
14	10
158	22
72	16
8	8
10	10
19	7
16	8
18	10
8	8
10	10
36	12
14	10
43	11
116	16
8	8
10	10
10	10
22	10
110	14
30	14
26	10
10	10
16	8
19	7
8	8
10	10
12	12
19	7
8	8
20	12
102	16
28	12
10	10
10	10
96	16
22	10
38	10
20	8
70	14
30	10
19	7
12	12
18	10
8	8
12	12
19	7
22	10
8	8
10	10
16	12
8	8
24	12
28	12
32	12
12	8
18	10
22	10
20	12
20	12
18	10
24	12
16	8
44	16
19	7
8	8
28	10
12	8
12	12
58	18
36	12
20	12
16	8
20	8
12	8
16	8
22	10
44	12
8	8
20	8
18	10
24	12
30	10
26	10
12	8
12	8
12	12
16	8
26	10
8	8
20	12
10	10
20	8
8	8
16	8
20	12
8	8
8	8
10	10
18	10
110	14
16	8
10	10
24	12
26	10
19	7
8	8
18	10
38	14
10	10
16	8
20	8
10	10
18	10
190	26
12	12
12	8
12	8
16	8
12	8
70	14
30	10
80	16
16	8
8	8
10	10
18	10
8	8
8	8
8	8
18	10
8	8
8	8
8	8
10	10
16	8
8	8
8	8
18	10
8	8
18	10
26	10
20	8
12	8
8	8
176	20
12	8
102	18
10	10
19	7
19	7
18	10
98	18
22	10
22	10
8	8
18	10
28	12
28	12
18	10
16	8
26	10
12	12
72	16
34	12
19	7
70	14
8	8
18	10
8	8
8	8
10	10
32	14
10	10
8	8
10	10
20	8
8	8
8	8
38	14
22	10
8	8
10	10
22	10
20	12
32	12
8	8
22	10
20	12
30	10
18	10
19	7
20	8
16	8
20	8
20	8
140	20
132	18
8	8
8	8
20	12
14	10
8	8
22	14
30	10
28	12
24	12
10	10
10	10
16	8
8	8
14	10
22	10
8	8
22	10
16	10
8	8
8	8
16	8
124	16
30	10
12	8
22	10
18	10
12	8
10	10
18	10
16	8
8	8
12	8
8	8
16	8
20	12
19	7
102	16
16	8
26	10
18	10
16	8
14	10
12	8
18	10
34	14
30	10
8	8
12	8
8	8
10	10
22	10
30	10
38	14
12	12
10	10
20	12
20	12
18	10
10	10
36	12
98	14
30	10
26	10
14	10
22	10
18	10
16	8
16	8
10	10
8	8
8	8
36	12
20	12
22	10
18	10
74	14
8	8
30	10
12	8
10	10
18	10
18	10
30	10
8	8
12	8
8	8
22	14
22	10
16	8
8	8
12	8
22	10
18	10
40	12
20	12
20	12
28	12
12	8
10	10
16	8
8	8
8	8
14	10
10	10
38	10
18	10
20	8
8	8
12	8
20	8
8	8
10	10
19	7
19	7
80	16
10	10
8	8
28	12
80	16
30	10
16	8
8	8
20	8
74	18
22	10
20	8
16	8
8	8
46	14
18	10
46	14
22	14
8	8
30	10
14	10
38	10
20	8
26	10
12	8
8	8
8	8
8	8
10	10
22	10
16	8
10	10
12	8
10	10
72	16
8	8
22	10
30	10
12	12
16	8
8	8
20	12
34	14
8	8
16	8
120	16
28	12
44	12
20	8
20	8
72	16
28	12
20	8
22	10
22	10
20	12
38	10
8	8
10	10
38	12
8	8
12	8
28	14
90	18
43	11
8	8
10	10
20	12
8	8
22	10
20	12
10	10
20	12
30	10
110	18
16	8
35	11
18	10
20	8
20	8
8	8
38	14
8	8
30	10
10	10
30	10
18	10
16	8
16	8
8	8
120	16
22	10
14	10
16	8
10	10
20	8
20	8
24	12
28	12
16	8
30	10
8	8
168	22
16	8
22	10
10	10
12	8
18	10
8	8
90	14
10	10
8	8
10	10
8	8
22	10
10	10
12	8
26	10
18	10
22	10
12	8
10	10
12	8
8	8
44	12
22	10
76	16
18	10
26	10
10	10
8	8
16	8
38	12
22	14
16	8
42	14
12	8
76	16
12	12
8	8
40	14
12	8
18	10
10	10
20	12
19	7
50	14
8	8
10	10
16	8
36	12
16	8
26	10
38	10
10	10
30	14
19	7
18	10
8	8
20	12
8	8
8	8
22	10
8	8
36	12
108	16
16	8
20	8
8	8
18	10
12	8
18	10
38	10
12	8
12	8
18	10
68	16
18	10
18	12
16	8
38	12
18	10
44	12
94	18
26	10
36	12
70	14
26	10
26	10
8	8
16	8
38	14
20	12
43	11
19	7
134	18
16	8
20	8
8	8
18	10
20	12
26	10
16	8
8	8
14	8
16	8
30	10
18	10
20	8
22	14
10	10
10	10
8	8
22	10
12	8
19	7
8	8
8	8
8	8
12	8
8	8
18	10
43	11
78	14
18	10
10	10
8	8
20	12
8	8
8	8
8	8
8	8
22	10
10	10
8	8
92	16
20	8
22	10
10	10
16	8
14	10
20	12
20	12
8	8
18	10
48	12
16	8
10	10
20	12
40	12
36	12
12	8
74	14
16	8
8	8
22	10
20	8
16	8
40	12
26	10
20	8
22	10
26	10
8	8
12	8
20	8
22	10
19	7
20	8
12	12
20	8
16	8
32	12
16	8
28	12
10	10
8	8
18	10
16	8
19	7
40	12
8	8
70	14
24	12
10	10
48	12
8	8
12	8
20	8
8	8
8	8
16	10
16	8
10	10
84	16
8	8
8	8
12	8
8	8
8	8
18	10
38	10
8	8
8	8
16	8
18	10
18	10
22	10
100	16
70	14
18	10
10	10
20	8
16	8
8	8
18	10
8	8
10	10
38	14
18	14
12	12
16	8
20	8
20	8
24	12
20	8
20	12
8	8
18	10
22	14
20	12
14	10
10	10
8	8
18	10
20	12
8	8
40	12
8	8
28	12
30	10
8	8
14	10
70	14
19	7
28	10
20	8
14	10
10	10
16	8
10	10
20	8
22	10
22	10
80	16
10	10
26	10
22	10
20	12
18	10
136	20
19	7
18	10
10	10
18	10
16	8
8	8
12	8
28	10
20	12
92	16
16	8
19	7
16	8
22	10
20	8
38	10
10	10
8	8
12	8
8	8
44	12
8	8
10	10
8	8
18	10
8	8
8	8
22	10
12	8
8	8
22	14
16	8
44	12
8	8
82	14
56	16
18	10
8	8
20	8
18	10
16	8
28	12
8	8
18	10
10	10
16	8
16	8
22	14
19	7
26	10
22	10
30	10
14	10
28	12
20	12
24	12
20	8
18	10
43	11
18	10
40	12
30	10
30	10
8	8
20	8
14	10
20	8
20	12
8	8
22	14
116	16
19	7
8	8
28	12
16	8
38	10
8	8
12	8
20	12
10	10
8	8
28	12
8	8
10	10
16	8
16	8
46	12
10	10
10	10
10	10
19	7
28	12
20	12
18	10
8	8
20	12
19	7
90	14
28	10
18	10
22	10
16	8
20	12
28	10
26	10
10	10
18	10
8	8
8	8
8	8
14	8
8	8
8	8
88	14
18	10
18	10
8	8
8	8
38	10
44	12
44	12
20	8
22	10
19	7
18	10
20	8
18	10
38	14
8	8
30	10
12	8
16	8
38	10
10	10
10	10
8	8
22	14
8	8
19	7
16	8
8	8
14	10
16	8
26	10
22	10
30	10
8	8
36	12
70	14
12	8
12	8
14	10
19	7
20	12
10	10
10	10
44	12
28	12
28	12
8	8
44	12
32	12
18	10
8	8
16	8
26	10
12	8
18	10
8	8
24	12
22	10
18	10
19	7
38	12
16	8
8	8
90	18
20	8
20	8
26	10
18	10
16	8
19	7
20	12
10	10
20	12
8	8
72	16
18	10
22	14
8	8
8	8
8	8
16	8
18	10
8	8
16	10
8	8
62	14
8	8
30	10
26	10
14	10
18	10
49	13
18	10
8	8
10	10
80	16
22	10
32	12
104	16
12	8
12	8
26	10
20	8
19	7
36	16
8	8
72	16
10	10
154	22
14	10
106	18
10	10
19	7
110	18
20	8
46	14
8	8
22	10
8	8
20	12
20	12
18	10
18	10
10	10
22	14
8	8
16	8
18	10
8	8
26	10
8	8
26	10
14	8
46	14
10	10
38	14
302	30
20	12
10	10
22	10
19	7
38	14
20	12
18	10
16	8
10	10
20	8
70	14
16	8
8	8
26	10
22	10
70	14
12	8
18	10
84	16
26	10
26	10
18	10
18	10
16	8
38	10
8	8
40	12
18	10
8	8
70	14
76	16
70	14
38	10
8	8
38	10
14	10
44	16
16	8
16	8
16	8
8	8
20	12
8	8
19	7
20	8
19	7
8	8
8	8
108	16
19	7
28	12
36	12
36	12
20	12
18	10
8	8
18	10
8	8
30	14
16	8
116	18
20	8
12	12
18	10
44	12
8	8
8	8
20	8
26	10
20	8
56	16
18	10
16	8
8	8
10	10
12	8
8	8
30	10
19	7
20	8
38	10
16	8
16	8
8	8
10	10
8	8
14	10
10	10
10	10
28	12
8	8
18	10
10	10
80	16
26	10
19	7
16	8
8	8
20	8
8	8
38	10
26	10
8	8
38	10
22	10
72	16
8	8
19	7
26	10
70	14
8	8
10	10
16	8
8	8
20	8
16	8
10	10
48	12
10	10
16	8
20	8
22	10
10	10
14	10
80	16
18	10
10	10
10	10
19	7
10	10
86	14
19	7
16	8
8	8
10	10
10	10
12	8
16	8
38	10
92	16
158	22
8	8
48	12
26	10
18	10
19	7
14	8
10	10
16	8
20	8
20	8
8	8
12	12
28	10
12	8
22	10
19	7
20	8
10	10
16	8
8	8
18	10
8	8
10	10
16	8
12	8
20	8
26	10
38	10
8	8
12	8
8	8
26	10
110	18
16	8
104	16
43	11
19	7
10	10
19	7
16	8
12	8
26	10
8	8
26	10
8	8
19	7
46	14
22	10
50	14
26	10
20	12
58	14
14	10
8	8
18	10
19	7
46	14
16	12
12	8
20	12
20	12
8	8
96	16
12	8
16	8
16	8
66	18
8	8
36	12
38	10
8	8
8	8
22	10
18	10
10	10
12	8
16	8
16	8
38	10
70	14
12	8
20	12
16	8
110	14
16	8
22	10
18	10
8	8
26	10
8	8
16	8
20	8
44	12
8	8
8	8
30	10
10	10
18	10
22	14
8	8
18	10
18	10
16	8
24	12
12	8
8	8
8	8
10	10
16	8
456	44
43	11
104	20
70	14
16	10
16	8
10	10
12	8
20	12
10	10
10	10
10	10
8	8
10	10
22	14
20	8
16	8
19	7
20	8
18	10
8	8
8	8
8	8
8	8
36	12
18	10
8	8
20	8
16	8
8	8
22	10
12	8
30	10
28	10
8	8
28	12
19	7
20	8
44	12
10	10
22	10
10	10
22	10
10	10
38	14
100	16
12	8
22	10
18	10
16	8
8	8
18	10
118	18
8	8
8	8
68	16
19	7
26	10
26	10
8	8
20	12
16	8
8	8
16	8
10	10
8	8
26	10
24	12
16	12
8	8
8	8
10	10
10	10
8	8
16	8
43	11
22	10
22	14
18	10
20	8
16	8
22	10
22	10
20	8
12	8
8	8
8	8
22	10
19	7
40	16
12	8
12	8
20	12
36	12
14	10
8	8
19	7
18	10
12	8
10	10
8	8
18	10
14	10
8	8
12	12
18	10
10	10
8	8
80	16
20	8
8	8
8	8
20	12
36	12
18	10
20	8
18	10
38	10
18	10
36	12
16	8
16	8
16	8
40	12
14	8
32	12
12	12
10	10
20	8
82	18
40	12
60	16
16	8
28	10
22	14
8	8
22	10
30	10
32	12
18	10
36	12
12	12
12	8
12	8
40	16
8	8
8	8
8	8
18	10
16	8
44	12
12	8
44	12
28	12
8	8
18	10
24	12
22	14
100	16
16	8
18	10
10	10
30	10
20	12
32	12
16	8
18	10
12	8
12	8
70	14
20	12
26	10
8	8
18	10
8	8
8	8
16	8
8	8
12	12
22	10
12	12
54	12
8	8
10	10
18	10
144	20
10	10
8	8
8	8
12	8
16	8
8	8
20	8
8	8
19	7
16	8
8	8
20	8
38	10
12	12
98	18
112	20
8	8
10	10
82	14
22	10
16	8
124	16
10	10
8	8
22	10
12	8
20	8
8	8
20	8
44	12
8	8
19	7
16	10
8	8
38	10
40	12
12	8
20	8
16	8
12	8
8	8
70	14
50	14
16	8
24	12
20	8
8	8
22	14
22	10
8	8
96	16
36	12
14	10
12	12
12	8
78	14
8	8
22	10
8	8
20	12
20	12
8	8
56	16
124	20
8	8
14	10
20	8
8	8
18	10
22	10
16	8
18	10
38	10
8	8
19	7
18	10
10	10
12	8
12	12
16	8
10	10
36	12
8	8
22	14
18	10
20	8
18	10
70	14
18	10
76	16
8	8
8	8
12	8
16	8
19	7
108	16
8	8
14	8
26	10
8	8
8	8
16	8
20	8
16	8
14	10
36	12
20	8
10	10
8	8
8	8
16	8
8	8
12	8
22	10
26	10
16	8
8	8
18	10
12	8
14	8
8	8
18	10
8	8
10	10
114	18
8	8
16	8
38	14
8	8
8	8
16	8
50	14
42	14
14	10
8	8
18	10
10	10
16	8
18	10
12	8
20	8
8	8
8	8
22	10
44	12
80	16
18	10
16	10
82	18
8	8
12	12
72	16
18	10
8	8
16	8
22	10
18	10
70	14
12	12
102	18
12	8
76	16
96	16
10	10
10	10
16	8
20	8
20	12
10	10
12	12
16	8
22	14
8	8
108	16
20	8
8	8
19	7
8	8
36	12
18	10
16	8
8	8
16	8
18	10
38	10
92	16
10	10
16	8
20	8
8	8
18	10
20	8
8	8
24	12
12	12
12	8
32	12
16	8
82	14
80	16
24	12
18	10
22	10
150	18
20	8
10	10
20	12
19	7
16	12
16	8
28	12
22	10
10	10
26	10
8	8
36	12
16	8
8	8
16	8
16	8
22	10
28	10
28	10
58	18
22	14
10	10
10	10
8	8
14	8
100	16
44	12
10	10
30	10
8	8
10	10
8	8
18	10
19	7
20	8
24	12
38	12
130	14
8	8
26	10
19	7
14	10
16	8
19	7
8	8
18	10
20	12
8	8
36	12
10	10
16	8
30	10
16	8
38	10
194	22
10	10
22	10
16	8
122	16
20	12
43	11
8	8
26	10
8	8
46	14
8	8
22	10
30	10
19	7
82	14
38	10
28	12
30	10
12	8
19	7
18	10
24	12
8	8
8	8
8	8
38	10
10	10
20	8
36	12
18	10
12	8
8	8
26	10
8	8
8	8
8	8
38	10
10	10
8	8
32	12
12	8
12	8
18	10
18	10
50	14
8	8
20	12
12	8
8	8
8	8
10	10
8	8
26	10
8	8
18	10
18	10
20	8
8	8
18	10
18	10
222	26
16	12
12	8
22	10
18	10
8	8
8	8
12	8
38	10
8	8
38	10
12	8
18	10
22	10
26	10
10	10
26	10
16	10
8	8
18	10
8	8
106	18
16	8
18	10
8	8
22	10
20	8
8	8
26	10
80	16
8	8
12	12
8	8
22	10
32	12
16	8
8	8
14	10
8	8
18	10
10	10
32	12
10	10
18	10
30	10
8	8
18	10
46	14
32	12
16	8
14	10
16	8
22	14
20	12
16	8
16	8
18	10
16	8
10	10
38	10
8	8
8	8
22	14
32	12
8	8
8	8
8	8
22	10
8	8
16	8
22	10
22	14
8	8
10	10
19	7
16	8
18	10
8	8
22	10
8	8
10	10
20	12
90	14
10	10
36	12
26	10
18	10
32	12
30	10
20	8
18	10
22	10
14	10
8	8
19	7
10	10
128	20
16	8
8	8
36	12
12	8
30	10
10	10
10	10
32	12
19	7
8	8
12	8
16	8
12	12
16	8
12	8
20	8
8	8
10	10
8	8
8	8
8	8
16	8
12	8
14	10
10	10
10	10
12	8
8	8
8	8
36	12
8	8
90	18
70	14
18	10
38	10
26	10
8	8
24	12
16	8
120	16
12	8
8	8
10	10
16	8
26	10
22	10
8	8
16	8
20	8
22	10
18	10
8	8
82	18
70	14
8	8
20	8
10	10
19	7
8	8
26	10
20	8
18	10
18	10
44	12
70	14
12	8
30	10
8	8
18	10
20	8
28	12
22	10
26	10
42	14
20	12
8	8
22	10
8	8
20	12
38	14
8	8
38	10
26	10
18	10
12	12
12	8
44	14
18	10
8	8
46	14
70	14
26	10
16	8
12	12
24	16
10	10
22	10
18	10
8	8
10	10
10	10
8	8
16	12
14	10
20	12
12	8
8	8
30	14
18	10
26	10
30	10
8	8
22	10
18	10
18	10
8	8
8	8
16	8
8	8
12	12
18	10
18	10
8	8
30	10
19	7
18	10
18	12
8	8
8	8
138	20
30	10
28	10
22	10
18	10
22	10
10	10
8	8
10	10
14	10
19	7
8	8
8	8
8	8
19	7
8	8
20	8
8	8
20	12
18	10
26	10
12	12
10	10
26	10
28	12
8	8
16	10
10	10
12	12
100	16
20	8
8	8
22	10
8	8
10	10
24	12
18	10
26	10
26	10
18	10
10	10
10	10
22	10
36	12
18	10
8	8
22	10
16	8
10	10
10	10
26	10
16	8
10	10
8	8
16	8
20	8
20	8
18	10
26	10
26	10
20	8
18	10
10	10
8	8
20	12
28	10
8	8
10	10
38	12
16	8
26	10
70	14
20	8
18	10
12	12
18	10
10	10
12	8
20	8
42	14
12	12
38	10
108	16
8	8
10	10
16	8
20	8
8	8
10	10
8	8
24	12
10	10
8	8
8	8
12	8
8	8
14	10
20	8
8	8
18	10
22	10
10	10
10	10
18	10
16	8
14	8
30	10
22	10
44	12
8	8
10	10
8	8
18	10
20	12
22	14
8	8
26	10
22	10
16	8
8	8
20	8
10	10
8	8
44	12
8	8
50	14
70	14
8	8
100	20
20	8
30	10
30	10
10	10
20	8
10	10
20	8
16	8
10	10
80	16
18	10
8	8
26	10
8	8
8	8
8	8
8	8
10	10
8	8
16	8
10	10
8	8
90	18
38	14
8	8
32	12
10	10
12	8
20	8
18	10
8	8
8	8
16	8
98	18
18	10
82	18
12	12
18	10
12	12
22	10
16	8
14	8
92	16
82	18
14	10
14	10
16	8
20	12
20	8
26	10
26	10
8	8
38	10
22	10
18	10
8	8
8	8
26	14
8	8
10	10
18	10
8	8
88	16
16	8
22	10
8	8
12	8
22	10
26	10
12	8
32	12
18	10
36	12
10	10
8	8
8	8
16	8
30	10
16	8
20	12
10	10
12	12
10	10
10	10
46	14
16	8
40	12
8	8
19	7
8	8
10	10
26	12
20	12
12	12
8	8
10	10
10	10
19	7
12	12
26	14
12	8
8	8
10	10
20	8
22	10
44	12
30	10
28	12
18	10
22	10
8	8
36	12
8	8
26	10
16	8
16	8
12	12
26	10
10	10
10	10
44	12
38	12
22	10
10	10
22	10
8	8
18	12
10	10
24	12
20	12
130	18
18	10
16	8
16	8
18	10
20	8
19	7
16	8
8	8
36	12
19	7
44	12
20	12
19	7
30	10
8	8
22	10
20	12
8	8
10	10
20	12
26	10
28	14
10	10
8	8
10	10
12	12
20	8
22	10
10	10
22	10
20	8
80	16
20	12
10	10
8	8
12	8
26	10
8	8
36	12
12	8
108	20
16	8
8	8
18	10
16	8
10	10
18	10
18	10
8	8
19	7
18	10
16	8
20	12
16	8
10	10
26	10
16	8
49	13
14	10
70	14
19	7
40	12
26	10
20	12
16	8
88	16
8	8
14	10
8	8
48	16
8	8
28	12
8	8
22	14
30	10
12	8
8	8
8	8
16	8
20	8
92	16
116	18
8	8
43	11
16	8
22	14
8	8
8	8
10	10
16	8
8	8
8	8
8	8
24	12
36	12
64	16
70	14
22	14
16	8
56	16
16	8
8	8
10	10
20	8
16	8
30	10
18	10
19	7
20	12
122	16
8	8
8	8
26	10
8	8
82	18
8	8
20	8
38	10
22	10
14	10
24	12
22	14
38	10
32	12
19	7
30	10
20	8
8	8
18	10
16	8
70	14
10	10
18	10
20	8
26	10
8	8
16	8
28	12
84	16
38	14
36	12
8	8
16	8
38	10
46	14
16	8
14	10
8	8
8	8
19	7
18	10
22	10
8	8
38	10
26	10
20	8
12	8
20	12
12	8
20	12
30	10
142	18
166	22
16	8
10	10
98	18
16	8
80	16
16	8
22	10
40	12
82	18
12	8
18	10
8	8
16	8
26	10
62	14
20	8
32	12
8	8
28	12
22	10
12	8
22	10
8	8
20	8
86	14
12	8
16	8
57	13
96	16
8	8
36	12
82	18
48	16
8	8
34	14
38	10
86	18
36	12
26	10
30	10
16	8
18	10
16	8
40	12
18	10
20	8
8	8
16	8
20	8
8	8
26	12
12	8
8	8
12	12
24	12
32	12
22	10
28	12
20	12
74	14
12	8
72	16
19	7
19	7
20	8
20	8
10	10
18	10
19	7
8	8
18	10
48	16
8	8
26	10
70	14
12	8
8	8
10	10
16	8
18	10
8	8
12	8
20	8
20	12
22	14
8	8
8	8
18	10
10	10
26	14
46	14
12	8
22	10
19	7
14	10
12	8
18	10
8	8
26	14
20	8
74	14
16	8
22	10
18	10
22	10
28	12
18	10
10	10
8	8
26	10
20	12
10	10
8	8
22	10
22	10
19	7
19	7
12	8
20	12
18	10
8	8
19	7
35	11
28	12
8	8
20	8
12	8
19	7
16	8
8	8
26	10
38	10
12	12
8	8
26	10
26	10
70	14
22	10
8	8
22	10
8	8
18	10
18	10
10	10
8	8
20	12
16	8
8	8
16	8
22	10
20	8
8	8
8	8
8	8
16	8
26	10
20	8
8	8
10	10
18	10
16	8
20	8
18	10
20	12
35	11
26	10
16	8
22	10
12	12
16	8
30	10
19	7
12	8
8	8
30	10
28	12
8	8
22	14
86	14
84	16
20	12
90	18
38	10
22	10
12	8
8	8
164	24
28	12
18	10
10	10
20	12
22	10
10	10
12	8
30	10
22	10
18	10
8	8
8	8
20	8
10	10
30	10
22	10
20	8
20	8
12	12
8	8
26	10
14	10
10	10
20	8
10	10
84	16
16	8
22	10
8	8
10	10
12	8
18	10
12	8
16	8
18	10
12	8
20	8
8	8
20	8
19	7
16	12
8	8
12	8
20	12
8	8
16	8
90	18
28	10
8	8
20	8
10	10
10	10
10	10
20	8
90	18
20	12
26	10
144	20
8	8
10	10
8	8
30	10
18	10
18	10
16	8
40	16
19	7
8	8
8	8
28	12
10	10
26	10
16	8
16	8
18	10
64	16
8	8
46	14
18	10
20	12
16	8
20	8
20	8
28	10
8	8
18	10
20	12
16	8
82	18
35	11
32	12
16	8
30	10
8	8
28	12
20	12
8	8
8	8
82	18
98	18
20	8
10	10
20	8
10	10
30	10
8	8
8	8
14	14
20	12
8	8
8	8
10	10
20	12
8	8
18	10
20	8
38	10
35	11
18	10
16	8
16	8
8	8
8	8
32	12
10	10
8	8
12	8
19	7
12	8
8	8
32	12
46	14
10	10
8	8
18	10
10	10
8	8
20	12
19	7
10	10
28	12
20	8
18	10
16	8
40	12
8	8
10	10
20	12
10	10
10	10
16	8
18	10
8	8
54	12
28	12
8	8
10	10
36	12
26	10
8	8
8	8
16	8
18	10
30	10
8	8
18	10
8	8
18	10
20	12
10	10
20	12
8	8
8	8
16	12
16	8
28	12
8	8
30	10
38	10
46	14
22	14
18	10
10	10
92	20
12	8
8	8
22	10
8	8
8	8
20	8
8	8
38	10
16	8
16	8
28	10
8	8
40	12
16	8
10	10
8	8
10	10
26	10
8	8
12	8
18	10
38	10
8	8
12	8
100	16
20	8
16	8
12	8
8	8
22	10
8	8
22	10
22	10
14	10
44	12
70	14
28	12
20	8
20	12
8	8
8	8
14	10
22	10
8	8
16	8
26	10
48	12
20	12
38	10
10	10
20	8
8	8
28	12
30	10
82	14
22	10
86	18
30	10
22	14
18	10
64	16
20	12
22	10
32	12
70	14
70	14
8	8
8	8
30	10
26	10
16	8
20	12
14	10
20	8
22	10
20	12
18	10
96	16
10	10
22	10
30	10
8	8
10	10
18	10
16	8
16	8
26	10
82	14
8	8
12	8
20	12
12	8
20	8
16	12
36	12
10	10
12	8
18	10
8	8
8	8
22	14
8	8
10	10
12	8
18	10
44	12
18	10
8	8
16	8
18	10
26	10
8	8
20	12
24	12
10	10
186	24
100	16
30	10
8	8
10	10
8	8
26	10
8	8
20	8
26	10
52	16
26	10
72	16
18	10
30	10
24	12
19	7
16	8
8	8
20	8
16	8
26	10
30	14
19	7
18	10
8	8
10	10
16	8
16	8
28	12
90	18
28	12
44	12
8	8
20	8
8	8
84	16
10	10
54	12
26	12
20	12
10	10
10	10
8	8
156	16
10	10
8	8
16	8
28	12
8	8
10	10
8	8
20	8
8	8
20	8
38	12
12	8
28	10
8	8
8	8
8	8
36	12
14	10
28	12
22	10
24	12
10	10
8	8
8	8
16	8
8	8
44	12
18	10
26	10
40	12
8	8
22	14
10	10
10	10
12	8
16	8
20	12
24	12
16	8
22	10
20	12
8	8
20	12
92	16
12	12
8	8
18	10
19	7
16	8
32	12
10	10
90	18
18	10
16	8
100	16
18	12
10	10
36	12
18	10
8	8
30	12
10	10
8	8
96	16
18	10
10	10
38	10
26	10
26	10
14	10
10	10
22	10
19	7
22	14
16	8
28	16
10	10
16	8
20	12
8	8
20	8
8	8
36	12
8	8
42	14
10	10
18	10
20	12
22	14
22	10
8	8
20	8
8	8
8	8
12	12
8	8
8	8
8	8
80	16
8	8
8	8
10	10
70	14
19	7
10	10
36	12
16	8
86	14
18	10
28	12
10	10
10	10
20	8
38	10
82	14
90	14
22	10
18	10
22	10
8	8
8	8
8	8
70	14
36	12
10	10
16	8
16	8
24	12
80	16
16	8
10	10
20	12
90	18
8	8
10	10
72	16
10	10
22	14
10	10
8	8
10	10
10	10
16	8
20	8
12	12
57	13
12	12
12	12
8	8
66	18
28	12
20	8
16	8
24	12
19	7
8	8
10	10
18	10
36	12
38	10
70	14
8	8
8	8
16	8
82	14
18	10
16	8
8	8
38	10
12	12
20	8
19	7
20	12
116	20
8	8
19	7
44	12
8	8
70	14
8	8
12	12
20	12
72	16
92	16
18	10
22	10
26	10
18	10
8	8
18	10
68	16
19	7
120	24
8	8
22	10
18	10
26	10
8	8
8	8
12	8
20	8
10	10
18	10
24	12
22	10
22	10
178	18
16	8
8	8
46	14
16	8
12	12
18	10
14	10
10	10
8	8
8	8
8	8
8	8
38	10
22	10
10	10
12	8
38	10
20	8
20	12
26	10
8	8
8	8
70	14
22	10
98	18
8	8
16	8
32	12
12	12
10	10
8	8
22	10
16	8
8	8
26	10
26	10
18	10
70	14
10	10
12	12
38	10
19	7
22	14
18	10
18	10
108	16
20	12
19	7
18	10
22	10
28	12
18	10
22	14
26	10
8	8
8	8
26	10
22	10
24	12
20	12
36	12
18	10
10	10
10	10
18	10
70	14
108	16
19	7
38	10
8	8
26	10
18	10
12	12
10	10
20	12
22	14
19	7
24	12
10	10
12	12
12	8
10	10
19	7
8	8
150	18
12	8
14	10
26	10
26	10
16	8
180	20
16	8
16	8
10	10
8	8
40	12
14	10
110	14
8	8
114	18
8	8
140	20
10	10
70	14
8	8
8	8
32	12
16	8
14	10
43	11
28	12
10	10
12	8
8	8
22	10
8	8
26	10
20	8
19	7
35	11
8	8
16	8
54	14
16	8
106	18
82	14
16	8
18	10
10	10
80	16
80	16
8	8
8	8
12	8
20	8
10	10
8	8
18	10
8	8
8	8
8	8
74	14
12	8
8	8
8	8
16	8
22	10
20	8
20	8
12	8
142	18
102	18
22	10
32	12
56	16
26	10
8	8
8	8
8	8
74	14
8	8
20	8
30	10
8	8
138	18
20	8
14	10
20	12
16	8
14	10
18	10
16	8
10	10
86	14
8	8
20	12
8	8
19	7
22	14
18	10
18	10
22	10
22	10
192	24
20	12
18	10
26	10
22	14
8	8
8	8
28	12
19	7
30	10
46	14
18	10
22	10
8	8
20	8
22	10
42	14
38	10
22	10
8	8
26	10
28	12
8	8
35	11
19	7
22	14
20	8
14	10
30	10
10	10
16	8
96	16
126	16
26	14
18	10
20	12
10	10
12	12
22	10
20	8
18	10
22	10
10	10
18	10
12	8
26	10
18	10
54	12
12	12
22	14
22	10
8	8
44	12
10	10
19	7
12	8
8	8
8	8
8	8
26	10
8	8
8	8
20	8
38	10
10	10
12	8
14	10
8	8
8	8
8	8
18	10
28	12
20	8
20	8
20	8
16	8
20	8
8	8
8	8
24	12
28	10
10	10
8	8
8	8
10	10
22	10
12	8
10	10
10	10
16	12
16	8
16	8
18	10
88	16
10	10
16	8
18	10
10	10
18	10
16	8
8	8
10	10
8	8
30	10
8	8
19	7
32	12
10	10
8	8
18	10
16	8
8	8
8	8
18	10
10	10
8	8
48	12
16	8
8	8
130	18
12	12
8	8
12	12
20	12
18	10
19	7
12	12
110	16
22	10
20	8
10	10
8	8
16	10
38	10
60	16
20	8
8	8
22	10
28	12
20	8
18	10
12	8
164	20
38	10
20	8
16	8
8	8
124	16
112	16
18	10
12	12
8	8
30	14
10	10
150	22
16	8
16	8
20	8
8	8
20	8
16	8
10	10
16	8
188	22
16	8
8	8
8	8
18	10
19	7
8	8
35	11
8	8
18	10
16	8
16	8
10	10
18	10
52	16
8	8
8	8
12	12
18	10
82	18
18	10
8	8
20	8
20	8
8	8
19	7
24	12
16	12
10	10
14	10
19	7
19	7
92	16
20	12
20	8
8	8
19	7
8	8
8	8
26	10
16	10
46	14
18	10
20	8
20	8
8	8
110	14
20	12
8	8
30	10
18	10
19	7
8	8
14	10
10	10
26	10
8	8
30	10
20	8
12	8
138	18
44	12
102	18
10	10
8	8
16	8
8	8
26	14
10	10
18	10
16	8
20	8
110	18
16	12
19	7
16	8
70	14
12	8
30	10
8	8
16	8
12	8
8	8
26	10
10	10
12	8
8	8
10	10
124	16
8	8
12	12
72	16
8	8
60	16
18	10
12	8
18	10
19	7
100	16
8	8
10	10
10	10
28	10
12	8
12	12
16	8
20	8
24	12
18	10
8	8
20	12
12	8
10	10
26	10
8	8
16	8
18	10
18	10
38	10
10	10
43	11
8	8
22	10
16	8
10	10
8	8
18	10
46	14
82	18
18	10
22	14
28	12
122	18
22	14
20	8
8	8
18	10
12	8
18	10
16	8
8	8
16	10
10	10
14	8
8	8
8	8
10	10
34	12
28	12
8	8
20	8
22	14
30	10
43	11
22	10
8	8
20	8
8	8
22	10
28	12
10	10
14	10
10	10
20	8
8	8
10	10
12	8
8	8
30	10
30	10
12	12
12	8
20	12
28	12
20	12
19	7
92	16
8	8
16	8
18	10
20	8
16	8
16	8
8	8
46	14
10	10
36	12
28	10
44	12
8	8
10	10
70	14
80	16
110	22
70	14
26	10
22	14
10	10
8	8
36	12
22	10
12	8
43	11
20	8
12	8
8	8
12	8
28	12
10	10
18	10
16	8
20	8
20	12
26	10
38	10
72	16
20	8
20	12
30	12
19	7
12	8
10	10
8	8
20	8
20	12
22	10
18	10
10	10
28	12
8	8
8	8
20	12
12	12
43	11
20	12
8	8
30	10
14	10
20	12
20	12
19	7
8	8
26	10
26	10
26	10
16	8
20	8
20	8
20	12
8	8
22	10
8	8
16	8
30	10
20	8
70	14
19	7
8	8
12	12
12	8
8	8
22	10
10	10
38	14
80	16
10	10
16	8
8	8
24	12
26	14
10	10
19	7
8	8
22	10
8	8
20	8
20	8
8	8
36	12
22	10
18	10
12	8
100	20
14	10
120	16
8	8
98	18
19	7
10	10
16	8
18	10
90	14
10	10
8	8
22	10
10	10
26	10
30	10
20	12
44	12
8	8
8	8
70	14
16	8
48	16
38	10
20	12
8	8
8	8
18	10
8	8
26	10
43	11
16	8
18	10
36	12
22	14
8	8
126	22
10	10
20	12
16	8
8	8
26	14
20	12
8	8
14	10
8	8
8	8
10	10
20	12
16	8
22	10
19	7
26	10
8	8
28	12
36	12
26	10
38	10
14	10
19	7
30	10
8	8
36	12
8	8
20	12
20	12
20	8
22	10
20	12
18	10
14	10
20	8
8	8
12	8
8	8
18	10
8	8
38	14
16	12
8	8
16	8
8	8
16	8
8	8
22	10
16	8
44	16
8	8
22	10
18	10
8	8
22	10
18	10
20	8
19	7
8	8
16	8
26	10
20	8
8	8
20	12
20	12
16	8
34	14
8	8
36	12
10	10
26	10
42	14
48	12
19	7
96	16
24	12
22	10
20	12
12	12
20	8
16	8
8	8
8	8
8	8
22	10
70	14
48	16
70	14
80	16
8	8
18	10
14	10
8	8
10	10
20	8
10	10
8	8
8	8
12	12
8	8
96	16
46	14
22	10
10	10
20	8
22	10
90	18
8	8
26	10
26	10
70	14
8	8
42	14
20	8
22	14
18	10
36	12
20	8
26	10
8	8
12	12
16	10
8	8
8	8
92	16
22	10
8	8
22	10
20	12
10	10
28	12
12	12
28	10
22	10
72	16
8	8
30	10
8	8
18	10
8	8
8	8
10	10
8	8
19	7
8	8
30	10
12	8
16	8
38	10
90	18
16	8
8	8
20	8
48	12
14	10
30	10
26	10
8	8
8	8
22	10
8	8
36	12
40	12
36	12
16	8
20	8
19	7
18	10
10	10
8	8
22	14
8	8
19	7
86	14
20	8
22	14
72	16
8	8
19	7
8	8
38	10
22	10
14	10
72	16
20	8
20	12
10	10
8	8
8	8
70	14
12	12
8	8
14	10
10	10
8	8
8	8
36	12
26	14
8	8
18	10
20	8
154	18
8	8
8	8
8	8
18	10
10	10
12	12
8	8
36	12
20	12
8	8
20	8
16	8
30	10
92	16
10	10
16	8
8	8
12	12
72	16
8	8
19	7
16	8
8	8
8	8
72	16
18	10
30	10
18	10
10	10
18	10
86	14
19	7
8	8
38	10
10	10
10	10
16	8
18	10
22	10
16	8
8	8
76	16
8	8
30	10
14	8
78	14
8	8
78	16
8	8
8	8
8	8
38	10
20	12
8	8
8	8
20	8
16	8
44	12
8	8
16	8
30	10
84	20
32	12
8	8
30	10
24	12
8	8
8	8
10	10
16	8
8	8
8	8
10	10
20	12
82	18
26	12
8	8
10	10
16	8
24	12
16	8
22	14
8	8
8	8
20	8
8	8
10	10
16	8
20	8
20	8
8	8
8	8
8	8
14	14
36	12
30	10
20	12
12	8
20	12
56	14
18	10
16	8
20	8
8	8
20	8
16	8
8	8
30	10
22	10
18	10
20	12
8	8
16	8
152	20
16	8
40	12
30	10
10	10
10	10
20	8
36	12
26	10
8	8
70	14
54	12
8	8
8	8
8	8
22	10
8	8
10	10
10	10
8	8
10	10
18	10
22	14
20	12
20	12
10	10
12	8
8	8
26	10
92	16
8	8
10	10
28	10
10	10
19	7
32	16
20	8
22	10
12	12
28	12
22	14
8	8
16	8
22	10
10	10
20	8
16	8
14	10
8	8
70	14
10	10
26	14
36	12
16	8
152	20
8	8
10	10
8	8
18	10
30	10
10	10
10	10
10	10
20	8
19	7
22	10
20	8
16	8
28	12
8	8
18	10
10	10
19	7
16	8
38	10
43	11
80	16
18	10
8	8
10	10
38	10
22	10
112	16
18	10
18	10
18	10
8	8
20	8
19	7
40	12
8	8
18	10
10	10
8	8
16	8
28	12
26	14
72	16
132	16
8	8
110	14
30	10
36	12
16	8
16	12
18	10
19	7
18	10
8	8
28	14
16	8
12	8
32	12
16	8
80	16
22	10
38	10
18	10
20	8
8	8
16	8
26	10
30	10
18	10
8	8
26	14
12	8
20	8
8	8
20	8
20	12
8	8
8	8
38	10
8	8
20	8
18	10
20	8
8	8
26	10
10	10
8	8
18	10
18	10
18	10
10	10
8	8
8	8
16	8
20	12
14	10
20	8
8	8
16	8
20	12
36	12
16	8
18	10
18	10
20	8
8	8
18	10
8	8
46	14
8	8
20	8
16	8
8	8
19	7
10	10
8	8
19	7
8	8
8	8
8	8
10	10
10	10
8	8
28	10
8	8
18	10
8	8
19	7
18	10
32	12
32	12
30	10
19	7
110	16
20	8
24	12
20	8
16	8
16	8
20	8
8	8
38	10
22	10
112	16
8	8
38	10
16	8
94	18
16	8
8	8
12	8
26	10
22	10
8	8
30	10
18	10
28	12
10	10
50	14
8	8
8	8
10	10
12	8
8	8
12	8
22	14
8	8
20	12
28	12
19	7
20	8
16	8
22	10
8	8
38	12
20	8
8	8
24	12
10	10
8	8
10	10
122	20
20	8
46	14
30	10
18	10
20	8
14	10
16	8
16	8
18	10
20	8
10	10
80	16
19	7
116	16
32	12
8	8
78	14
24	12
22	14
8	8
30	10
74	14
20	8
18	10
28	12
14	10
8	8
18	10
8	8
22	10
8	8
12	12
22	10
10	10
8	8
8	8
18	10
18	10
8	8
19	7
10	10
20	8
8	8
8	8
8	8
8	8
20	8
22	10
18	10
8	8
14	8
8	8
14	10
122	18
12	8
16	8
28	10
19	7
30	10
20	12
12	8
20	8
10	10
16	8
8	8
18	10
8	8
16	8
20	8
8	8
18	10
26	10
18	10
8	8
20	8
24	12
82	14
16	8
8	8
10	10
8	8
12	12
8	8
18	10
8	8
22	10
14	10
20	12
18	10
114	18
38	10
10	10
44	12
10	10
8	8
22	10
19	7
8	8
20	8
20	8
20	12
8	8
22	10
44	12
22	10
16	8
22	14
16	8
8	8
18	10
20	8
8	8
20	12
20	8
8	8
22	10
12	8
22	10
8	8
8	8
54	12
8	8
22	10
26	10
26	10
10	10
8	8
26	10
19	7
8	8
8	8
30	12
36	12
18	10
16	8
16	8
30	10
72	16
18	10
16	10
18	10
40	12
16	8
22	10
8	8
16	8
24	12
92	16
16	8
48	16
10	10
62	14
38	10
8	8
32	12
20	8
20	8
8	8
20	8
36	12
10	10
20	8
12	8
18	10
24	12
30	14
43	11
16	8
18	10
20	12
12	8
32	12
8	8
12	8
20	8
35	11
18	10
8	8
8	8
10	10
8	8
8	8
20	8
16	8
10	10
8	8
8	8
84	16
20	12
8	8
8	8
30	10
22	10
12	8
19	7
90	18
8	8
8	8
18	10
18	10
74	14
16	8
72	16
8	8
8	8
8	8
70	14
20	8
10	10
30	10
8	8
16	8
8	8
16	8
22	10
30	10
20	8
20	8
76	16
46	14
36	12
12	8
19	7
10	10
8	8
46	14
8	8
16	8
20	8
20	8
20	8
20	8
20	8
22	14
12	8
16	8
32	12
110	14
22	10
28	12
10	10
14	10
8	8
22	14
8	8
10	10
38	14
18	10
16	8
18	10
10	10
22	10
36	12
22	10
18	10
14	10
22	14
8	8
26	14
18	10
19	7
12	12
8	8
8	8
22	14
8	8
18	10
8	8
20	8
74	18
8	8
74	14
12	8
16	8
38	10
18	10
8	8
16	8
8	8
38	14
10	10
8	8
20	8
20	12
16	12
8	8
8	8
26	10
20	12
24	12
16	8
12	12
44	12
110	18
28	12
46	14
12	8
70	14
10	10
18	10
8	8
8	8
20	8
8	8
10	10
8	8
26	10
18	10
10	10
8	8
20	12
16	8
12	8
208	28
14	10
16	8
18	10
8	8
18	10
30	14
8	8
20	12
20	8
14	10
12	8
152	20
20	12
36	12
18	10
40	12
18	10
10	10
28	10
8	8
22	10
19	7
38	10
18	10
20	8
30	10
10	10
18	10
28	12
18	10
38	10
26	12
8	8
38	10
10	10
24	12
36	12
20	8
8	8
14	8
20	8
8	8
18	10
22	10
16	8
18	10
20	12
30	10
22	10
22	10
12	8
28	12
10	10
19	7
8	8
43	11
16	12
18	10
8	8
10	10
12	12
26	10
26	10
10	10
32	12
8	8
88	16
16	8
16	8
22	10
12	8
8	8
36	12
26	10
8	8
8	8
18	10
8	8
10	10
32	12
26	10
12	12
98	18
18	10
22	10
12	8
44	12
12	12
36	12
30	10
10	10
12	8
26	10
10	10
120	16
8	8
8	8
22	10
43	11
26	10
18	10
12	8
8	8
8	8
8	8
16	8
8	8
12	8
32	12
8	8
8	8
8	8
8	8
22	10
26	10
