Score	Length
16	8
12	8
18	10
218	18
12	8
26	10
8	8
19	7
214	22
26	10
28	12
40	12
18	14
30	10
42	14
8	8
8	8
8	8
24	12
22	10
38	10
16	8
36	12
10	10
22	10
10	10
26	10
18	10
26	10
14	10
20	8
30	10
12	8
19	7
22	10
8	8
10	10
22	10
10	10
10	10
16	8
8	8
180	20
42	16
16	8
28	14
16	8
22	10
32	12
8	8
22	14
16	8
192	16
12	8
8	8
12	8
8	8
12	8
22	14
12	12
38	14
12	12
8	8
10	10
10	10
8	8
438	26
16	8
38	14
40	12
20	8
44	12
10	10
190	18
34	18
20	12
8	8
12	12
22	10
12	12
202	18
22	10
36	12
8	8
28	12
52	16
30	10
8	8
30	10
8	8
8	8
8	8
44	12
8	8
22	14
8	8
18	10
10	10
12	8
206	18
10	10
20	12
26	10
16	8
8	8
38	10
208	18
12	8
12	12
8	8
28	12
8	8
144	24
20	8
8	8
20	8
46	14
26	10
28	12
16	8
8	8
42	14
8	8
20	8
8	8
20	12
16	8
12	8
18	10
8	8
240	20
266	22
30	14
8	8
44	12
196	16
22	10
16	8
18	10
16	8
16	8
14	10
28	12
48	12
8	8
8	8
19	7
16	8
22	10
8	8
18	10
26	10
12	8
8	8
12	8
8	8
14	10
12	8
26	10
26	10
16	8
8	8
26	10
10	10
10	10
8	8
16	12
24	12
18	10
26	10
16	8
8	8
16	8
18	10
8	8
8	8
30	10
20	8
38	10
22	10
18	10
19	7
8	8
19	7
8	8
18	10
240	20
8	8
26	10
8	8
12	12
18	10
20	12
12	8
8	8
18	10
8	8
26	10
26	10
344	24
26	10
8	8
12	8
8	8
18	10
16	8
19	7
8	8
38	10
196	20
36	12
12	8
36	12
22	14
8	8
196	16
8	8
8	8
14	10
8	8
8	8
18	10
30	14
20	8
10	10
10	10
10	10
19	7
8	8
12	12
10	10
20	12
10	10
20	8
22	10
10	10
22	10
22	10
176	16
19	7
16	8
8	8
16	8
8	8
490	26
22	10
16	8
8	8
28	12
28	10
8	8
16	8
22	14
14	10
38	10
19	7
12	8
12	8
28	12
36	12
8	8
20	12
8	8
22	14
28	12
16	8
8	8
26	10
22	14
26	10
12	8
22	10
8	8
12	8
8	8
8	8
10	10
18	10
148	16
18	10
22	10
12	12
20	8
22	14
8	8
18	10
8	8
16	8
248	20
10	10
20	8
10	10
28	12
18	10
10	10
16	8
234	26
12	12
8	8
32	12
22	10
35	11
32	12
16	8
8	8
14	10
40	12
16	8
186	18
10	10
26	10
12	8
10	10
172	16
26	10
8	8
36	12
8	8
38	10
24	12
8	8
8	8
18	10
14	8
8	8
384	24
30	10
30	14
16	8
16	8
24	12
22	10
10	10
168	16
8	8
19	7
18	10
224	16
8	8
200	20
36	12
16	8
12	8
8	8
16	8
22	10
22	10
8	8
24	12
20	12
10	10
22	10
218	18
18	10
20	8
20	12
28	10
44	12
128	16
24	12
10	10
36	12
8	8
30	10
16	8
16	10
22	10
18	10
22	14
20	12
8	8
14	10
20	8
24	12
12	12
19	7
18	10
28	10
22	10
30	10
38	10
8	8
22	10
8	8
20	12
12	8
38	10
8	8
44	12
28	12
168	16
26	10
10	10
28	10
8	8
22	10
12	8
8	8
10	10
30	10
8	8
18	10
12	8
12	8
16	8
20	8
20	8
18	10
10	10
14	8
46	14
22	14
8	8
8	8
30	12
20	8
10	10
19	7
8	8
8	8
12	12
16	8
20	8
8	8
10	10
19	7
8	8
8	8
20	12
20	8
12	8
18	10
170	18
12	8
8	8
43	11
30	10
16	8
22	10
8	8
8	8
44	12
16	8
112	16
8	8
16	16
8	8
12	12
156	16
18	10
8	8
10	10
20	12
22	10
12	8
14	10
32	12
16	8
20	8
26	10
22	14
196	16
19	7
20	8
8	8
10	10
20	12
8	8
16	8
8	8
22	10
20	8
22	10
20	8
22	14
32	12
14	8
400	24
20	8
18	10
26	10
22	10
20	8
20	8
20	8
26	14
10	10
16	10
8	8
24	12
24	12
16	10
18	10
12	12
22	10
172	16
38	10
8	8
20	12
18	10
16	8
8	8
18	10
19	7
19	7
20	8
26	10
8	8
14	10
30	14
8	8
19	7
8	8
12	8
8	8
494	34
24	12
10	10
20	8
12	12
8	8
10	10
36	12
30	10
10	10
8	8
8	8
38	10
8	8
8	8
10	10
8	8
8	8
38	10
8	8
10	10
18	10
26	10
20	8
20	8
40	12
8	8
22	10
18	10
16	8
16	8
20	8
22	14
246	22
14	10
18	10
26	10
26	10
26	10
19	7
18	10
16	8
19	7
10	10
8	8
8	8
38	10
10	10
10	10
18	10
18	10
19	7
36	12
16	8
14	10
14	8
26	10
8	8
14	10
22	10
18	10
8	8
220	20
28	12
8	8
228	24
8	8
19	7
10	10
18	10
12	8
8	8
8	8
10	10
22	10
16	8
8	8
8	8
22	10
10	10
8	8
14	10
20	12
18	10
8	8
28	10
28	10
8	8
16	8
43	11
19	7
38	10
12	8
8	8
22	10
214	18
19	7
8	8
18	10
10	10
224	24
18	10
20	12
18	10
8	8
22	10
22	10
14	10
19	7
178	18
20	8
8	8
16	8
32	12
38	14
14	10
18	10
8	8
18	10
20	8
8	8
12	12
10	10
8	8
18	10
16	8
26	10
30	10
168	24
19	7
22	10
8	8
8	8
20	8
22	10
20	8
10	10
202	18
8	8
8	8
8	8
20	8
8	8
26	12
10	10
8	8
16	8
20	12
16	8
18	10
8	8
24	16
44	12
18	10
10	10
28	12
12	8
12	12
10	10
20	12
30	10
38	10
176	16
8	8
8	8
10	10
16	8
28	12
8	8
20	12
20	12
188	16
8	8
8	8
8	8
20	12
10	10
10	10
8	8
12	8
204	20
8	8
30	14
43	11
32	12
18	10
8	8
10	10
12	12
180	20
252	18
26	10
18	10
8	8
44	12
24	12
10	10
10	10
52	16
10	10
12	12
8	8
19	7
8	8
8	8
16	8
16	8
16	8
20	8
38	14
8	8
20	8
28	12
22	10
16	8
8	8
26	10
20	12
22	10
194	18
192	16
8	8
20	12
178	18
10	10
26	10
14	10
20	8
12	12
16	8
16	8
28	12
14	14
20	8
19	7
22	10
28	12
8	8
28	16
8	8
22	10
10	10
8	8
22	10
38	10
14	14
19	7
22	10
8	8
16	8
18	10
36	12
19	7
16	8
22	10
10	10
184	20
176	16
8	8
38	10
172	20
8	8
182	18
19	7
8	8
16	8
24	12
8	8
8	8
10	10
12	8
20	12
12	8
10	10
36	12
20	12
16	8
20	12
8	8
8	8
8	8
8	8
8	8
36	12
128	16
16	8
12	8
16	8
22	10
44	12
8	8
18	10
24	12
30	14
19	7
8	8
10	10
10	10
14	8
30	10
12	8
8	8
20	8
30	10
8	8
18	10
14	10
20	12
8	8
18	10
44	12
206	18
168	16
20	12
20	8
36	12
22	10
8	8
46	14
12	8
346	26
10	10
8	8
8	8
22	10
8	8
22	10
26	10
18	10
30	14
8	8
10	10
8	8
8	8
10	10
206	22
54	16
57	13
16	8
12	8
8	8
32	16
18	10
42	14
8	8
10	10
8	8
12	12
22	10
12	8
8	8
16	8
16	8
16	8
24	12
36	12
8	8
38	10
20	12
8	8
188	20
10	10
8	8
8	8
38	10
26	10
176	16
8	8
22	10
12	8
16	8
8	8
18	10
20	8
8	8
8	8
12	8
12	8
20	12
20	12
8	8
18	10
40	12
232	20
8	8
20	8
22	10
12	8
10	10
10	10
20	12
19	7
30	10
8	8
26	10
10	10
10	10
18	10
8	8
8	8
10	10
16	8
194	18
20	12
122	18
32	16
14	8
14	10
22	10
10	10
16	8
16	8
43	11
26	10
8	8
8	8
36	12
10	10
30	10
12	8
38	10
28	10
22	10
22	10
22	10
22	14
18	10
28	10
16	8
338	24
8	8
20	12
54	12
24	12
20	8
43	11
30	10
19	7
14	8
12	8
8	8
12	12
36	12
22	10
19	7
8	8
22	10
18	10
18	10
14	10
8	8
8	8
18	10
22	10
20	12
8	8
20	12
20	8
8	8
18	10
44	12
43	11
22	14
18	10
24	12
8	8
30	10
48	12
20	12
8	8
36	12
10	10
36	12
8	8
24	12
19	7
16	8
8	8
14	10
16	8
8	8
10	10
20	8
8	8
8	8
19	7
12	8
10	10
18	10
16	8
186	18
22	10
22	10
44	12
12	8
8	8
8	8
20	8
210	18
10	10
20	12
24	12
26	10
8	8
8	8
10	10
30	14
22	10
8	8
22	14
16	8
10	10
18	10
20	12
19	7
30	10
10	10
30	10
16	8
19	7
38	10
28	12
8	8
28	12
12	12
18	10
8	8
28	12
46	14
16	8
12	8
18	10
8	8
12	8
36	12
30	10
18	10
19	7
10	10
12	8
22	10
16	8
8	8
16	8
8	8
138	22
8	8
38	10
8	8
10	10
18	10
12	8
18	10
8	8
38	10
8	8
20	8
16	8
48	12
12	8
10	10
14	14
22	10
38	10
30	10
16	8
14	10
8	8
22	14
26	10
10	10
20	8
212	20
82	18
222	22
32	12
26	10
28	10
30	10
8	8
8	8
16	8
22	10
20	8
190	18
32	12
28	12
200	16
8	8
18	10
19	7
10	10
8	8
8	8
8	8
198	22
18	10
10	10
228	18
38	10
18	10
36	12
26	10
38	10
184	16
10	10
210	18
8	8
10	10
14	10
8	8
16	8
196	16
10	10
10	10
8	8
28	12
12	12
20	8
20	12
12	8
12	12
10	10
10	10
38	10
8	8
44	12
10	10
8	8
20	12
19	7
8	8
30	10
8	8
16	8
8	8
12	8
10	10
19	7
30	10
8	8
10	10
8	8
8	8
204	16
16	8
26	10
35	11
26	14
176	16
28	10
26	10
30	10
8	8
18	10
46	14
12	8
8	8
18	10
8	8
12	12
20	12
20	8
26	10
174	22
20	8
18	10
10	10
22	10
16	8
10	10
20	12
20	8
22	10
20	12
38	14
36	12
8	8
10	10
22	10
24	12
10	10
8	8
20	12
8	8
28	10
8	8
168	16
10	10
8	8
22	10
18	10
18	10
10	10
20	8
12	12
18	10
20	12
8	8
20	8
8	8
220	20
8	8
20	8
24	12
196	16
8	8
22	10
10	10
8	8
18	10
8	8
20	8
222	22
8	8
46	16
18	10
18	10
38	10
36	12
20	8
16	8
8	8
8	8
19	7
8	8
44	16
8	8
42	14
18	10
12	8
20	12
8	8
8	8
8	8
8	8
22	10
258	24
20	8
18	10
10	10
8	8
22	10
28	12
28	12
16	8
8	8
32	12
12	8
10	10
26	14
22	10
14	10
8	8
30	10
12	8
20	8
8	8
8	8
16	8
30	10
12	8
8	8
18	10
56	16
12	8
58	14
8	8
22	10
28	12
8	8
14	14
16	8
8	8
18	10
8	8
16	8
12	8
282	26
16	8
10	10
19	7
8	8
44	12
10	10
10	10
216	20
8	8
8	8
8	8
40	12
10	10
58	14
22	10
22	10
12	8
36	12
28	10
19	7
18	10
18	10
18	10
16	8
18	10
12	8
26	10
220	20
168	16
20	8
12	8
190	18
8	8
43	11
22	10
26	10
26	10
36	12
10	10
254	26
18	10
22	10
20	12
10	10
20	12
18	10
20	8
8	8
10	10
30	12
10	10
196	16
38	10
12	8
20	12
18	10
36	12
68	16
10	10
8	8
10	10
12	8
30	10
26	10
8	8
26	10
198	18
8	8
22	10
38	10
18	10
12	8
16	8
26	10
28	12
16	8
10	10
14	8
118	16
180	16
38	10
20	8
10	10
16	8
12	8
8	8
16	8
8	8
8	8
12	8
8	8
8	8
8	8
12	8
38	10
10	10
8	8
12	12
18	10
168	16
10	10
18	10
20	8
18	10
16	8
8	8
8	8
128	16
18	10
8	8
8	8
20	8
12	8
30	10
16	8
38	10
38	10
10	10
16	8
12	12
12	8
18	10
10	10
32	12
10	10
20	8
8	8
214	22
14	10
18	10
26	10
20	12
12	12
26	10
218	18
20	8
20	8
14	10
19	7
10	10
20	12
8	8
18	10
202	18
20	12
20	8
10	10
24	12
12	12
42	14
20	8
19	7
286	22
10	10
30	10
16	8
20	12
10	10
12	12
12	8
14	10
20	12
16	8
16	8
8	8
8	8
40	12
12	8
8	8
26	10
8	8
10	10
16	8
16	8
20	8
36	12
8	8
26	10
24	16
38	10
20	12
12	8
19	7
16	8
16	8
10	10
16	8
18	10
10	10
24	12
22	10
12	8
30	10
8	8
8	8
8	8
19	7
16	8
18	10
8	8
20	8
8	8
8	8
19	7
194	18
12	8
10	10
256	20
10	10
8	8
18	10
8	8
18	10
18	10
30	10
19	7
8	8
8	8
132	16
8	8
8	8
18	10
176	16
8	8
182	18
14	10
8	8
644	32
30	10
16	8
20	8
38	10
16	8
18	10
8	8
18	10
16	8
20	8
18	10
8	8
10	10
10	10
18	10
16	8
30	10
20	8
12	12
8	8
16	8
16	8
22	10
12	12
228	18
8	8
18	10
30	10
16	8
8	8
22	14
20	8
14	14
8	8
20	8
22	10
20	8
20	8
38	10
112	16
12	12
18	10
26	10
8	8
10	10
46	14
8	8
8	8
192	16
16	8
254	22
10	10
8	8
38	10
8	8
42	12
20	12
8	8
46	14
8	8
8	8
40	12
196	16
8	8
30	10
50	14
8	8
19	7
26	10
18	10
18	10
8	8
8	8
210	18
198	22
16	8
8	8
20	8
36	12
32	12
28	10
8	8
14	10
12	12
340	28
8	8
10	10
16	8
32	12
16	8
12	8
18	10
18	10
20	8
22	10
30	10
18	10
8	8
8	8
44	12
12	8
18	10
16	8
32	12
8	8
20	8
20	12
20	12
8	8
22	14
19	7
12	12
16	8
8	8
8	8
36	12
14	8
28	12
16	8
12	8
8	8
14	10
12	12
240	24
266	22
22	10
46	14
206	22
32	12
28	12
186	18
28	12
12	8
28	12
22	10
16	8
8	8
16	8
36	12
18	10
38	10
8	8
16	8
26	10
14	10
8	8
14	14
8	8
8	8
20	12
18	10
26	10
18	10
14	10
12	8
28	12
16	8
10	10
18	10
8	8
8	8
18	10
8	8
22	10
242	26
10	10
10	10
28	12
22	10
20	8
12	12
14	14
10	10
14	10
18	10
18	10
8	8
8	8
22	10
8	8
38	12
14	10
8	8
8	8
12	8
8	8
114	18
10	10
180	20
36	12
10	10
18	10
16	8
8	8
26	10
18	10
8	8
8	8
19	7
20	8
20	12
16	8
8	8
24	12
18	10
22	14
28	12
18	10
8	8
8	8
8	8
12	12
16	8
10	10
19	7
18	10
20	12
12	8
22	10
8	8
16	8
210	18
254	24
8	8
30	10
8	8
8	8
8	8
20	12
22	10
26	10
10	10
18	10
18	10
8	8
178	18
28	10
8	8
12	8
28	10
10	10
8	8
30	10
8	8
26	10
20	8
26	10
14	8
8	8
8	8
16	8
8	8
8	8
30	10
314	22
32	12
14	10
184	16
38	14
18	10
8	8
40	16
22	14
16	8
10	10
38	12
12	8
20	12
16	8
8	8
198	22
16	8
20	8
16	8
24	12
30	10
20	8
30	10
20	8
8	8
10	10
30	10
30	10
16	8
18	10
40	12
8	8
20	8
30	10
54	12
38	10
12	12
18	10
26	10
18	10
20	8
16	8
10	10
44	12
8	8
20	8
14	14
20	8
26	10
18	10
18	10
20	8
10	10
12	12
18	10
10	10
19	7
18	10
220	20
8	8
19	7
44	12
28	12
22	10
22	10
22	10
22	14
12	12
26	14
10	10
12	12
8	8
196	20
8	8
22	10
16	8
20	8
76	16
18	10
10	10
10	10
20	8
176	16
22	10
26	10
32	12
22	10
18	10
18	10
32	12
8	8
382	30
14	10
44	12
8	8
22	14
18	10
40	12
20	12
16	8
16	8
28	12
18	10
48	16
10	10
18	10
40	12
14	10
28	12
20	8
26	10
12	8
10	10
20	8
8	8
12	8
16	8
10	10
18	10
8	8
10	10
14	10
152	16
8	8
10	10
10	10
26	10
202	22
22	10
216	20
8	8
230	18
22	10
50	14
122	18
8	8
10	10
22	10
10	10
10	10
18	10
8	8
22	10
10	10
28	12
8	8
8	8
8	8
20	8
12	12
16	8
10	10
40	16
16	8
20	8
18	10
8	8
22	10
22	10
16	12
34	14
8	8
8	8
18	10
10	10
8	8
22	10
8	8
16	8
20	12
8	8
19	7
8	8
8	8
8	8
22	10
12	12
8	8
14	10
8	8
16	8
182	18
36	12
20	12
10	10
22	10
8	8
12	8
38	10
22	10
12	12
18	10
18	10
8	8
8	8
10	10
12	12
10	10
22	10
16	8
168	16
14	10
30	14
38	14
20	8
16	8
8	8
26	10
8	8
16	10
10	10
156	20
246	18
8	8
16	8
8	8
14	10
16	8
10	10
20	8
10	10
8	8
36	12
18	10
16	8
18	10
12	8
220	20
8	8
10	10
8	8
186	20
36	12
19	7
8	8
34	14
8	8
20	8
58	14
8	8
210	18
26	10
10	10
18	10
22	14
20	12
14	8
8	8
234	22
12	8
18	10
16	8
32	12
28	12
18	10
10	10
14	10
8	8
20	8
16	8
16	8
8	8
8	8
26	10
19	7
8	8
44	12
22	10
20	8
18	10
20	12
14	10
20	12
26	10
16	8
214	18
8	8
22	10
8	8
12	8
16	8
8	8
10	10
10	10
18	10
10	10
18	10
28	10
10	10
30	10
10	10
12	8
10	10
30	10
8	8
16	8
10	10
22	10
43	11
18	10
10	10
18	10
14	10
8	8
168	16
40	12
20	8
8	8
10	10
18	10
12	8
14	10
26	10
18	10
8	8
16	8
10	10
8	8
38	10
360	28
18	10
18	10
46	14
10	10
8	8
18	10
8	8
16	8
19	7
36	12
18	10
226	22
28	12
18	10
12	8
20	12
46	14
18	10
22	10
30	10
40	12
22	10
10	10
16	8
8	8
20	8
200	16
8	8
20	8
10	10
30	10
208	24
20	12
18	10
8	8
18	10
196	20
22	10
40	12
28	10
20	8
10	10
18	10
10	10
8	8
26	10
8	8
8	8
20	8
22	10
152	16
8	8
26	10
10	10
38	10
14	10
44	12
20	8
30	10
14	10
19	7
62	18
10	10
10	10
28	12
22	10
10	10
16	8
30	10
19	7
18	10
112	16
8	8
22	10
14	10
28	12
16	8
19	7
30	10
16	8
16	8
16	8
36	12
12	8
12	12
8	8
8	8
16	8
22	10
20	12
16	8
12	8
14	10
10	10
38	10
10	10
16	8
20	12
8	8
22	14
22	10
22	10
14	10
8	8
20	8
8	8
20	12
8	8
32	12
8	8
24	16
38	10
30	14
18	10
24	12
46	14
16	8
184	16
8	8
12	8
18	10
8	8
10	10
8	8
8	8
10	10
8	8
20	12
12	8
10	10
28	10
28	12
8	8
22	10
22	10
16	12
36	12
30	10
22	10
22	10
8	8
19	7
26	10
8	8
18	10
18	10
8	8
18	10
8	8
10	10
8	8
28	10
16	8
18	10
8	8
170	18
43	11
230	22
16	8
20	12
38	10
22	10
8	8
16	8
8	8
8	8
8	8
14	14
22	10
10	10
8	8
26	10
208	20
32	12
12	8
20	12
18	10
16	8
22	10
10	10
44	12
10	10
22	10
26	10
18	10
18	10
8	8
8	8
8	8
12	8
40	12
18	10
10	10
20	12
8	8
312	26
230	18
12	8
192	20
176	16
20	8
20	8
8	8
12	12
26	10
16	8
20	8
20	12
19	7
20	12
20	12
18	10
18	10
20	8
16	8
20	8
16	8
30	10
19	7
36	12
12	8
16	8
176	16
20	12
8	8
18	10
8	8
38	14
8	8
44	12
19	7
120	16
8	8
216	18
26	10
8	8
22	10
16	8
26	10
16	8
16	8
30	10
22	10
10	10
16	8
12	8
18	10
22	10
12	8
8	8
10	10
38	10
20	8
10	10
22	10
16	8
8	8
8	8
19	7
12	8
220	20
8	8
22	10
28	10
32	12
226	22
22	10
16	8
16	8
20	12
19	7
128	16
26	10
180	16
26	10
18	10
8	8
16	8
30	10
8	8
16	8
22	10
12	8
12	8
12	8
19	7
20	8
30	10
8	8
8	8
8	8
36	12
16	8
46	14
8	8
22	10
14	10
8	8
32	12
26	10
8	8
20	12
18	10
8	8
16	8
22	10
18	10
26	10
10	10
16	8
12	8
38	14
30	10
172	16
10	10
26	10
19	7
22	10
20	8
16	8
20	12
19	7
22	10
8	8
26	10
16	8
8	8
8	8
8	8
8	8
10	10
16	8
43	11
20	8
20	12
8	8
19	7
18	10
20	12
8	8
8	8
20	12
16	8
12	8
30	10
8	8
8	8
48	12
36	12
18	10
12	8
16	8
12	12
19	7
348	24
28	12
26	10
18	10
18	10
8	8
12	8
14	10
30	10
26	10
14	10
212	20
20	8
19	7
178	18
12	8
10	10
26	10
8	8
16	8
26	10
12	8
176	16
18	10
8	8
28	12
10	10
8	8
22	10
8	8
10	10
22	10
20	8
20	12
14	14
43	11
20	8
26	10
10	10
22	10
10	10
20	8
18	10
20	8
16	8
8	8
28	12
20	12
224	20
10	10
19	7
10	10
30	10
22	10
8	8
10	10
28	12
18	10
16	8
186	18
18	10
16	8
22	14
20	8
12	12
8	8
216	20
10	10
10	10
12	8
130	18
42	14
194	18
38	10
196	16
16	8
12	12
8	8
8	8
8	8
26	10
22	14
22	10
22	10
28	12
8	8
12	8
10	10
282	22
16	8
16	8
12	12
8	8
16	8
250	22
40	12
10	10
170	18
16	8
20	12
8	8
10	10
22	14
18	12
19	7
16	8
28	12
20	8
8	8
10	10
12	8
8	8
8	8
16	8
8	8
18	10
208	20
14	10
8	8
8	8
19	7
20	8
8	8
26	10
19	7
10	10
44	12
8	8
8	8
20	8
26	10
8	8
28	12
30	10
40	12
20	8
8	8
10	10
8	8
22	10
38	14
18	10
240	18
26	10
38	10
16	10
22	10
8	8
20	8
10	10
26	10
10	10
10	10
8	8
38	10
20	8
8	8
8	8
10	10
16	8
10	10
8	8
56	16
12	8
8	8
12	8
12	8
20	12
12	8
16	8
8	8
20	12
8	8
10	10
16	8
20	12
32	12
26	10
16	8
16	12
18	10
20	8
18	10
20	8
16	8
10	10
20	8
19	7
10	10
26	10
22	14
8	8
30	10
8	8
16	8
22	14
26	10
43	11
26	10
214	18
12	8
168	16
19	7
20	12
16	8
8	8
16	8
26	10
18	10
12	8
8	8
32	12
18	10
16	8
18	10
14	14
22	10
152	16
38	10
200	18
16	8
14	10
8	8
272	24
10	10
304	24
38	10
26	10
18	10
22	14
28	12
16	8
234	22
10	10
19	7
8	8
8	8
35	11
8	8
18	10
18	10
28	10
8	8
30	10
18	10
12	8
12	8
22	10
20	12
19	7
46	14
62	14
20	8
12	12
58	14
12	12
10	10
20	8
186	18
8	8
10	10
8	8
8	8
8	8
38	10
16	8
30	10
26	10
8	8
44	12
36	12
22	14
12	8
8	8
10	10
22	10
12	8
30	10
8	8
12	8
18	10
8	8
18	10
10	10
24	12
20	8
40	16
8	8
10	10
16	12
8	8
18	10
26	10
8	8
122	18
225	17
178	18
8	8
28	10
38	10
10	10
38	10
12	12
8	8
28	12
12	8
18	10
278	22
20	8
16	8
10	10
120	16
8	8
10	10
22	14
8	8
8	8
8	8
18	10
8	8
32	12
10	10
16	8
16	8
18	10
80	20
20	12
10	10
18	10
20	8
12	8
26	10
12	8
18	10
22	10
22	10
14	10
14	10
26	10
12	8
196	20
16	8
8	8
52	16
38	10
16	8
16	8
38	10
35	11
278	22
16	8
8	8
38	10
16	8
8	8
26	10
12	8
18	10
19	7
8	8
16	8
22	14
176	16
180	16
342	26
10	10
20	8
10	10
30	10
200	20
10	10
26	10
20	8
20	12
30	14
40	12
20	12
8	8
19	7
128	16
10	10
12	8
212	20
8	8
30	10
16	8
18	10
10	10
184	16
10	10
22	10
28	12
18	10
228	20
14	14
20	8
10	10
35	11
8	8
20	8
38	14
16	8
8	8
266	24
18	10
20	8
32	12
36	12
26	10
16	8
12	8
18	10
12	8
12	8
16	8
22	10
28	10
20	12
8	8
16	8
146	16
20	8
34	14
18	10
12	12
19	7
8	8
24	12
8	8
16	8
16	8
18	10
44	12
43	11
26	10
20	12
22	10
12	8
12	8
22	10
16	10
16	8
152	16
16	8
22	10
38	14
18	10
14	10
20	12
22	10
22	10
8	8
10	10
16	8
22	10
8	8
10	10
36	16
18	10
10	10
16	12
22	10
20	12
32	12
8	8
26	10
8	8
8	8
122	18
14	14
18	10
12	8
44	12
22	10
26	10
16	8
26	10
176	16
8	8
22	10
240	20
16	8
20	12
18	10
14	10
16	8
16	8
8	8
8	8
18	10
28	10
8	8
28	16
20	12
16	8
8	8
19	7
18	10
16	10
150	18
28	12
8	8
20	12
28	12
26	14
16	8
20	12
26	10
20	12
22	10
10	10
10	10
10	10
8	8
8	8
130	18
10	10
14	10
8	8
40	12
14	10
16	8
30	14
14	8
186	18
18	10
10	10
20	8
26	10
18	10
8	8
16	8
18	10
8	8
12	8
30	14
20	12
8	8
38	10
22	14
20	8
16	8
10	10
12	8
10	10
10	10
18	10
16	8
196	16
8	8
26	10
14	10
22	10
8	8
10	10
22	10
20	12
22	14
10	10
32	12
18	10
8	8
18	10
18	10
14	10
36	12
16	8
10	10
36	12
40	12
18	10
14	10
16	8
18	10
20	8
20	12
8	8
26	10
28	12
18	10
20	8
20	8
16	8
8	8
8	8
8	8
20	8
10	10
30	14
12	8
20	12
18	10
170	18
8	8
30	10
12	8
22	10
16	8
8	8
36	12
8	8
14	10
12	12
16	8
8	8
30	10
10	10
16	8
12	8
20	8
8	8
8	8
30	10
64	16
8	8
20	12
8	8
22	14
8	8
24	12
8	8
10	10
22	10
14	10
614	38
28	12
26	10
10	10
22	10
16	8
10	10
19	7
8	8
36	12
8	8
10	10
18	10
18	10
8	8
16	8
32	12
116	16
22	10
26	10
26	10
8	8
18	10
12	8
19	7
19	7
12	8
16	8
240	22
8	8
8	8
19	7
10	10
16	8
10	10
10	10
18	10
8	8
18	10
8	8
18	10
16	8
22	14
34	14
20	8
309	22
176	16
26	10
36	12
36	12
20	12
8	8
12	8
8	8
222	18
16	8
20	12
22	10
16	8
12	8
10	10
20	8
216	20
12	8
180	20
16	8
8	8
18	10
8	8
20	8
26	10
8	8
12	12
30	10
8	8
20	12
28	12
20	8
16	8
24	12
18	10
28	10
8	8
8	8
16	8
16	8
30	10
12	8
464	36
220	20
274	22
30	10
19	7
22	10
8	8
8	8
8	8
12	8
8	8
14	10
19	7
180	16
12	8
8	8
40	12
18	10
12	8
35	11
10	10
16	8
12	8
8	8
10	10
20	8
12	8
26	10
8	8
14	10
12	12
8	8
8	8
10	10
8	8
176	16
186	18
8	8
18	10
16	8
18	10
10	10
20	8
36	12
26	10
8	8
18	10
22	10
8	8
38	10
8	8
20	12
8	8
8	8
26	10
14	10
16	8
36	12
8	8
22	10
10	10
20	12
178	18
18	10
8	8
8	8
36	12
8	8
20	8
22	10
8	8
28	12
14	10
10	10
26	10
20	8
18	10
128	16
46	12
19	7
20	8
36	12
36	12
8	8
35	11
18	10
10	10
8	8
8	8
10	10
10	10
10	10
18	10
22	10
30	10
26	10
19	7
18	10
50	14
194	18
18	10
200	16
16	8
8	8
20	12
30	10
14	10
10	10
12	8
30	10
8	8
12	8
18	10
12	8
10	10
12	8
26	10
26	10
282	26
22	10
366	24
10	10
12	12
16	8
8	8
10	10
22	10
8	8
18	10
20	12
10	10
12	12
22	10
12	8
32	12
54	12
58	14
22	10
48	12
18	10
10	10
16	8
14	10
18	10
28	12
22	10
16	8
30	10
43	11
22	14
10	10
18	10
22	14
176	16
12	8
8	8
26	10
14	10
18	10
16	8
18	10
8	8
22	10
10	10
10	10
28	12
32	12
10	10
18	10
22	10
8	8
20	8
22	10
208	18
10	10
22	10
43	11
374	30
10	10
28	12
12	8
18	10
16	8
12	8
8	8
36	12
8	8
12	8
18	10
26	10
22	14
20	8
16	8
10	10
8	8
22	10
20	12
12	8
20	12
112	16
20	8
10	10
16	8
20	8
26	10
16	8
20	12
46	14
196	20
18	10
18	10
18	10
10	10
18	10
186	18
222	18
8	8
38	14
12	8
12	8
20	8
8	8
19	7
20	12
8	8
20	8
16	8
26	10
8	8
18	10
19	7
22	10
18	10
264	24
14	10
8	8
466	34
22	10
10	10
22	14
16	8
8	8
22	14
16	8
18	10
40	12
30	10
22	14
22	10
8	8
18	10
12	12
18	10
48	12
18	10
22	10
26	10
10	10
30	10
14	14
16	8
12	8
14	10
20	12
26	10
8	8
14	10
210	18
12	8
10	10
186	18
38	10
10	10
8	8
10	10
14	10
22	10
18	10
20	8
10	10
20	8
218	16
8	8
20	12
8	8
10	10
42	14
38	10
8	8
14	10
20	8
26	10
18	10
20	8
18	10
282	26
12	12
8	8
18	10
8	8
16	10
10	10
8	8
14	10
8	8
16	8
18	10
8	8
22	10
22	10
32	12
10	10
26	10
18	10
174	22
30	10
18	10
12	8
8	8
8	8
12	8
8	8
8	8
20	12
16	8
12	8
20	8
8	8
16	8
10	10
32	12
28	12
20	8
48	16
10	10
234	22
8	8
10	10
20	8
40	12
8	8
8	8
16	8
18	10
18	10
10	10
8	8
186	18
12	8
8	8
224	20
8	8
16	8
26	10
12	8
16	8
48	12
22	10
8	8
32	12
24	12
16	8
18	10
10	10
36	12
16	8
12	8
12	8
16	8
26	10
20	12
18	10
8	8
20	8
22	10
24	12
10	10
20	8
10	10
28	12
20	8
26	10
12	8
186	18
18	10
8	8
8	8
42	14
8	8
182	18
8	8
26	10
22	14
26	10
30	10
22	10
19	7
220	20
16	8
38	10
10	10
8	8
18	10
10	10
18	10
10	10
8	8
8	8
22	10
24	12
20	12
8	8
22	10
12	8
22	10
18	10
22	14
16	8
20	8
20	12
8	8
12	8
10	10
12	12
20	8
19	7
18	10
26	10
8	8
288	22
168	16
16	8
8	8
16	8
8	8
20	8
20	8
16	8
22	14
20	8
19	7
20	12
8	8
22	10
22	10
8	8
28	12
20	8
8	8
38	10
20	8
22	10
8	8
36	12
32	12
18	10
112	16
26	10
8	8
48	12
10	10
30	10
28	16
8	8
20	12
188	16
26	10
18	10
19	7
10	10
46	14
28	12
12	8
26	10
30	10
12	8
18	10
43	11
10	10
12	12
8	8
16	8
20	8
8	8
16	8
22	10
138	18
30	10
8	8
22	10
18	10
19	7
18	10
8	8
8	8
26	10
20	8
18	10
26	10
8	8
22	10
10	10
20	8
10	10
10	10
20	12
18	10
8	8
16	8
168	16
28	12
44	12
20	12
10	10
16	8
44	12
18	10
10	10
16	8
22	10
8	8
26	10
54	12
36	12
20	8
18	10
170	18
14	14
24	12
10	10
8	8
8	8
10	10
8	8
44	12
176	16
8	8
10	10
40	12
16	8
16	8
8	8
10	10
20	12
19	7
30	10
22	14
12	12
8	8
188	16
40	12
258	22
24	12
20	8
10	10
38	10
10	10
8	8
38	10
8	8
16	8
20	8
10	10
19	7
8	8
42	14
10	10
12	12
20	12
12	8
8	8
8	8
8	8
18	10
20	12
220	18
124	20
8	8
10	10
36	12
20	12
18	10
18	10
16	8
8	8
24	12
16	8
18	10
168	16
20	8
12	12
16	8
184	16
20	12
43	11
24	16
16	8
10	10
12	8
16	8
16	8
10	10
16	8
10	10
8	8
8	8
22	10
40	12
8	8
26	10
16	8
30	10
192	16
22	10
22	10
32	12
16	8
38	10
8	8
18	10
20	12
8	8
8	8
12	8
8	8
20	12
40	16
8	8
22	10
10	10
18	10
8	8
20	8
19	7
188	20
18	10
8	8
466	26
19	7
22	10
20	8
112	16
32	12
26	12
12	8
8	8
14	10
10	10
16	8
26	10
10	10
16	8
8	8
12	8
10	10
8	8
8	8
26	10
8	8
10	10
22	14
22	10
22	10
8	8
10	10
14	10
198	20
20	8
22	10
20	8
30	10
20	12
8	8
8	8
18	10
8	8
8	8
20	12
8	8
30	10
20	8
168	16
38	10
30	10
8	8
196	16
20	8
12	8
22	10
12	8
12	12
26	10
12	8
10	10
20	12
22	10
8	8
10	10
16	8
20	8
38	10
12	8
16	8
8	8
8	8
18	10
16	8
10	10
24	16
10	10
34	14
18	10
16	8
186	18
38	10
8	8
10	10
20	12
38	10
8	8
18	10
8	8
8	8
222	22
10	10
26	12
8	8
30	10
8	8
30	10
8	8
10	10
214	22
24	12
16	8
230	18
26	10
18	10
12	8
16	8
12	12
43	11
8	8
16	8
22	14
20	12
24	12
10	10
22	10
30	12
44	12
35	11
12	12
8	8
32	12
18	10
8	8
26	10
8	8
12	8
22	10
22	14
8	8
22	10
19	7
36	12
22	10
20	8
8	8
8	8
224	20
20	12
22	10
12	8
8	8
262	22
38	14
24	12
18	10
10	10
12	8
12	8
28	12
12	12
38	14
18	10
20	12
16	8
12	8
8	8
8	8
20	8
200	16
130	18
24	12
8	8
20	12
204	16
8	8
12	8
38	10
8	8
26	10
12	12
38	10
8	8
176	16
22	10
192	16
8	8
18	10
10	10
18	10
20	8
12	12
16	8
8	8
176	16
8	8
20	12
8	8
16	8
12	8
10	10
112	16
20	8
8	8
8	8
20	12
20	12
8	8
30	14
8	8
20	8
170	18
30	10
20	12
12	8
16	8
22	10
20	12
22	14
232	20
19	7
10	10
18	10
36	12
10	10
10	10
8	8
18	10
18	10
10	10
58	14
10	10
8	8
40	12
14	10
8	8
248	20
18	10
12	8
20	12
8	8
16	8
10	10
12	8
19	7
178	18
8	8
8	8
22	10
8	8
10	10
8	8
10	10
22	10
16	8
8	8
20	12
22	10
20	12
22	10
16	8
182	18
10	10
58	14
18	10
10	10
14	10
20	12
38	14
8	8
12	12
12	8
44	12
14	14
18	10
20	12
20	12
176	16
14	10
164	20
19	7
8	8
8	8
20	8
12	8
24	12
224	20
20	8
22	10
216	20
20	12
8	8
8	8
8	8
8	8
168	16
18	10
176	16
16	8
20	8
16	8
202	18
20	8
14	10
8	8
14	10
20	8
38	10
8	8
12	8
38	10
8	8
14	14
20	8
22	10
10	10
36	12
32	12
238	18
20	12
16	8
18	10
8	8
236	20
28	10
28	12
8	8
196	16
26	10
16	12
20	8
22	10
10	10
178	18
8	8
24	12
20	8
10	10
20	8
12	8
8	8
10	10
8	8
12	8
8	8
8	8
20	12
22	10
14	10
18	10
8	8
12	8
8	8
8	8
18	10
28	12
750	46
16	8
18	10
16	8
12	8
12	12
44	12
32	12
30	10
8	8
18	10
176	16
20	12
176	16
44	12
8	8
38	10
16	8
26	10
48	16
12	8
16	8
19	7
38	10
40	12
8	8
38	10
272	24
8	8
112	16
16	8
20	8
38	10
18	10
16	8
22	10
26	10
14	10
18	10
202	18
18	10
14	10
8	8
196	16
10	10
22	10
22	10
16	8
8	8
18	10
8	8
36	12
8	8
16	8
18	10
46	14
42	14
20	12
12	8
32	12
14	14
8	8
12	8
19	7
8	8
8	8
40	12
24	12
20	12
18	10
20	8
8	8
8	8
28	14
10	10
8	8
8	8
8	8
20	8
40	12
20	8
12	8
8	8
16	12
10	10
30	10
28	12
22	10
14	10
32	12
18	10
20	8
18	10
264	24
10	10
22	14
12	8
8	8
20	8
400	32
24	12
28	12
12	8
26	14
8	8
26	10
20	12
26	14
8	8
20	8
14	10
12	8
8	8
26	10
10	10
26	10
30	14
8	8
202	18
8	8
16	8
14	10
12	12
12	8
20	8
18	10
12	8
12	8
26	10
18	10
8	8
12	8
32	12
10	10
12	8
28	12
20	8
26	10
10	10
16	8
178	18
12	8
38	14
346	26
16	8
16	8
30	10
8	8
10	10
26	14
12	8
32	16
366	26
12	12
8	8
38	10
180	16
10	10
172	20
10	10
20	12
8	8
8	8
18	10
18	10
242	22
26	10
12	12
10	10
16	8
16	12
28	12
8	8
16	8
20	12
184	16
12	8
19	7
20	12
28	12
8	8
8	8
8	8
12	8
36	12
12	8
38	10
8	8
20	8
22	14
38	14
8	8
8	8
8	8
8	8
22	10
8	8
18	10
30	10
16	8
8	8
10	10
30	10
10	10
20	12
10	10
8	8
30	14
8	8
20	12
8	8
10	10
8	8
8	8
12	12
18	10
20	12
22	14
14	8
30	10
20	8
8	8
233	17
18	10
8	8
26	10
20	12
20	8
10	10
8	8
20	8
8	8
38	10
20	8
20	12
12	8
12	8
8	8
16	8
12	8
18	10
20	12
16	8
22	14
24	12
16	8
8	8
10	10
8	8
16	8
8	8
26	10
19	7
12	12
18	10
8	8
8	8
16	8
19	7
8	8
46	14
26	10
12	8
10	10
8	8
18	10
18	10
20	8
48	12
20	12
22	10
38	10
19	7
26	10
16	8
8	8
20	12
168	16
30	10
8	8
18	10
20	8
20	12
16	8
8	8
30	10
22	10
10	10
10	10
10	10
8	8
19	7
12	12
18	10
16	8
24	12
18	10
16	8
14	10
8	8
18	10
46	12
42	14
8	8
30	14
36	12
26	10
8	8
12	12
10	10
8	8
20	12
26	10
18	10
18	10
20	8
18	10
8	8
116	16
12	8
16	8
8	8
20	8
18	10
20	12
8	8
170	18
16	8
22	10
8	8
26	10
8	8
22	14
8	8
20	12
22	10
16	8
18	10
12	8
16	8
194	18
8	8
16	8
26	10
232	20
20	12
12	12
218	18
19	7
8	8
22	10
16	8
20	8
8	8
16	8
8	8
18	10
8	8
144	20
128	16
10	10
16	8
28	12
18	10
10	10
44	12
8	8
14	10
8	8
18	10
8	8
8	8
168	16
10	10
19	7
10	10
32	12
14	8
8	8
16	12
10	10
38	10
10	10
38	10
16	8
10	10
8	8
8	8
12	8
8	8
8	8
18	10
182	18
22	14
20	8
20	8
44	12
16	8
8	8
36	12
16	8
19	7
14	10
19	7
16	8
8	8
8	8
12	8
230	18
8	8
8	8
12	8
28	12
12	8
200	20
8	8
22	10
8	8
30	10
8	8
16	8
18	10
8	8
28	12
20	8
30	10
12	8
8	8
32	12
26	10
264	24
16	8
43	11
8	8
18	10
8	8
8	8
12	8
18	10
266	22
16	8
10	10
24	16
26	10
12	12
30	10
28	12
12	8
22	10
130	18
43	11
22	10
14	10
20	8
10	10
20	8
20	8
8	8
36	12
20	8
16	8
32	12
20	12
20	8
30	10
8	8
34	14
8	8
8	8
8	8
10	10
8	8
216	24
18	10
18	10
22	14
16	8
20	8
384	24
26	10
8	8
30	10
18	10
350	24
10	10
50	14
18	10
8	8
10	10
30	10
188	20
18	10
18	10
18	10
214	18
30	10
10	10
20	8
18	10
14	10
20	12
8	8
10	10
10	10
26	10
8	8
30	10
28	12
20	8
12	8
8	8
20	8
12	12
24	12
152	16
36	12
196	16
10	10
32	12
18	10
36	12
30	10
18	10
38	10
10	10
20	8
12	8
16	12
12	12
16	8
22	10
10	10
10	10
16	8
16	8
10	10
8	8
35	11
8	8
10	10
8	8
10	10
54	12
22	10
176	16
28	12
182	18
16	8
10	10
46	14
44	12
18	10
8	8
10	10
8	8
18	10
10	10
24	12
40	12
8	8
8	8
24	12
22	10
8	8
42	14
12	8
18	10
28	10
16	8
200	16
18	10
18	10
8	8
8	8
16	8
18	10
30	14
18	10
8	8
10	10
128	16
14	14
168	16
8	8
10	10
20	8
18	10
16	8
18	10
19	7
24	12
22	10
12	8
26	10
30	10
14	10
38	12
12	12
8	8
30	10
20	8
36	12
16	8
202	18
18	10
30	10
16	8
22	10
8	8
8	8
18	10
8	8
12	8
10	10
14	10
142	16
22	14
20	8
28	12
278	22
10	10
30	10
22	10
20	12
28	12
10	10
192	16
8	8
38	10
216	20
18	10
8	8
22	10
20	8
12	12
28	12
8	8
16	8
16	8
12	8
22	10
48	16
10	10
16	8
22	10
26	10
22	10
8	8
8	8
202	18
40	12
8	8
176	16
30	10
10	10
19	7
20	12
16	8
10	10
10	10
186	18
8	8
12	8
12	8
8	8
36	12
174	18
19	7
30	10
43	11
18	10
22	10
28	10
26	10
18	10
28	12
18	10
14	10
22	10
8	8
22	10
32	12
18	10
19	7
14	10
8	8
16	8
8	8
8	8
10	10
8	8
10	10
38	10
26	10
26	10
16	8
8	8
12	8
10	10
8	8
30	10
186	18
8	8
36	12
20	12
10	10
112	16
22	10
22	10
26	18
24	12
8	8
38	14
8	8
16	8
38	10
38	14
20	8
16	8
176	16
12	12
8	8
30	10
10	10
12	8
16	8
16	8
10	10
19	7
20	8
8	8
28	12
8	8
26	10
8	8
8	8
192	16
8	8
8	8
8	8
10	10
26	10
8	8
22	10
30	10
8	8
212	20
8	8
8	8
22	14
16	8
8	8
124	16
38	10
196	20
22	10
8	8
20	8
22	10
32	12
28	10
19	7
10	10
22	10
8	8
20	12
8	8
22	10
20	8
20	8
28	12
12	12
19	7
10	10
10	10
22	10
16	8
22	10
150	18
186	18
14	10
26	10
8	8
18	10
8	8
36	12
22	10
8	8
20	8
10	10
8	8
198	18
38	10
20	8
40	12
10	10
26	10
16	8
8	8
16	8
20	8
8	8
16	8
8	8
18	10
16	8
20	8
20	12
18	10
20	12
20	8
16	8
14	14
19	7
22	10
28	12
8	8
8	8
26	10
18	10
198	20
10	10
8	8
20	8
16	8
19	7
26	10
20	12
8	8
20	12
8	8
8	8
16	8
16	8
10	10
190	18
10	10
16	8
10	10
16	8
8	8
12	12
14	10
8	8
16	8
16	8
186	18
30	10
16	8
14	10
22	10
20	12
30	14
12	8
16	8
12	8
20	8
20	8
19	7
556	32
18	10
202	18
22	10
19	7
10	10
8	8
18	10
220	20
26	10
44	12
8	8
16	8
20	8
20	12
10	10
36	12
22	10
8	8
20	12
8	8
204	20
26	10
22	10
216	20
8	8
18	10
16	8
8	8
12	12
10	10
182	22
8	8
10	10
22	10
12	8
26	10
8	8
22	10
48	16
14	10
16	8
200	16
8	8
214	20
20	12
12	8
8	8
30	10
8	8
26	10
18	10
8	8
18	10
30	10
12	12
22	14
16	8
16	8
22	10
8	8
14	10
22	10
8	8
12	8
10	10
124	16
210	18
8	8
18	10
40	14
19	7
350	26
20	8
43	11
20	12
16	8
8	8
18	10
8	8
8	8
28	12
8	8
18	10
8	8
196	16
12	8
22	10
8	8
16	8
8	8
8	8
8	8
20	12
20	12
22	14
8	8
26	10
20	12
8	8
19	7
8	8
36	12
10	10
16	8
20	8
8	8
22	10
22	10
22	10
22	10
22	10
8	8
20	8
26	10
26	10
10	10
16	8
200	16
18	10
12	8
8	8
10	10
10	10
8	8
10	10
43	11
12	8
8	8
20	8
28	10
8	8
8	8
8	8
20	12
16	8
172	20
19	7
16	8
28	10
16	8
10	10
19	7
44	12
12	8
8	8
10	10
36	12
10	10
10	10
19	7
14	10
244	20
18	10
20	12
176	16
38	10
22	10
20	8
12	12
18	10
10	10
8	8
18	10
48	16
26	10
22	10
19	7
22	10
19	7
10	10
164	20
8	8
184	16
18	10
26	10
8	8
8	8
54	12
20	8
30	10
16	8
14	8
12	8
20	12
16	8
8	8
22	10
8	8
10	10
214	18
8	8
30	10
8	8
30	10
18	10
28	12
32	12
18	10
22	10
18	10
16	8
24	12
210	16
22	10
20	12
14	8
16	8
26	10
14	14
16	8
8	8
30	10
10	10
8	8
19	7
20	8
16	8
16	8
38	10
8	8
38	10
290	24
22	10
8	8
20	8
208	16
44	12
20	12
16	8
56	16
10	10
8	8
184	20
176	16
8	8
26	10
26	12
16	10
18	10
44	12
30	10
36	12
18	10
8	8
10	10
22	10
34	12
28	12
20	8
20	8
22	10
224	20
28	12
8	8
8	8
8	8
16	10
16	8
10	10
18	10
14	10
36	12
18	10
28	10
198	18
16	8
28	12
10	10
208	20
30	10
20	8
18	10
8	8
16	8
10	10
8	8
18	10
20	8
8	8
10	10
190	18
14	10
8	8
10	10
12	8
14	10
10	10
16	8
16	12
12	8
206	18
16	8
19	7
22	14
30	14
8	8
8	8
112	16
19	7
19	7
180	20
8	8
22	10
196	16
32	12
8	8
26	10
57	13
12	12
8	8
8	8
8	8
38	10
8	8
10	10
20	12
212	20
8	8
16	8
192	16
8	8
10	10
10	10
16	8
26	10
8	8
46	14
8	8
18	10
368	28
18	10
20	12
8	8
8	8
20	12
35	11
16	8
12	12
20	8
16	12
10	10
196	16
8	8
16	8
226	18
8	8
30	10
12	12
38	10
20	8
28	10
18	10
8	8
36	12
18	10
16	8
20	8
12	12
22	10
154	18
10	10
20	8
8	8
19	7
184	16
12	8
12	8
10	10
26	10
14	10
16	8
26	10
46	14
20	12
168	16
228	20
12	12
42	12
12	8
22	10
10	10
20	12
10	10
8	8
14	10
16	10
16	8
28	12
35	11
19	7
20	12
8	8
12	8
16	8
16	8
8	8
22	10
16	8
18	10
10	10
22	14
19	7
26	10
14	10
10	10
19	7
10	10
16	8
8	8
16	8
22	10
22	10
18	10
8	8
28	12
10	10
20	8
38	10
12	8
16	8
12	8
22	10
8	8
12	8
8	8
8	8
10	10
10	10
12	8
8	8
16	8
20	12
18	10
14	10
20	8
18	10
8	8
8	8
14	10
20	12
8	8
8	8
16	8
38	14
8	8
28	10
10	10
14	10
16	8
8	8
42	14
40	12
10	10
10	10
10	10
36	12
20	12
19	7
20	12
10	10
176	16
16	8
18	10
12	8
8	8
19	7
16	8
36	12
142	16
10	10
212	16
8	8
18	10
38	10
22	10
8	8
8	8
16	8
214	18
32	16
16	8
20	8
35	11
18	10
12	8
28	12
200	16
18	10
12	8
38	10
8	8
172	16
8	8
28	12
46	14
14	10
19	7
8	8
18	10
8	8
10	10
22	10
18	10
20	8
174	18
20	8
20	8
12	8
14	10
18	10
202	18
30	10
8	8
124	16
43	11
16	8
20	8
28	12
12	8
48	16
8	8
20	12
10	10
10	10
10	10
18	10
22	14
18	10
26	10
28	12
44	12
18	10
216	24
18	10
28	12
22	10
10	10
8	8
26	10
12	8
22	10
46	14
8	8
38	14
18	10
38	10
12	8
16	8
18	10
18	10
14	10
10	10
26	10
24	12
14	14
10	10
32	14
24	12
20	8
22	10
18	10
30	10
36	12
18	10
10	10
30	10
206	16
8	8
10	10
20	12
10	10
22	14
14	10
8	8
10	10
12	12
26	10
30	10
18	10
36	12
20	8
8	8
10	10
30	10
26	10
8	8
16	8
8	8
19	7
22	10
8	8
16	8
10	10
8	8
18	10
19	7
8	8
20	8
16	8
176	16
12	8
20	8
8	8
12	8
12	12
28	12
8	8
198	18
18	10
16	8
20	8
38	10
26	10
10	10
8	8
12	8
8	8
8	8
10	10
18	10
22	10
8	8
18	10
16	8
148	16
16	8
18	10
16	8
22	10
18	10
8	8
14	10
10	10
20	12
8	8
36	12
12	12
20	12
356	24
196	20
20	12
16	8
8	8
20	8
22	10
8	8
10	10
19	7
22	14
8	8
356	30
10	10
8	8
8	8
18	10
8	8
38	14
8	8
8	8
8	8
20	8
178	18
244	24
12	8
10	10
10	10
14	10
8	8
19	7
14	10
8	8
16	8
20	12
12	12
14	10
10	10
8	8
16	8
22	10
38	12
22	10
22	10
10	10
12	8
22	10
30	10
8	8
10	10
18	10
8	8
38	10
36	12
26	10
28	12
16	8
22	10
19	7
10	10
22	10
20	8
26	12
18	10
8	8
186	18
184	20
28	10
44	12
14	10
12	12
8	8
176	16
16	8
22	10
8	8
8	8
20	12
26	10
186	18
10	10
30	10
20	12
218	22
28	12
8	8
20	12
16	8
10	10
8	8
12	8
18	10
19	7
18	10
10	10
210	20
8	8
32	12
22	10
28	10
20	12
36	16
26	10
38	10
18	10
14	14
8	8
30	10
20	8
18	10
20	8
26	10
8	8
24	12
18	10
16	8
8	8
12	8
10	10
12	8
212	20
32	16
18	10
12	8
16	8
10	10
8	8
20	8
22	10
24	12
19	7
8	8
54	12
8	8
18	10
8	8
10	10
8	8
26	10
12	12
30	10
28	12
20	8
8	8
22	10
18	10
36	12
48	16
8	8
168	16
20	12
128	16
28	12
18	10
8	8
8	8
10	10
20	8
20	12
22	10
22	10
40	12
10	10
8	8
20	12
14	10
8	8
19	7
43	11
36	12
19	7
8	8
12	8
204	16
12	12
22	10
22	10
8	8
26	10
16	8
8	8
22	10
20	8
50	14
12	8
18	10
30	10
28	10
46	14
32	12
8	8
8	8
14	8
10	10
19	7
8	8
26	18
10	10
8	8
10	10
176	16
10	10
22	10
20	8
10	10
26	10
10	10
30	10
30	10
38	10
10	10
22	10
12	12
22	10
38	10
22	10
30	10
26	10
18	10
8	8
32	12
16	8
12	12
30	14
8	8
20	12
138	18
44	16
50	14
20	8
20	12
14	10
20	8
8	8
8	8
10	10
16	8
18	10
20	12
10	10
20	8
22	10
20	8
12	8
16	8
38	10
20	12
16	8
8	8
16	8
30	10
28	12
8	8
26	10
10	10
18	10
8	8
8	8
192	18
20	8
18	10
44	12
16	10
16	8
22	10
22	10
22	10
8	8
18	10
18	10
10	10
22	10
40	12
22	10
32	12
8	8
44	12
8	8
22	14
16	8
18	10
35	11
12	8
10	10
10	10
8	8
10	10
8	8
8	8
758	34
36	12
12	8
8	8
20	8
16	8
12	12
8	8
12	12
28	12
18	10
38	14
20	8
18	10
12	8
18	10
16	8
8	8
8	8
210	18
12	8
8	8
14	10
8	8
20	12
8	8
20	12
16	8
12	8
38	10
20	8
22	10
20	8
10	10
38	10
16	8
10	10
18	10
8	8
8	8
10	10
8	8
22	10
20	8
26	10
8	8
16	8
16	8
8	8
12	12
36	12
196	16
8	8
8	8
8	8
8	8
8	8
12	8
8	8
12	12
28	10
18	10
18	10
19	7
8	8
18	10
18	10
30	10
26	10
10	10
8	8
20	8
20	8
18	10
24	12
30	10
28	10
20	8
12	8
16	8
20	8
12	8
16	8
20	8
8	8
8	8
16	8
10	10
18	10
26	10
8	8
8	8
12	8
8	8
12	8
20	8
18	10
8	8
20	12
12	12
18	10
10	10
16	8
8	8
10	10
18	10
16	8
20	8
18	10
10	10
168	16
8	8
20	8
10	10
14	10
220	20
20	12
19	7
16	8
8	8
24	12
26	10
48	12
43	11
16	8
14	14
16	8
30	10
8	8
8	8
10	10
20	8
16	8
10	10
8	8
8	8
12	8
10	10
18	10
30	10
26	10
36	12
212	20
20	12
28	12
18	10
16	8
38	14
12	8
28	12
19	7
30	10
454	26
28	10
22	10
58	14
200	18
8	8
20	12
38	10
16	8
18	10
18	10
30	14
16	8
44	12
43	11
196	20
20	8
19	7
8	8
8	8
8	8
8	8
22	14
22	10
18	10
8	8
18	10
12	12
28	12
30	14
18	10
26	10
8	8
20	8
16	8
10	10
14	8
8	8
12	12
18	10
8	8
10	10
20	8
8	8
8	8
30	10
10	10
128	16
32	12
8	8
8	8
192	16
8	8
16	8
28	12
36	12
18	10
26	10
28	10
16	16
26	10
16	8
20	12
26	10
38	14
32	12
26	10
18	10
16	12
26	10
19	7
26	14
20	12
8	8
22	10
26	10
18	10
19	7
20	8
38	10
10	10
216	16
8	8
8	8
16	12
12	8
28	12
12	8
12	12
16	8
12	12
18	10
38	14
18	10
8	8
16	12
16	8
26	10
16	8
16	8
40	12
20	8
19	7
22	14
32	12
20	8
8	8
8	8
36	12
8	8
8	8
12	8
16	8
36	12
36	12
44	12
44	12
18	10
8	8
14	8
22	10
34	14
18	10
22	10
14	10
8	8
32	12
10	10
8	8
20	8
28	12
38	10
20	8
8	8
172	20
10	10
22	10
24	12
8	8
12	12
8	8
36	12
24	12
8	8
22	10
10	10
44	12
20	8
40	12
20	8
28	12
12	12
28	12
200	16
20	12
8	8
20	8
10	10
28	10
8	8
36	14
26	10
8	8
14	10
168	16
12	8
16	8
18	10
18	10
19	7
8	8
40	12
20	12
26	10
12	8
18	10
26	10
8	8
8	8
18	10
16	8
46	12
19	7
18	10
12	8
20	8
12	8
8	8
16	8
16	8
10	10
16	8
8	8
16	8
18	10
18	10
18	10
8	8
8	8
26	12
20	8
26	10
10	10
170	18
20	8
12	8
10	10
8	8
38	14
56	16
8	8
22	10
10	10
182	18
20	12
8	8
8	8
240	20
10	10
10	10
28	12
16	8
22	10
8	8
18	10
8	8
20	12
26	10
8	8
180	16
18	10
166	18
18	10
8	8
18	10
16	8
24	12
215	15
35	11
184	24
22	10
12	12
20	8
8	8
20	12
18	10
8	8
16	8
26	10
16	8
10	10
8	8
22	10
12	8
14	14
22	10
8	8
19	7
12	12
16	8
8	8
19	7
12	8
8	8
38	14
24	12
18	10
16	8
10	10
8	8
204	16
16	8
16	8
14	14
20	8
12	8
22	10
16	8
12	8
20	8
10	10
12	8
46	12
8	8
8	8
12	8
234	26
38	14
18	10
20	12
18	10
26	12
20	12
10	10
32	12
16	8
8	8
12	8
22	10
18	10
10	10
26	10
210	18
152	16
12	8
19	7
24	12
20	12
192	20
190	18
22	10
12	8
12	8
30	10
10	10
32	12
8	8
16	16
10	10
20	12
8	8
8	8
212	24
30	10
8	8
18	10
10	10
8	8
26	10
14	10
22	10
8	8
18	10
22	10
12	8
19	7
10	10
8	8
8	8
8	8
18	10
14	10
26	10
16	8
22	10
8	8
20	8
26	10
12	8
8	8
18	10
8	8
184	16
204	16
196	20
26	10
8	8
10	10
8	8
10	10
22	10
8	8
8	8
38	14
180	16
38	10
16	8
20	8
8	8
8	8
18	10
20	12
16	8
12	12
204	16
12	12
26	10
48	16
26	10
18	10
22	10
40	12
10	10
20	12
16	8
38	10
8	8
14	14
16	8
8	8
18	10
16	8
8	8
28	12
8	8
18	10
18	10
298	26
22	10
8	8
14	10
26	10
46	14
12	8
20	8
8	8
26	10
16	8
16	8
8	8
20	12
30	10
20	8
22	10
16	8
32	12
8	8
16	8
8	8
16	8
36	12
12	12
20	8
20	8
18	10
12	8
8	8
8	8
8	8
38	10
28	10
186	18
12	8
8	8
26	14
16	8
22	10
8	8
20	12
10	10
12	8
30	14
12	8
30	10
8	8
8	8
16	8
16	8
8	8
30	10
8	8
200	16
8	8
22	10
22	14
12	12
16	8
16	8
22	10
22	10
22	10
8	8
14	10
10	10
20	12
36	12
35	11
20	8
10	10
10	10
22	10
32	12
22	10
16	8
12	8
8	8
22	10
10	10
10	10
22	10
10	10
26	10
18	10
8	8
16	8
18	10
8	8
12	8
8	8
12	8
8	8
8	8
28	12
8	8
8	8
10	10
20	12
8	8
8	8
16	10
8	8
36	12
40	12
16	8
26	10
16	8
12	8
16	8
18	10
12	12
10	10
16	8
26	10
38	10
20	8
19	7
19	7
8	8
16	8
30	10
124	16
20	8
16	8
184	16
12	8
28	10
12	8
8	8
19	7
16	8
32	12
230	22
30	10
26	10
18	10
14	10
8	8
36	12
10	10
8	8
10	10
10	10
10	10
38	14
18	10
8	8
19	7
22	10
38	10
36	12
8	8
20	8
16	8
10	10
10	10
22	10
26	10
10	10
26	10
16	8
136	16
8	8
16	8
22	10
18	10
10	10
8	8
10	10
8	8
16	8
22	10
22	10
20	8
18	10
8	8
36	12
12	12
30	14
20	8
43	11
16	8
30	14
8	8
38	10
8	8
38	10
24	12
18	10
16	8
19	7
10	10
16	12
36	12
392	28
18	10
8	8
8	8
30	14
18	10
206	22
38	10
16	8
10	10
20	8
8	8
35	11
16	8
176	16
8	8
14	10
298	26
206	22
12	8
16	8
14	14
22	10
10	10
18	10
16	8
43	11
44	12
30	14
8	8
26	10
18	10
16	8
20	8
22	10
26	10
26	10
19	7
20	8
178	18
38	10
30	10
10	10
19	7
16	8
212	24
8	8
10	10
8	8
10	10
16	8
8	8
19	7
16	8
188	24
8	8
16	8
8	8
30	10
18	10
19	7
30	10
12	12
8	8
22	10
44	12
32	12
38	10
16	8
20	12
12	8
16	8
22	10
196	16
26	10
8	8
18	10
12	8
16	8
44	12
22	14
28	12
18	10
26	10
20	12
28	12
8	8
14	8
18	10
10	10
10	10
8	8
44	12
8	8
20	12
8	8
30	10
10	10
14	10
8	8
18	10
14	10
10	10
18	10
10	10
8	8
19	7
32	12
18	10
22	10
16	8
10	10
18	10
22	10
20	8
10	10
20	8
28	16
18	10
10	10
18	10
16	8
20	8
8	8
20	12
20	8
10	10
28	12
20	8
38	10
12	8
38	10
12	8
22	10
20	8
12	8
194	18
12	8
20	8
26	10
12	12
26	10
30	10
22	10
16	8
20	8
210	18
18	10
10	10
16	8
8	8
22	10
22	10
22	14
22	10
10	10
18	10
8	8
8	8
20	12
16	8
218	18
22	10
8	8
20	12
38	10
30	14
18	10
152	16
10	10
8	8
10	10
8	8
16	8
8	8
16	8
20	8
8	8
10	10
8	8
10	10
18	10
16	8
16	8
20	12
8	8
26	10
26	10
66	16
24	12
152	16
10	10
12	12
18	10
30	10
26	10
10	10
20	12
176	16
36	12
20	8
252	22
8	8
16	12
16	8
40	12
18	10
22	10
16	8
18	10
20	8
19	7
8	8
40	12
16	10
18	10
10	10
8	8
19	7
20	8
8	8
20	8
20	12
8	8
8	8
28	12
16	8
112	16
8	8
34	12
38	10
442	26
28	12
8	8
12	8
16	8
38	10
22	10
20	8
12	8
8	8
16	8
20	8
8	8
26	10
26	18
16	8
18	10
8	8
8	8
8	8
10	10
26	10
8	8
44	12
12	8
8	8
28	10
30	10
20	8
12	8
8	8
16	8
38	10
8	8
176	16
338	26
16	8
16	8
128	16
8	8
22	10
10	10
18	10
12	12
22	10
14	10
12	8
18	10
20	8
8	8
8	8
20	8
20	8
20	8
16	8
18	10
10	10
19	7
204	20
50	14
172	20
18	10
8	8
12	8
18	10
8	8
44	12
8	8
19	7
10	10
8	8
12	8
12	12
26	10
22	10
198	18
72	16
8	8
16	12
12	12
8	8
16	8
214	18
26	10
196	16
20	8
20	8
8	8
38	10
22	10
16	8
8	8
20	8
8	8
12	8
16	8
198	18
26	10
26	10
12	12
8	8
19	7
10	10
12	8
352	28
22	14
8	8
22	10
16	8
26	10
14	8
20	12
8	8
16	8
8	8
20	12
19	7
8	8
26	10
16	8
18	10
36	12
18	10
18	14
12	8
8	8
8	8
26	10
12	12
36	12
14	8
20	8
32	12
20	8
46	14
8	8
8	8
112	16
19	7
22	10
40	12
20	12
36	12
19	7
10	10
10	10
16	8
44	12
12	8
8	8
10	10
22	10
18	10
10	10
22	10
22	10
42	16
8	8
216	16
10	10
46	14
16	8
26	10
8	8
8	8
16	8
10	10
8	8
20	12
8	8
12	12
44	12
43	11
16	8
28	12
186	18
12	8
176	16
10	10
46	14
10	10
18	10
208	24
16	8
16	8
12	8
206	22
26	10
20	8
152	16
38	10
20	8
30	10
18	10
14	10
12	12
14	10
18	10
16	8
8	8
8	8
8	8
28	12
16	10
22	10
20	8
20	8
18	10
44	12
10	10
16	8
8	8
19	7
10	10
12	8
10	10
8	8
16	8
26	10
20	12
8	8
20	8
12	8
20	8
8	8
19	7
18	10
22	10
210	18
8	8
8	8
19	7
20	12
12	8
14	10
16	8
18	10
20	12
10	10
16	8
18	10
22	10
36	16
10	10
210	18
10	10
19	7
12	12
114	18
30	10
14	10
178	18
8	8
24	12
18	10
28	10
22	10
38	10
8	8
22	10
18	10
38	10
8	8
10	10
10	10
12	8
19	7
20	8
8	8
16	8
22	10
24	12
10	10
18	10
8	8
19	7
198	18
8	8
20	12
16	8
128	16
30	10
28	12
34	12
10	10
222	22
20	8
232	24
38	10
8	8
12	12
8	8
22	10
26	10
40	14
8	8
44	12
20	8
228	20
8	8
8	8
12	12
28	12
10	10
18	10
22	10
10	10
38	10
20	8
18	10
19	7
18	10
20	8
22	10
20	12
8	8
30	10
38	10
20	12
19	7
16	8
16	16
16	8
10	10
30	10
16	8
10	10
44	12
30	10
18	10
12	8
24	12
12	12
8	8
18	10
306	28
18	10
8	8
8	8
20	8
12	8
19	7
12	12
26	10
184	16
18	10
22	10
8	8
46	14
8	8
10	10
16	8
8	8
19	7
22	10
19	7
8	8
18	10
20	12
16	8
10	10
18	10
20	8
26	10
20	8
32	12
20	12
44	12
20	8
22	10
200	16
20	12
8	8
8	8
8	8
8	8
28	12
10	10
204	16
30	10
19	7
16	8
178	18
22	10
8	8
30	10
20	8
204	20
36	12
18	10
12	8
8	8
28	10
19	7
8	8
18	10
28	12
16	8
10	10
8	8
28	10
28	12
278	22
20	8
136	16
18	10
10	10
20	12
222	18
36	12
20	12
8	8
20	12
8	8
38	10
8	8
204	16
8	8
22	10
116	16
212	16
8	8
30	10
8	8
10	10
19	7
204	20
18	10
18	10
52	16
22	14
26	10
10	10
30	14
16	8
16	8
28	10
8	8
8	8
12	8
32	16
10	10
10	10
12	8
22	10
19	7
10	10
178	18
412	36
26	10
8	8
26	10
18	10
212	18
10	10
12	8
16	12
22	14
28	12
8	8
16	8
38	10
204	16
12	8
8	8
8	8
18	10
14	10
30	10
10	10
16	8
44	12
16	8
18	10
16	8
12	8
18	10
22	10
20	12
8	8
8	8
30	10
26	14
8	8
8	8
42	14
20	12
260	24
14	10
138	16
8	8
18	10
14	8
26	10
22	10
20	8
12	8
16	8
16	8
22	10
8	8
18	10
38	10
28	12
16	8
16	8
20	8
20	8
20	8
18	10
8	8
8	8
24	12
28	12
8	8
10	10
188	20
192	20
8	8
8	8
16	8
18	10
24	12
14	10
10	10
14	10
16	8
12	8
22	10
12	12
10	10
156	16
8	8
8	8
16	8
20	12
16	12
8	8
16	8
18	10
12	8
32	12
46	14
22	10
20	12
28	12
16	8
8	8
8	8
8	8
8	8
20	8
12	8
200	20
14	8
18	10
8	8
190	18
8	8
16	8
10	10
16	8
36	12
200	20
8	8
8	8
10	10
16	8
20	8
8	8
16	8
20	12
12	8
12	12
258	26
16	8
22	14
16	12
20	8
8	8
12	8
8	8
16	8
12	8
30	10
19	7
10	10
20	8
8	8
26	10
18	10
26	10
18	10
18	10
16	8
28	12
12	8
10	10
18	10
16	8
212	18
8	8
28	12
12	8
8	8
176	16
22	10
8	8
12	8
18	10
12	12
16	8
8	8
22	14
10	10
8	8
12	8
8	8
26	10
18	10
10	10
18	10
10	10
10	10
206	22
18	10
8	8
8	8
200	24
8	8
10	10
12	8
18	10
48	16
16	8
20	8
16	8
12	8
10	10
8	8
16	8
28	10
16	8
16	8
20	12
8	8
44	12
14	10
22	10
20	12
8	8
12	12
10	10
18	10
20	8
26	10
8	8
12	12
18	10
192	16
16	8
20	8
8	8
180	20
20	8
10	10
8	8
204	20
26	10
26	10
24	12
42	16
10	10
10	10
20	8
8	8
19	7
8	8
26	10
22	10
8	8
28	12
8	8
30	10
38	10
22	10
8	8
24	12
8	8
20	12
20	8
186	18
10	10
194	18
258	26
10	10
54	12
16	8
20	8
8	8
10	10
22	14
22	10
38	10
16	8
22	14
18	10
12	8
40	12
19	7
8	8
172	20
10	10
14	8
276	24
38	14
26	10
8	8
8	8
12	8
26	10
8	8
22	10
30	10
22	10
30	10
16	8
8	8
8	8
18	10
22	10
8	8
8	8
18	10
202	18
12	12
26	10
18	10
196	16
8	8
26	10
8	8
10	10
18	10
8	8
8	8
44	12
22	10
20	12
20	8
194	22
60	16
10	10
20	8
28	12
10	10
36	12
38	10
19	7
42	14
8	8
20	8
26	10
26	14
12	12
28	12
26	10
20	12
10	10
210	18
22	10
20	12
30	10
10	10
22	10
38	14
10	10
18	10
42	14
10	10
8	8
10	10
52	16
8	8
40	12
16	8
10	10
12	8
8	8
36	12
12	12
14	10
8	8
19	7
18	10
18	10
42	12
43	11
8	8
28	14
16	8
12	8
20	12
10	10
8	8
170	18
22	10
16	8
18	10
8	8
136	16
8	8
22	10
40	16
19	7
10	10
26	10
202	18
10	10
19	7
12	8
16	8
8	8
8	8
10	10
8	8
8	8
22	10
20	12
200	20
8	8
8	8
19	7
18	10
26	10
8	8
42	14
16	8
44	12
222	18
36	12
18	10
10	10
44	12
12	12
8	8
10	10
30	10
18	10
18	10
10	10
35	11
10	10
16	8
30	10
8	8
8	8
46	14
12	8
8	8
20	8
16	8
26	10
184	16
28	12
16	12
16	8
8	8
14	10
194	18
16	12
16	8
16	8
22	10
154	18
8	8
28	12
178	18
18	10
10	10
12	8
12	12
216	18
28	12
19	7
10	10
10	10
19	7
10	10
42	14
10	10
24	16
132	16
8	8
43	11
24	12
8	8
20	8
8	8
8	8
20	12
8	8
38	14
226	22
40	12
8	8
16	8
188	16
20	8
16	8
40	12
20	8
26	10
18	10
8	8
204	20
28	16
16	8
20	8
18	10
16	8
8	8
16	8
44	12
16	12
30	10
8	8
18	10
26	10
10	10
28	12
19	7
16	8
20	12
30	10
18	10
214	18
10	10
244	20
26	10
20	8
8	8
22	10
14	14
8	8
30	10
12	8
28	12
18	10
36	12
16	8
10	10
186	18
22	14
30	16
10	10
36	12
8	8
20	8
18	10
8	8
28	12
10	10
8	8
14	10
19	7
22	14
18	10
10	10
20	8
18	10
26	10
8	8
8	8
8	8
16	8
12	8
16	8
30	10
10	10
24	16
18	10
8	8
24	12
24	12
10	10
19	7
16	8
20	12
208	20
16	8
8	8
16	8
40	12
8	8
20	8
10	10
8	8
12	8
10	10
10	10
8	8
176	16
170	18
16	8
16	8
186	18
20	12
8	8
28	10
22	10
16	8
52	16
48	14
16	8
24	12
8	8
20	12
8	8
19	7
8	8
20	8
10	10
8	8
28	10
202	18
10	10
8	8
18	10
20	8
19	7
38	14
12	8
8	8
20	8
18	10
18	10
26	10
8	8
20	8
18	10
8	8
20	8
16	8
40	16
8	8
8	8
40	12
18	10
18	10
10	10
8	8
28	10
22	10
8	8
12	8
56	16
20	12
16	8
16	8
8	8
20	12
8	8
10	10
28	10
16	8
16	8
178	18
22	10
38	10
8	8
18	10
20	8
12	8
176	16
168	20
8	8
22	10
208	20
8	8
40	12
8	8
22	10
8	8
32	16
16	8
54	12
16	8
19	7
22	10
8	8
8	8
208	18
18	10
16	8
18	10
18	10
8	8
16	8
22	14
20	8
18	10
32	16
24	16
20	12
234	18
43	11
20	12
12	8
18	10
8	8
8	8
28	12
20	8
12	8
20	8
8	8
22	14
328	32
38	10
20	8
8	8
16	8
168	16
28	12
8	8
12	12
30	10
430	24
12	8
28	12
8	8
8	8
18	10
18	10
176	16
12	8
524	36
8	8
8	8
46	14
14	10
8	8
12	8
10	10
26	10
38	10
12	12
20	8
26	10
16	8
16	8
20	8
18	10
10	10
8	8
16	8
22	10
20	8
19	7
24	12
8	8
16	8
52	14
19	7
16	8
20	8
8	8
10	10
18	10
18	10
8	8
8	8
8	8
8	8
20	8
48	16
32	12
188	20
20	8
18	10
16	8
8	8
18	10
16	8
34	14
38	10
30	12
22	14
10	10
38	10
234	18
30	14
28	10
38	10
20	8
8	8
22	10
8	8
176	16
12	12
8	8
19	7
22	10
22	10
198	18
20	8
19	7
14	10
8	8
8	8
18	10
20	8
10	10
8	8
172	16
8	8
28	12
10	10
19	7
8	8
8	8
24	12
12	8
8	8
38	14
8	8
38	10
44	12
30	10
32	12
268	24
14	10
8	8
12	8
8	8
16	8
8	8
19	7
26	10
8	8
214	18
18	10
12	8
18	10
12	8
160	18
20	8
28	12
30	10
20	8
48	12
20	8
10	10
12	12
8	8
24	12
8	8
10	10
26	10
8	8
20	8
220	20
18	10
8	8
10	10
14	10
8	8
20	12
20	8
16	8
16	8
22	10
30	10
26	10
32	12
18	10
38	14
22	14
36	12
48	12
8	8
24	12
8	8
10	10
58	18
198	18
10	10
8	8
208	16
20	12
10	10
20	12
8	8
20	8
18	10
8	8
10	10
8	8
44	12
8	8
8	8
8	8
8	8
20	8
10	10
8	8
16	8
8	8
8	8
16	8
48	12
20	8
10	10
18	10
12	12
22	14
18	10
26	10
8	8
12	12
8	8
22	10
8	8
22	10
10	10
8	8
20	8
26	10
14	10
20	12
18	10
12	8
22	10
12	8
18	10
8	8
19	7
8	8
30	10
18	10
20	12
64	16
8	8
16	8
18	10
8	8
8	8
10	10
8	8
22	10
8	8
20	12
12	8
38	10
28	12
8	8
22	10
20	8
19	7
8	8
10	10
8	8
8	8
18	10
18	10
14	10
42	18
22	10
8	8
32	12
30	10
26	10
16	8
32	12
20	8
19	7
10	10
44	12
18	10
8	8
12	8
20	12
8	8
18	10
18	10
20	8
290	22
12	8
168	16
30	10
8	8
10	10
10	10
16	8
20	8
10	10
16	8
50	14
8	8
12	8
12	8
30	10
14	8
16	8
20	8
26	10
8	8
114	18
18	10
50	14
32	12
14	10
12	12
8	8
18	10
8	8
30	14
8	8
20	8
8	8
18	10
178	18
10	10
40	12
8	8
16	8
12	8
44	12
19	7
19	7
210	18
12	12
36	12
26	10
12	12
46	14
8	8
8	8
30	10
8	8
20	8
8	8
8	8
10	10
18	10
16	8
16	8
18	10
8	8
16	8
16	8
8	8
8	8
14	10
8	8
20	12
18	10
16	8
8	8
8	8
20	12
26	10
22	14
20	12
36	12
43	11
8	8
8	8
10	10
26	10
16	12
20	8
18	10
10	10
12	12
8	8
8	8
22	14
12	8
28	12
16	8
10	10
12	12
22	10
20	8
8	8
18	10
19	7
42	14
16	8
22	10
16	8
18	10
18	10
24	12
18	10
40	14
18	10
22	10
8	8
46	14
20	12
16	8
16	8
8	8
32	12
12	8
236	20
10	10
8	8
14	10
43	11
38	10
16	8
19	7
10	10
32	12
22	10
8	8
225	17
22	10
12	8
8	8
14	10
8	8
12	8
40	12
8	8
26	10
8	8
8	8
19	7
8	8
16	8
20	12
16	12
10	10
12	8
8	8
12	8
54	12
12	12
8	8
20	12
8	8
238	22
8	8
8	8
10	10
30	10
8	8
8	8
19	7
8	8
8	8
12	8
22	10
34	14
19	7
22	10
8	8
20	8
38	14
22	10
10	10
8	8
8	8
12	8
8	8
12	8
8	8
12	12
22	14
16	8
20	8
28	12
26	10
28	10
20	12
8	8
32	12
8	8
30	10
22	10
10	10
16	8
14	14
8	8
18	10
20	12
8	8
18	10
24	16
10	10
10	10
322	22
22	14
10	10
10	10
12	12
12	8
8	8
12	8
10	10
16	8
20	8
22	10
8	8
38	10
22	14
57	13
8	8
188	20
8	8
8	8
20	8
72	16
8	8
186	18
186	18
44	16
366	26
20	8
10	10
8	8
14	10
12	8
10	10
8	8
18	10
20	8
43	11
26	10
22	14
16	8
8	8
44	12
8	8
30	10
22	10
202	18
12	8
12	8
18	10
14	10
16	8
8	8
54	12
22	14
178	18
16	8
8	8
20	8
18	10
8	8
16	8
38	10
18	14
14	10
10	10
36	12
20	12
20	8
26	10
20	12
22	10
8	8
20	8
18	10
16	8
16	8
198	18
8	8
176	16
20	8
26	10
19	7
38	10
10	10
222	22
19	7
204	20
26	10
8	8
30	10
16	8
22	10
50	14
10	10
14	10
8	8
28	12
30	10
204	20
10	10
12	8
8	8
18	10
16	8
22	10
8	8
16	8
16	8
8	8
22	10
24	12
16	8
22	14
8	8
19	7
22	10
22	10
188	16
22	10
8	8
22	10
36	12
26	10
10	10
12	12
178	18
14	10
18	10
16	8
8	8
12	8
18	10
16	8
8	8
178	18
12	8
18	10
8	8
18	10
38	14
8	8
10	10
19	7
19	7
24	12
22	10
10	10
19	7
19	7
38	10
22	10
8	8
8	8
8	8
8	8
26	10
238	22
180	16
208	16
40	16
18	10
12	8
19	7
16	8
8	8
16	10
10	10
12	8
18	10
28	12
18	10
36	12
8	8
20	12
10	10
12	8
24	12
8	8
12	8
8	8
30	10
188	16
200	16
26	14
18	10
44	12
20	12
18	10
140	16
8	8
28	12
18	10
16	8
16	8
10	10
8	8
20	12
20	12
8	8
12	8
8	8
176	20
20	8
8	8
16	8
8	8
10	10
8	8
38	10
8	8
8	8
18	10
20	8
8	8
42	14
8	8
12	12
16	8
18	10
8	8
8	8
50	18
16	8
8	8
18	10
40	12
18	10
24	12
8	8
14	10
8	8
10	10
12	8
38	10
22	10
10	10
12	8
8	8
22	10
8	8
16	8
10	10
8	8
16	8
16	8
22	10
38	10
16	8
18	10
20	8
34	14
20	12
38	10
10	10
20	8
30	14
20	8
40	12
14	10
43	11
16	12
19	7
8	8
12	12
8	8
10	10
19	7
20	12
24	12
10	10
8	8
56	16
8	8
12	12
28	10
184	18
44	12
12	8
10	10
10	10
20	12
8	8
44	12
16	8
40	12
14	14
20	12
30	14
20	12
18	10
14	10
20	8
20	8
19	7
12	8
24	12
10	10
8	8
19	7
22	14
16	8
18	10
20	12
22	10
19	7
8	8
184	16
44	12
12	12
20	8
28	12
8	8
10	10
230	20
20	8
22	14
16	8
34	14
18	14
20	12
8	8
28	12
10	10
16	8
10	10
10	10
20	8
10	10
176	16
8	8
26	10
8	8
18	10
324	24
26	10
336	26
19	7
32	12
18	10
208	20
8	8
40	12
58	14
20	8
12	12
18	10
26	14
22	10
12	12
8	8
10	10
8	8
66	16
24	12
32	12
26	10
14	10
22	14
20	8
30	10
38	10
8	8
20	8
19	7
16	8
18	10
16	12
44	12
18	10
202	18
30	10
8	8
20	8
8	8
8	8
10	10
10	10
26	10
8	8
8	8
19	7
318	24
28	10
10	10
180	16
8	8
10	10
8	8
10	10
8	8
22	10
10	10
20	8
8	8
22	14
22	10
16	8
8	8
16	8
26	14
19	7
8	8
180	16
8	8
18	10
16	8
182	18
12	8
8	8
24	12
36	12
20	8
8	8
8	8
16	8
8	8
19	7
32	12
30	10
8	8
8	8
20	12
194	18
18	10
8	8
178	18
8	8
202	18
10	10
20	12
192	16
8	8
24	12
184	16
18	10
212	20
54	14
26	10
38	10
42	12
10	10
38	10
8	8
16	8
26	10
148	16
8	8
43	11
16	8
18	10
18	10
12	8
8	8
8	8
10	10
22	14
8	8
18	10
10	10
42	12
16	8
16	8
16	8
19	7
16	8
38	14
18	10
12	8
30	10
8	8
10	10
8	8
16	8
26	10
19	7
12	12
18	10
12	12
22	10
35	11
10	10
16	8
16	8
202	18
14	10
8	8
20	8
18	10
10	10
44	12
8	8
14	10
8	8
26	10
22	10
8	8
8	8
12	8
8	8
26	10
18	10
18	10
26	10
248	24
12	12
46	14
38	10
19	7
30	10
10	10
10	10
12	8
10	10
19	7
28	12
216	16
10	10
8	8
8	8
32	12
22	10
22	10
28	12
12	12
160	20
8	8
20	8
20	8
20	8
40	12
8	8
18	10
8	8
8	8
16	8
14	10
19	7
178	18
14	10
20	8
32	12
28	10
8	8
220	20
8	8
18	10
8	8
28	12
20	12
8	8
38	10
19	7
18	10
16	8
30	10
20	12
20	12
10	10
12	12
8	8
20	8
10	10
18	10
22	10
8	8
14	10
16	8
30	10
202	18
8	8
28	10
12	8
8	8
10	10
18	10
20	8
18	10
18	10
210	18
12	8
18	10
20	8
26	10
26	10
16	8
766	42
8	8
8	8
38	10
38	10
19	7
22	10
14	10
322	26
26	10
28	10
20	12
22	10
8	8
30	10
8	8
10	10
8	8
10	10
10	10
122	18
8	8
22	14
8	8
18	10
18	10
456	28
8	8
48	12
22	10
44	12
16	8
8	8
10	10
22	10
28	10
19	7
44	12
12	8
14	14
10	10
18	10
34	14
8	8
26	10
20	8
30	14
8	8
16	12
10	10
18	10
406	30
10	10
20	12
38	12
28	12
19	7
8	8
8	8
16	8
22	10
10	10
16	8
16	8
22	14
8	8
18	10
22	14
12	8
8	8
10	10
46	14
16	8
32	12
12	8
26	10
26	10
22	10
28	12
8	8
19	7
24	12
14	10
8	8
302	22
16	8
24	12
8	8
8	8
22	10
22	10
20	8
30	14
72	20
10	10
168	16
204	18
12	12
38	10
22	10
28	12
20	12
20	8
36	12
22	10
30	10
10	10
22	10
188	20
22	10
8	8
8	8
8	8
22	10
206	22
12	12
174	18
8	8
8	8
16	8
20	8
8	8
38	10
8	8
8	8
16	8
20	12
18	14
8	8
10	10
36	12
8	8
14	10
20	8
12	8
19	7
38	14
14	10
8	8
12	8
8	8
19	7
30	10
8	8
16	8
26	10
30	10
12	8
28	12
8	8
10	10
10	10
30	10
124	20
12	8
10	10
18	10
136	16
8	8
16	8
8	8
8	8
22	10
10	10
10	10
19	7
10	10
12	12
8	8
28	10
18	10
10	10
32	12
8	8
18	10
8	8
20	12
18	10
10	10
12	8
18	10
19	7
8	8
22	10
186	18
8	8
8	8
20	8
10	10
8	8
16	8
8	8
16	8
8	8
12	12
8	8
8	8
19	7
20	12
40	12
16	8
178	18
656	32
12	12
18	10
20	8
19	7
10	10
8	8
26	10
12	12
38	10
8	8
22	10
16	8
14	10
16	8
32	12
12	12
10	10
46	14
16	8
10	10
20	8
26	10
43	11
19	7
12	8
16	8
592	36
8	8
20	8
20	12
18	10
18	14
8	8
20	8
8	8
24	12
10	10
10	10
32	16
14	14
30	10
8	8
266	22
8	8
8	8
8	8
8	8
8	8
8	8
30	10
28	12
40	12
28	10
8	8
16	8
12	12
20	12
10	10
18	10
16	8
28	12
8	8
20	8
22	10
8	8
18	10
20	8
10	10
20	8
20	8
20	8
12	8
20	8
20	12
14	14
19	7
22	10
54	14
8	8
20	8
18	10
8	8
198	20
18	10
38	10
12	8
8	8
16	8
8	8
22	10
8	8
22	10
10	10
18	10
210	18
16	8
8	8
16	8
8	8
168	16
8	8
10	10
32	12
28	12
8	8
22	10
22	10
8	8
38	10
18	10
8	8
22	10
16	8
18	10
112	16
14	10
14	10
18	10
20	12
8	8
32	12
30	10
8	8
20	8
30	12
16	8
12	8
44	12
22	10
26	10
16	8
18	10
8	8
8	8
28	10
26	10
19	7
10	10
28	12
16	8
14	10
16	16
18	10
10	10
8	8
44	12
28	12
8	8
18	10
12	12
20	8
186	18
252	20
26	10
8	8
20	8
10	10
8	8
10	10
26	10
19	7
8	8
10	10
20	12
18	12
20	8
10	10
20	12
18	10
8	8
22	10
16	8
12	8
8	8
20	12
20	8
20	8
8	8
44	12
18	10
8	8
20	12
8	8
8	8
22	10
44	12
10	10
34	14
180	20
22	10
8	8
844	40
16	8
8	8
26	10
28	10
12	8
20	12
19	7
8	8
56	16
8	8
8	8
18	10
18	10
8	8
30	10
32	12
18	10
22	10
18	10
8	8
8	8
22	14
18	10
20	12
16	8
24	12
10	10
10	10
16	8
20	8
16	8
18	10
10	10
10	10
8	8
22	10
8	8
8	8
8	8
16	8
16	12
8	8
12	8
8	8
16	8
12	12
12	8
178	18
274	30
10	10
128	16
19	7
8	8
16	8
8	8
20	12
16	8
10	10
26	10
12	8
8	8
8	8
19	7
24	12
18	10
20	12
16	8
22	14
170	18
19	7
16	8
8	8
26	10
20	12
14	8
214	18
10	10
12	8
18	10
18	10
16	8
8	8
20	8
20	12
16	8
8	8
52	16
14	10
26	10
18	10
206	18
28	10
8	8
20	8
8	8
8	8
22	10
22	10
8	8
10	10
8	8
18	10
46	14
8	8
35	11
18	10
10	10
22	10
48	16
8	8
22	10
8	8
32	12
10	10
22	14
24	12
20	8
38	10
8	8
8	8
12	8
26	10
10	10
40	12
10	10
8	8
12	8
12	12
32	12
8	8
36	12
20	8
12	8
10	10
12	8
28	10
30	10
30	12
40	12
8	8
16	8
8	8
8	8
20	8
20	8
8	8
14	10
180	20
18	10
38	12
8	8
20	8
8	8
8	8
28	12
32	12
8	8
26	14
16	8
12	8
16	8
19	7
20	12
20	8
10	10
8	8
56	16
46	14
26	10
8	8
20	8
20	12
40	12
10	10
16	8
302	26
178	18
26	10
44	12
120	16
18	10
18	10
22	10
20	12
8	8
36	12
16	8
10	10
8	8
8	8
30	10
8	8
26	10
10	10
8	8
20	12
10	10
8	8
8	8
18	10
26	10
8	8
43	11
20	8
20	12
16	8
186	18
20	12
38	10
14	14
16	8
16	8
18	10
26	10
30	10
12	8
8	8
18	10
28	12
8	8
16	8
230	22
16	8
10	10
26	10
20	8
16	10
20	12
38	10
20	12
18	10
20	8
12	8
10	10
22	10
262	24
28	14
38	10
8	8
14	10
14	10
8	8
8	8
22	10
36	12
26	10
18	10
20	8
20	8
20	8
22	10
26	10
40	12
12	12
8	8
16	8
8	8
22	10
36	12
12	12
22	10
12	12
18	10
20	8
8	8
16	8
8	8
14	14
18	10
18	10
206	18
22	10
36	12
8	8
22	10
18	10
10	10
38	10
16	8
8	8
210	22
8	8
8	8
172	16
20	12
12	8
18	10
12	8
8	8
8	8
14	10
10	10
10	10
18	10
8	8
10	10
8	8
28	12
186	18
40	16
8	8
20	8
166	18
8	8
22	10
10	10
36	12
38	10
26	10
22	10
8	8
38	12
16	8
18	10
16	8
18	10
10	10
8	8
12	12
8	8
16	8
20	8
24	12
10	10
22	10
10	10
22	10
20	8
26	10
8	8
8	8
12	8
152	16
14	10
26	10
14	10
20	12
38	10
10	10
20	8
10	10
16	8
12	8
28	10
19	7
8	8
8	8
18	10
8	8
24	12
18	10
30	10
16	8
10	10
12	8
22	14
24	12
62	18
43	11
40	12
8	8
22	14
8	8
16	8
10	10
26	10
20	8
10	10
16	8
18	10
22	14
18	10
16	8
22	10
46	14
30	14
236	20
22	10
12	8
26	14
19	7
14	10
8	8
32	12
14	10
8	8
10	10
16	8
8	8
8	8
8	8
12	8
12	8
8	8
18	10
12	12
8	8
10	10
16	8
18	10
20	8
18	10
8	8
8	8
26	10
20	12
46	14
28	12
10	10
8	8
296	24
18	10
20	12
10	10
20	8
16	8
22	10
20	12
8	8
16	12
280	24
22	10
22	10
28	12
28	12
10	10
19	7
8	8
12	12
20	8
8	8
16	8
8	8
10	10
12	8
8	8
8	8
210	18
12	12
20	8
20	8
14	10
20	8
16	8
8	8
19	7
16	8
14	10
26	10
20	8
178	18
12	12
12	8
20	8
38	10
188	16
36	12
8	8
28	10
12	8
218	18
38	10
168	16
10	10
30	10
8	8
38	10
36	12
20	8
8	8
16	8
16	8
10	10
36	12
8	8
20	8
10	10
36	12
18	10
14	14
8	8
14	10
26	10
8	8
8	8
30	10
16	8
8	8
12	12
20	12
8	8
228	24
24	12
254	22
12	8
22	10
14	8
32	12
16	8
18	10
36	12
22	10
14	10
8	8
8	8
30	10
38	10
200	16
8	8
18	10
20	8
8	8
20	12
16	8
18	10
22	10
8	8
24	12
8	8
