Score	Length
350	46
402	44
164	36
314	42
502	50
294	50
142	22
184	32
154	34
1084	78
170	30
544	46
266	42
1046	62
320	52
602	54
172	32
846	62
844	60
308	48
232	40
292	34
758	56
324	38
972	72
170	42
636	54
248	36
340	44
830	70
260	52
132	20
228	48
468	48
116	28
228	36
428	46
96	20
230	34
160	32
266	46
546	62
682	50
134	34
532	48
260	28
368	40
102	20
398	54
776	54
530	54
508	52
164	34
180	36
512	48
328	36
1272	68
140	24
94	34
964	52
326	42
204	40
114	30
42	26
360	40
178	26
528	58
222	42
272	40
230	34
178	34
188	32
112	36
50	26
214	46
846	62
1156	76
256	40
220	32
268	36
252	44
234	34
100	32
52	32
132	30
126	30
426	46
140	24
594	58
234	38
388	48
396	48
466	46
100	32
288	40
286	26
50	18
224	36
204	32
282	38
182	30
48	32
316	44
356	36
788	60
218	34
192	36
360	32
886	42
388	40
212	24
236	36
90	36
192	28
456	40
166	38
864	54
512	56
572	54
374	42
252	36
378	44
838	58
276	44
614	48
430	46
102	26
162	30
44	20
518	64
292	48
314	38
98	34
272	44
830	56
218	30
448	48
140	32
192	26
376	44
192	36
210	34
412	40
148	36
148	28
2764	92
578	54
336	36
80	28
136	36
392	40
748	60
184	26
130	30
160	24
728	54
576	60
652	58
658	54
472	52
126	26
684	64
206	26
256	44
274	32
56	32
88	28
550	52
1198	82
302	22
1222	62
650	54
712	58
654	54
168	28
132	24
422	46
220	28
340	36
556	56
350	52
534	46
774	50
358	38
384	48
430	40
162	34
146	30
226	28
46	30
568	52
110	24
144	32
414	44
60	20
106	22
334	34
192	28
362	42
793	52
234	34
406	42
614	52
154	38
156	40
92	24
216	32
182	34
184	36
476	64
256	44
204	30
3328	102
102	34
276	32
68	24
378	46
218	34
254	46
536	40
34	26
1344	62
752	52
162	34
150	34
220	36
222	30
308	44
208	32
228	28
460	42
80	28
200	28
236	40
386	38
830	58
898	56
600	52
68	28
610	50
374	40
318	38
296	42
176	32
610	50
104	16
264	46
148	28
536	52
408	44
266	38
196	36
450	48
86	18
248	36
838	48
658	52
118	38
268	32
122	34
1952	88
164	28
260	36
320	32
336	36
248	40
56	24
306	46
178	26
854	62
352	48
320	48
234	30
136	24
134	26
738	50
464	48
98	26
344	48
358	42
310	38
578	54
188	34
416	44
434	62
346	30
154	26
54	26
450	50
640	48
540	52
114	26
206	42
466	48
370	48
316	42
884	64
660	48
132	32
338	30
330	46
534	58
544	50
262	30
44	28
192	32
1218	74
2122	82
100	34
68	32
74	38
208	32
230	34
98	30
684	40
134	34
512	52
1918	80
1064	70
748	58
320	44
314	42
76	28
534	42
432	44
540	44
158	34
298	46
200	36
244	32
270	30
382	50
148	26
230	36
500	52
326	46
600	56
774	54
326	38
240	44
470	56
558	46
108	24
638	54
166	30
92	36
48	28
146	30
200	28
1530	68
376	48
174	38
988	82
932	64
94	26
208	40
112	24
122	34
228	38
150	30
80	32
500	52
208	48
886	54
154	38
382	46
244	32
408	48
162	38
192	24
286	34
76	28
86	18
522	56
454	42
1404	84
550	54
192	36
346	46
214	26
144	28
48	28
86	30
184	40
284	36
350	34
608	58
166	22
178	30
418	46
164	28
178	34
162	30
228	36
474	56
114	22
392	46
760	50
270	38
124	32
1302	54
322	38
220	28
118	30
100	22
945	62
1270	72
520	48
560	52
228	40
648	48
530	42
82	18
556	56
242	40
94	30
156	28
280	38
72	20
1178	58
480	48
66	26
402	38
190	34
78	18
300	44
298	42
206	36
552	52
36	28
256	44
2586	110
506	48
688	54
312	48
306	32
362	46
162	34
42	30
480	52
440	56
1462	84
420	46
162	38
364	44
78	30
408	40
464	48
182	22
36	24
116	30
304	36
288	40
110	22
164	36
56	16
344	44
370	40
160	32
278	38
622	50
542	54
134	38
196	32
324	36
212	36
42	18
784	60
388	42
240	24
148	36
568	44
1128	70
156	28
1948	100
1562	64
362	42
362	50
300	40
124	28
506	50
328	44
1456	76
68	24
996	60
88	28
224	26
318	34
766	66
82	26
314	50
314	42
146	34
44	32
154	38
120	28
354	28
50	18
188	32
122	30
280	36
214	34
686	50
298	38
96	24
124	38
196	36
206	38
112	32
2748	82
404	44
66	24
80	28
64	28
1592	74
256	32
202	36
374	48
348	52
340	42
346	42
84	32
322	46
154	30
658	54
134	22
368	40
460	50
738	58
240	32
1436	74
172	32
3064	108
108	36
410	62
240	34
76	16
306	54
274	30
62	22
222	30
360	38
158	34
396	44
552	50
764	66
378	42
66	22
700	64
158	30
164	28
142	42
822	66
440	40
352	40
98	22
1414	78
702	50
354	30
1286	64
294	38
346	46
170	30
58	26
562	52
152	28
718	56
19	7
724	64
544	54
188	32
622	52
250	40
334	38
132	30
348	48
332	42
146	30
306	38
330	40
250	42
140	24
108	32
286	42
226	34
736	64
288	36
446	46
134	26
456	40
48	16
86	30
296	38
74	22
528	44
178	34
42	26
902	46
426	44
1460	76
152	28
368	46
124	32
416	40
566	46
214	26
48	24
286	54
316	44
204	38
170	28
402	42
294	42
494	42
696	50
150	26
316	40
632	56
174	42
438	42
474	38
128	36
264	32
160	32
270	34
654	54
1054	70
98	22
66	26
390	42
568	60
276	36
60	24
1838	80
568	40
306	38
1114	74
184	36
876	60
132	28
322	42
354	42
86	30
334	42
86	26
400	48
22	14
470	46
342	42
366	54
572	60
36	28
286	46
518	60
1548	70
250	30
596	48
584	64
62	22
468	52
432	46
32	32
200	36
180	32
140	24
284	36
100	28
38	30
368	44
112	28
76	24
370	34
126	34
932	72
648	44
248	36
330	40
174	38
126	30
284	40
3056	122
244	44
134	26
46	18
1046	52
232	32
112	24
112	28
98	28
178	30
170	30
282	34
116	24
378	54
364	40
82	38
290	42
2400	92
862	56
1592	84
224	32
136	32
252	42
218	38
168	24
150	30
546	48
584	44
134	34
84	24
520	30
538	54
254	34
196	32
454	58
58	14
168	32
522	66
132	36
298	42
136	40
524	44
386	56
628	48
244	36
298	30
120	30
360	42
96	24
122	26
404	44
150	38
820	64
96	24
68	28
266	46
112	28
170	38
244	36
590	46
350	38
54	30
284	36
148	24
60	24
206	30
50	22
68	28
88	20
314	38
284	44
1086	78
80	24
74	26
332	54
254	46
2120	74
106	30
222	26
392	48
736	60
58	30
484	36
942	60
642	62
294	38
812	58
462	42
168	36
162	34
68	28
84	36
322	38
94	26
268	44
108	20
154	26
1122	66
202	30
294	46
182	26
516	54
238	30
682	54
184	28
238	34
86	38
1408	82
58	30
5539	153
400	60
1612	86
1000	64
236	40
368	38
320	44
6018	140
176	28
554	44
1060	68
568	56
86	22
94	30
580	52
444	48
292	36
1034	74
42	26
306	34
408	46
288	44
652	44
156	28
160	40
30	22
576	48
200	36
186	34
340	42
338	42
1008	64
400	48
50	18
286	38
190	26
296	36
779	54
488	32
186	26
510	50
504	50
882	58
170	34
340	44
180	36
28	28
86	26
344	30
516	50
440	52
342	46
726	48
684	60
780	60
466	50
30	22
122	30
346	42
468	48
1488	86
202	38
110	26
170	34
150	38
582	46
40	24
126	22
284	44
378	38
450	46
126	38
188	36
274	42
362	42
138	30
30	30
230	38
628	52
32	24
556	64
196	28
162	30
288	32
812	64
1760	92
926	46
664	64
272	36
416	52
92	28
354	42
664	56
840	60
80	24
76	16
382	44
562	48
678	62
322	46
284	40
1138	64
306	38
322	42
472	36
198	38
350	42
708	60
168	28
742	50
114	30
198	34
184	32
188	32
244	36
764	54
764	48
644	52
174	36
164	32
468	42
466	40
228	28
352	36
272	24
230	46
466	52
48	16
616	58
326	34
498	54
158	34
218	34
110	32
522	42
458	58
212	28
204	24
496	42
280	36
444	52
184	42
884	54
3022	92
360	46
428	52
60	20
290	38
390	38
446	46
322	42
76	28
160	28
342	38
158	30
644	52
346	46
320	24
710	54
152	28
184	36
226	42
870	62
584	48
374	38
698	56
458	48
158	34
252	28
2160	90
306	30
94	26
94	22
328	44
146	30
636	42
42	14
340	40
274	50
286	54
220	32
196	36
324	44
460	40
78	26
242	30
390	42
100	28
330	38
482	34
52	28
376	46
72	32
346	46
328	36
620	58
568	50
294	38
66	26
40	24
102	22
454	42
476	56
250	30
110	30
66	34
19	7
584	52
212	32
346	38
66	18
196	28
434	46
322	46
1546	84
19	7
374	42
694	58
202	30
226	30
432	54
94	18
556	50
308	38
224	40
116	28
240	28
334	42
604	60
424	52
50	26
364	44
70	22
86	34
398	46
936	60
258	38
180	36
110	34
324	40
686	50
168	38
144	32
120	32
464	52
3548	122
318	38
246	38
394	50
138	26
806	70
120	32
194	40
56	24
1096	70
842	60
416	46
504	40
138	26
168	28
182	24
1258	74
186	26
450	42
416	50
528	56
198	34
906	78
582	54
228	44
396	50
26	26
908	56
1192	72
366	46
360	48
206	26
114	34
588	50
540	46
498	54
382	48
384	44
274	38
974	68
338	42
570	46
318	48
314	34
412	52
482	42
586	56
314	34
126	22
1300	88
370	46
1746	76
314	42
516	60
202	26
224	40
238	42
128	32
1782	88
104	32
210	26
56	20
94	26
620	52
142	30
302	38
802	50
344	46
164	36
110	18
170	22
594	54
124	36
860	74
402	50
410	44
1122	76
222	30
650	62
220	32
258	38
164	36
766	62
714	58
230	42
726	54
380	56
154	26
462	44
1084	56
230	38
240	26
488	44
868	54
500	52
1926	74
230	38
920	72
552	42
340	44
112	24
88	32
98	26
148	24
436	44
318	46
1002	74
954	76
318	42
314	34
86	22
108	36
406	42
76	32
356	54
42	22
346	50
188	42
222	38
162	28
178	38
218	34
822	62
328	44
252	40
670	60
1640	80
164	32
340	44
178	34
276	40
368	36
132	32
282	38
284	40
78	30
240	36
182	34
604	36
268	44
302	40
144	24
110	26
454	42
82	30
498	40
738	58
362	46
196	36
216	36
232	44
72	24
196	28
414	42
264	40
272	42
264	48
1282	70
244	38
280	44
128	28
174	30
322	46
406	54
816	66
916	60
868	60
202	40
622	52
302	32
284	36
1208	68
392	40
1336	80
300	48
412	36
230	32
422	58
126	26
1088	68
272	54
832	64
88	28
40	16
62	14
396	48
436	44
272	44
512	48
834	54
678	66
190	34
568	52
330	38
450	54
366	46
810	58
208	36
650	54
364	52
238	46
928	80
622	42
378	38
526	50
152	28
234	26
308	52
156	32
38	14
848	58
538	58
280	46
274	34
1242	76
158	30
292	40
154	34
42	14
222	38
228	36
252	40
106	34
334	38
504	36
106	30
232	36
338	46
520	52
1018	66
348	36
252	32
560	48
156	36
354	46
876	52
86	26
338	30
110	26
376	48
426	42
430	42
238	38
460	48
118	26
794	54
140	24
212	32
220	40
1038	68
334	50
100	28
2272	96
86	26
780	40
720	56
244	44
416	48
312	52
256	48
320	36
446	56
218	40
310	50
1940	88
336	40
244	40
108	20
118	34
142	30
28	24
288	44
216	36
918	64
210	50
300	44
122	26
378	42
522	52
350	54
76	20
202	42
148	36
660	56
120	36
260	36
116	36
118	26
398	34
374	42
550	58
290	34
262	34
490	44
92	24
168	40
120	28
262	44
234	38
404	32
46	22
216	36
226	30
224	32
60	20
252	32
160	36
46	18
78	26
152	28
42	26
170	26
310	46
114	34
470	46
724	66
322	34
168	36
574	60
224	36
408	40
202	30
82	26
196	40
298	38
164	28
280	36
370	34
134	38
240	38
528	44
524	56
226	26
498	50
392	44
322	50
86	26
316	44
932	62
56	24
96	24
164	36
290	42
412	44
1366	82
386	50
524	60
196	36
498	52
422	46
136	32
290	42
74	34
1184	80
466	46
72	20
138	34
250	46
486	58
172	28
286	44
404	46
610	64
190	34
406	38
2100	90
980	72
408	54
262	42
190	38
138	22
206	30
162	30
178	34
212	28
2104	86
280	38
352	34
646	62
400	46
936	60
38	26
174	42
332	40
208	36
120	28
448	46
234	34
100	24
866	52
92	28
1148	64
120	32
284	36
844	68
128	28
136	36
70	18
760	56
160	24
614	38
456	52
84	24
424	52
408	52
296	38
224	40
284	28
194	38
82	22
298	52
210	42
134	30
108	24
412	44
398	50
140	34
166	34
290	42
132	32
770	52
2214	90
748	56
202	34
562	50
286	38
458	46
184	32
694	62
140	28
468	52
338	46
338	40
70	30
1948	88
728	52
590	54
556	60
344	42
510	58
652	48
202	36
676	56
76	36
264	36
92	24
330	42
78	30
104	28
148	28
60	24
88	36
32	24
198	22
216	40
340	38
146	34
84	24
308	44
456	52
344	32
150	30
218	42
274	46
40	24
252	36
324	40
198	38
232	28
392	50
336	48
126	22
286	38
400	40
222	34
886	72
332	48
510	52
654	44
1086	58
258	42
90	30
3308	88
154	26
204	40
52	28
320	44
196	30
324	40
86	30
200	36
390	50
176	28
574	60
276	44
168	40
438	46
192	32
196	36
170	30
562	50
120	32
100	20
358	42
648	66
174	38
1436	78
214	34
686	58
248	44
740	60
328	40
166	34
712	58
236	40
198	34
112	36
818	50
22	22
640	52
612	46
654	56
360	40
364	40
394	34
376	56
204	32
380	46
386	54
226	30
376	42
612	44
622	58
270	34
1462	82
66	26
280	48
422	42
336	44
324	36
600	60
142	34
318	42
124	24
282	42
1418	74
502	54
302	34
380	40
180	36
172	28
172	24
390	46
796	64
204	36
320	52
472	48
104	24
878	70
428	44
84	36
372	40
162	30
402	42
284	36
400	44
590	60
218	38
112	28
676	56
118	30
192	28
302	30
984	68
174	30
308	44
520	48
84	28
474	54
422	38
252	40
752	60
400	40
74	26
356	40
70	30
1124	62
210	42
280	28
1756	86
344	28
246	46
178	34
232	44
38	22
266	42
622	46
830	54
186	38
328	32
128	32
208	28
458	46
108	34
128	24
604	50
156	36
340	40
92	24
44	26
68	24
190	22
378	40
726	58
168	44
328	40
632	48
488	50
192	28
64	24
760	48
122	38
602	46
3748	106
1360	92
248	40
68	24
108	28
584	48
284	32
308	40
50	22
4618	118
164	24
286	42
216	28
108	28
514	50
174	34
502	52
664	60
158	42
242	34
312	32
66	22
604	44
166	30
504	48
794	56
362	46
294	46
160	28
308	48
338	46
576	58
184	32
310	36
96	28
350	30
212	32
342	40
352	48
94	26
298	38
882	66
116	28
1176	68
48	28
38	14
548	40
210	26
396	40
308	44
104	24
186	34
528	60
526	48
116	24
298	38
332	32
64	20
184	28
342	38
184	36
204	28
192	36
256	40
78	30
130	34
340	40
258	34
396	48
476	56
294	36
752	60
252	24
228	34
334	46
102	26
106	22
298	54
666	54
154	38
220	40
2060	84
262	42
112	36
34	14
250	50
168	28
42	26
64	32
222	34
198	38
434	46
378	46
172	32
144	24
150	42
74	46
44	20
688	54
894	50
598	54
1430	80
476	48
190	30
206	34
550	50
122	22
328	36
654	50
2390	104
22	22
472	56
418	50
156	32
2506	92
566	50
170	42
484	48
428	48
160	36
200	30
184	32
212	34
646	60
522	54
398	42
342	34
218	30
822	62
304	40
532	60
632	52
638	54
1504	82
160	28
446	34
156	24
1512	74
28	28
254	36
218	34
66	26
162	32
74	22
384	52
324	46
122	26
248	32
114	18
1342	58
342	42
228	36
362	44
846	58
212	32
330	34
590	34
202	38
112	20
282	46
312	40
6394	152
204	34
698	54
320	44
260	34
384	40
1124	76
256	40
292	38
486	50
230	32
274	38
206	46
244	32
66	26
204	28
224	32
424	52
54	14
810	66
246	42
112	38
216	52
322	50
200	32
232	32
384	40
214	42
250	54
140	32
374	46
124	32
2922	106
470	54
470	44
322	46
1286	64
66	22
60	20
136	24
424	40
128	28
34	26
214	30
378	36
328	40
110	26
266	34
214	46
440	56
218	34
174	26
740	54
704	60
3562	100
176	20
250	38
554	50
1526	78
562	44
392	56
268	32
146	30
444	48
128	28
312	36
246	30
852	72
322	34
164	28
664	44
628	54
542	48
810	64
506	46
116	24
134	22
82	18
496	60
366	42
252	40
480	36
416	46
22	22
160	28
108	32
58	22
178	38
38	22
90	26
520	48
1270	78
198	38
382	38
186	42
82	22
68	24
72	28
282	38
202	30
586	44
154	30
156	28
188	32
126	30
430	50
540	56
730	52
170	34
1912	90
192	28
1546	84
238	34
178	24
110	20
590	58
434	54
44	24
458	44
50	18
222	30
322	42
332	44
258	34
326	34
356	44
456	40
474	52
128	36
224	30
246	38
66	30
222	30
264	36
738	56
120	28
564	56
196	34
240	36
90	30
212	40
326	46
866	54
176	32
126	26
584	56
198	34
100	28
406	46
300	44
102	28
224	44
388	46
230	34
190	30
88	26
1464	80
574	46
544	56
82	26
152	32
292	32
228	34
226	36
174	34
648	56
90	26
326	42
108	36
358	50
172	32
164	28
508	50
192	36
204	28
590	52
152	24
728	68
64	24
198	28
228	38
236	32
386	42
150	30
442	52
840	72
790	58
762	46
278	30
196	40
148	40
334	34
3754	116
200	36
154	38
76	16
184	40
236	40
438	54
186	30
206	34
272	36
294	38
182	38
478	46
230	32
765	50
856	68
38	14
414	36
110	34
748	68
284	32
62	34
314	42
170	28
160	32
320	44
636	62
224	36
288	40
266	30
204	32
316	44
362	52
232	28
334	42
292	44
104	24
134	30
164	36
86	22
158	26
172	24
44	20
418	44
740	62
968	62
276	40
144	28
208	36
224	40
106	26
446	46
50	14
550	48
398	42
264	34
134	28
338	54
176	40
1002	62
412	44
136	32
178	38
238	42
214	26
256	36
128	32
178	34
478	38
192	32
606	70
420	48
316	44
190	34
92	24
308	46
1042	78
226	38
474	50
202	34
116	24
268	36
224	40
22	22
212	44
312	40
66	26
560	52
628	52
82	26
460	56
412	36
218	34
242	28
392	28
604	50
48	20
278	42
498	46
124	28
216	28
126	26
378	46
722	62
264	40
988	54
100	20
3054	106
350	44
386	42
254	46
1352	50
294	46
150	36
508	44
420	44
998	58
168	32
136	24
204	40
292	36
370	42
258	38
210	40
566	50
198	30
80	34
294	38
358	46
3552	114
136	30
464	44
126	34
360	44
262	32
340	50
116	32
510	46
42	18
238	38
200	40
172	32
182	34
2716	98
94	22
218	38
312	44
216	36
416	40
152	24
416	40
62	30
428	60
1584	72
576	48
184	36
282	42
364	32
180	44
206	38
758	54
340	36
19	7
142	30
138	26
38	30
218	34
104	20
372	48
190	26
356	38
194	30
238	42
202	30
106	26
520	52
62	18
684	60
144	28
398	50
474	46
452	44
394	38
482	58
568	48
98	18
60	24
68	16
682	58
506	54
226	30
120	24
350	40
504	66
454	52
132	36
126	20
1320	82
960	64
532	48
360	42
92	32
228	44
800	50
166	34
84	28
208	32
56	32
68	16
66	34
952	70
468	48
962	54
174	38
752	56
322	36
346	50
482	60
60	28
148	36
300	48
310	42
190	46
386	38
146	26
326	44
24	24
348	54
254	50
176	40
264	36
486	40
392	36
214	30
618	62
322	46
372	40
298	30
726	50
174	28
122	30
992	68
460	60
202	42
276	52
950	70
146	34
552	52
1122	66
284	36
188	44
118	30
174	30
130	22
66	26
90	18
270	30
298	42
174	30
336	44
1176	68
46	22
316	52
458	46
250	44
1042	68
272	32
200	40
634	48
464	56
448	40
208	36
534	50
488	50
232	46
96	28
262	42
404	52
566	54
132	22
208	28
348	48
288	40
702	62
86	26
64	24
82	26
324	38
50	26
278	46
180	32
440	46
360	40
210	26
250	42
110	34
96	40
400	44
500	48
526	54
116	36
458	54
572	52
313	38
116	32
908	56
150	26
102	30
910	64
414	50
438	48
1242	70
322	34
776	64
338	46
350	46
132	36
356	40
472	48
932	60
416	44
726	66
400	42
218	34
70	26
680	56
524	52
290	34
244	40
216	28
254	46
706	58
886	58
192	28
152	32
88	28
1128	72
246	38
308	44
912	60
42	14
470	38
360	48
74	26
354	54
112	28
110	22
180	44
372	40
188	36
124	32
156	28
166	34
608	52
200	28
266	30
332	40
96	18
418	44
134	38
948	72
778	62
1018	78
342	34
276	32
210	34
326	50
182	34
572	48
236	28
112	28
242	38
166	30
224	32
98	22
270	30
366	46
137	26
70	34
250	38
300	40
564	58
54	38
146	34
354	36
96	20
19	7
326	38
206	34
284	32
2268	100
278	34
392	36
170	34
138	26
350	42
326	36
616	72
180	30
19	7
656	56
92	28
298	38
222	26
274	46
140	36
162	34
160	32
210	34
278	38
372	40
918	66
104	20
250	46
496	60
494	44
44	12
88	28
224	36
222	30
334	42
1072	60
218	34
112	28
316	42
472	46
648	62
118	30
674	62
212	32
74	26
480	48
686	74
330	42
620	62
170	30
58	18
158	46
116	32
694	54
56	24
600	48
312	40
644	48
182	30
242	42
98	26
220	32
74	26
346	42
170	38
544	52
350	38
216	26
44	36
1152	72
86	30
880	60
1120	68
214	34
98	30
190	38
330	34
260	40
492	48
170	30
134	34
438	50
212	40
334	42
224	36
178	26
324	48
174	38
580	54
364	40
128	36
156	32
776	62
382	46
206	38
242	38
264	40
692	60
362	50
272	40
566	46
300	44
114	26
182	34
46	30
28	28
232	36
612	52
402	54
102	30
776	48
436	40
692	56
216	36
612	56
40	16
58	26
192	34
764	52
190	30
358	50
110	18
130	26
292	44
476	46
132	28
88	20
356	40
118	22
506	56
308	36
70	30
68	24
186	34
166	30
310	46
452	40
3674	120
704	60
232	44
536	46
78	30
198	34
288	36
882	66
262	38
780	60
764	50
126	22
114	34
88	28
232	32
692	56
1544	72
86	30
420	52
316	32
1282	78
150	34
374	36
120	32
66	34
194	46
300	36
205	25
194	38
246	46
410	38
660	54
328	38
128	26
208	48
514	42
772	64
2253	93
182	24
122	30
728	54
68	28
128	30
186	34
858	70
1520	68
96	28
244	44
2120	90
418	54
168	28
1010	64
264	32
142	28
374	50
878	56
30	22
242	34
630	54
228	44
154	30
234	40
316	52
300	40
546	44
58	18
240	36
518	44
60	20
1324	76
524	50
68	24
516	52
792	54
94	22
200	44
566	48
100	26
306	34
204	40
168	36
596	48
294	42
522	50
68	16
244	48
382	50
522	50
54	22
382	42
56	24
296	44
464	48
398	40
220	32
750	66
188	32
442	38
360	44
216	36
34	26
154	30
290	30
140	24
444	38
1092	74
392	44
1004	76
790	66
628	52
128	48
58	18
556	54
60	28
110	30
572	62
548	50
686	52
200	32
312	44
176	28
148	32
476	40
442	50
178	34
700	54
158	34
52	28
220	48
204	32
1086	72
644	62
292	34
202	30
552	42
642	62
260	32
1674	70
1280	72
698	46
404	40
1944	88
32	24
542	46
320	36
72	24
19	7
100	28
1428	68
508	52
66	38
214	44
26	26
806	54
80	40
158	26
658	66
198	22
4416	124
246	30
714	58
150	30
1082	74
342	34
1206	60
116	20
718	66
1666	82
1232	68
302	42
202	26
1038	58
152	40
498	50
1118	74
164	28
604	52
172	24
168	34
270	46
556	48
162	30
116	28
854	72
294	34
192	34
168	32
356	46
294	34
298	38
368	40
722	62
500	56
168	36
526	48
1720	72
480	56
166	42
558	50
282	34
492	48
2482	106
628	56
648	56
320	48
306	42
34	14
410	54
88	16
148	28
1048	72
414	46
570	50
196	28
366	34
160	32
76	22
448	40
650	50
178	34
66	26
146	32
178	34
576	52
272	32
2622	100
256	36
130	26
108	20
186	30
94	30
244	40
190	38
450	42
702	50
164	32
708	60
788	58
52	20
142	34
168	32
1644	80
762	52
234	30
386	46
314	34
216	28
338	42
402	46
86	30
568	54
130	28
296	40
306	34
264	40
388	48
144	28
202	30
714	54
660	50
542	56
96	20
688	48
306	42
196	40
476	52
258	34
206	26
178	30
1028	52
58	14
140	24
66	34
266	42
478	48
406	38
192	28
274	38
290	38
408	52
260	40
258	44
138	34
156	32
482	58
340	40
5792	146
122	26
430	48
82	22
390	42
498	54
94	22
156	36
332	40
102	22
64	20
1044	72
108	20
306	38
222	34
204	40
84	20
126	26
428	44
652	64
756	64
180	28
52	28
402	46
106	18
322	42
160	32
106	30
268	32
56	24
274	46
908	72
156	36
228	32
90	30
82	26
262	38
120	28
110	30
324	44
454	42
134	42
162	44
758	68
438	40
202	38
430	54
118	38
420	40
116	20
110	30
184	36
486	50
346	42
256	38
404	48
19	7
134	34
1050	60
604	62
420	52
86	26
280	36
1212	74
304	32
134	30
152	36
344	38
286	38
144	30
554	52
150	26
682	46
330	46
234	28
94	34
208	34
142	34
344	36
19	7
676	52
750	42
238	38
1038	56
216	24
230	30
396	48
306	26
106	22
1424	70
106	26
828	44
414	36
1032	66
526	58
106	26
94	26
216	28
120	32
172	36
194	38
128	32
550	54
454	50
332	38
62	26
120	28
624	50
138	30
458	40
94	28
1456	72
148	32
728	60
490	54
208	36
402	46
634	42
166	30
294	30
316	44
208	36
466	58
44	28
82	34
30	14
348	36
110	26
19	7
404	50
110	34
96	24
106	24
244	40
304	44
352	40
148	40
150	30
66	26
456	44
336	40
150	30
400	48
58	26
242	46
2316	104
208	42
378	42
294	38
138	34
1014	80
550	42
500	52
328	44
184	38
914	62
90	22
74	26
388	36
72	24
144	28
672	64
252	40
332	36
636	68
464	48
258	40
478	50
696	44
386	38
170	42
98	34
140	36
324	44
92	20
668	48
200	32
160	32
564	52
248	44
190	30
786	56
544	52
240	40
76	24
86	26
110	26
196	36
102	26
990	62
86	26
106	22
714	58
768	64
230	34
190	38
186	34
148	30
624	56
226	38
246	34
114	28
412	48
218	34
488	56
1416	76
348	28
234	38
390	50
496	50
344	48
142	22
252	48
150	42
128	44
144	40
134	26
594	56
144	32
182	34
224	36
268	44
96	28
586	52
142	36
48	28
634	56
160	32
192	36
46	22
266	34
1060	66
892	48
824	62
1040	64
854	58
68	16
134	22
256	40
258	42
504	48
184	32
218	38
234	38
174	26
122	30
418	42
314	46
314	30
414	50
172	28
454	46
388	48
274	38
190	26
736	56
150	34
222	42
54	30
750	54
134	32
426	46
222	34
302	42
54	14
526	54
418	56
88	24
126	30
220	32
204	32
244	28
168	32
304	28
38	26
174	26
336	40
214	38
1092	50
158	30
186	22
236	36
340	44
350	36
158	50
120	28
526	56
208	40
344	42
228	44
770	56
54	14
314	32
280	48
362	46
266	42
376	38
508	52
232	40
330	50
88	28
598	46
138	38
212	40
170	38
124	24
92	24
122	38
248	48
184	28
470	48
1144	64
462	50
294	38
76	16
128	24
240	36
182	34
224	42
108	36
722	66
66	22
1120	70
324	50
194	38
324	48
404	36
678	54
180	32
624	56
824	54
172	28
370	42
124	28
1920	88
428	44
464	52
538	46
176	36
242	32
184	32
216	36
106	26
796	56
432	52
122	18
278	42
1468	78
264	42
258	34
236	28
300	32
78	18
220	34
140	32
308	44
884	68
430	46
144	40
19	7
196	40
64	24
1076	76
162	30
138	30
409	50
310	30
198	42
128	24
182	38
444	44
246	30
386	58
270	34
818	46
52	16
82	18
220	36
110	22
44	16
516	48
1218	66
296	32
408	42
236	36
124	28
220	32
988	64
628	48
714	44
128	32
98	30
120	28
196	40
270	34
290	36
422	42
1426	74
126	30
106	28
118	34
144	36
92	28
66	26
728	60
236	36
898	66
326	42
272	38
194	22
318	38
214	28
576	56
854	54
186	26
244	32
42	14
156	26
742	54
260	36
232	48
400	44
182	34
204	28
326	46
462	62
338	54
142	38
304	40
592	52
482	46
312	32
66	30
130	26
704	60
720	64
172	24
124	28
140	24
608	56
234	38
354	34
418	46
138	34
98	30
250	38
46	18
806	60
76	24
266	46
274	38
694	54
680	60
238	34
460	48
126	38
342	42
246	42
768	58
382	34
480	38
436	44
420	44
446	38
96	20
350	56
1050	68
512	44
184	28
200	32
230	34
198	38
184	40
52	16
26	18
514	50
194	34
422	42
142	26
126	26
860	64
228	36
182	36
58	14
702	62
6262	144
70	26
30	30
268	34
266	46
332	50
562	58
316	40
132	32
208	30
250	38
74	26
290	30
424	46
470	50
516	56
90	34
176	36
130	30
124	32
506	54
492	36
493	37
1212	84
140	32
166	38
154	38
326	44
182	30
266	38
242	34
256	28
684	60
66	30
262	38
298	38
302	34
72	28
486	46
24	12
98	34
926	70
172	28
136	24
202	34
208	36
380	36
548	48
282	46
358	46
534	50
258	42
210	42
112	24
192	32
132	32
710	58
132	26
340	44
288	52
162	26
1040	76
74	26
108	36
110	30
164	32
122	30
166	30
174	38
450	54
1216	58
546	48
56	20
254	34
540	56
402	50
212	44
336	40
19	7
228	24
182	18
234	38
126	30
186	26
1130	62
118	26
194	22
414	46
94	26
194	30
258	38
62	30
178	38
94	30
76	32
50	26
478	54
98	30
1010	70
118	34
92	28
474	50
616	48
19	7
352	36
314	34
68	16
538	54
164	32
590	62
394	46
180	36
64	32
94	18
330	42
222	30
682	54
150	30
160	52
148	32
598	50
236	40
232	40
242	38
336	44
268	32
226	42
406	46
686	54
388	36
946	64
72	16
346	38
346	58
162	30
878	58
132	24
386	46
176	24
554	46
148	24
28	16
388	36
428	44
264	36
490	54
92	24
666	60
318	38
332	44
1086	78
382	42
410	38
284	44
50	26
182	30
220	32
736	60
142	30
110	22
110	30
352	42
1454	70
234	38
224	42
184	36
560	52
210	30
307	39
372	48
1684	78
848	50
208	44
292	44
96	28
556	48
414	38
148	28
434	48
210	38
96	16
322	38
1116	52
620	56
120	32
214	46
944	60
1842	88
346	42
372	32
522	46
468	44
270	26
430	34
50	26
104	30
394	34
252	34
194	34
202	34
36	24
842	52
262	38
436	50
364	46
710	66
152	32
724	64
94	26
352	54
552	40
210	36
554	40
784	50
196	32
314	42
472	48
46	14
658	60
534	46
328	40
180	32
162	30
104	28
502	50
700	48
194	38
398	50
158	34
214	30
288	44
448	38
80	20
116	24
424	40
816	58
530	46
234	34
254	42
304	48
170	34
834	56
186	34
158	36
842	58
540	44
58	34
106	26
96	20
422	44
150	34
318	42
492	46
104	36
344	40
70	14
428	46
278	26
1382	80
54	26
896	60
202	26
262	40
332	42
178	34
298	34
543	46
318	50
814	60
324	40
1138	70
266	34
168	28
172	32
206	42
258	30
750	54
306	34
98	26
60	20
554	54
54	26
44	28
68	28
182	34
152	36
858	70
592	52
888	64
96	28
186	30
660	64
118	26
1504	76
2230	98
734	62
202	32
334	38
348	44
294	52
182	42
28	20
2873	107
310	50
68	32
274	30
282	32
94	26
336	36
502	36
228	24
284	40
368	48
790	56
98	24
68	28
210	38
1048	72
430	46
38	22
42	22
604	54
212	30
794	58
334	44
338	44
198	38
298	38
398	54
170	24
692	60
276	40
404	48
316	44
776	56
488	40
142	22
400	52
40	16
284	36
288	34
68	16
434	44
308	42
298	38
210	26
246	34
242	34
568	56
206	28
208	40
346	38
22	14
286	38
98	18
604	48
142	34
286	46
216	32
378	62
406	50
236	40
138	34
90	26
342	38
1050	70
314	46
342	48
322	42
118	38
616	50
474	46
220	44
278	38
286	44
452	52
1654	90
62	18
476	36
458	44
508	52
248	28
498	50
282	38
90	22
244	38
524	60
504	44
274	38
480	56
832	60
204	36
646	58
1020	62
182	34
1926	88
132	24
438	46
258	26
474	52
142	26
190	34
470	50
146	18
332	44
134	26
332	44
184	28
468	54
378	38
452	48
64	20
38	18
288	48
102	32
438	42
160	32
328	40
276	42
38	30
216	32
90	34
58	22
62	22
72	32
298	38
94	26
170	26
110	26
154	30
322	38
174	26
196	28
272	44
336	44
102	30
462	52
330	42
436	40
966	62
140	34
230	42
396	44
382	38
184	32
554	58
554	50
418	50
604	60
374	40
254	38
834	54
328	44
160	28
84	36
114	30
274	34
108	24
186	38
710	70
394	34
480	56
350	30
294	50
378	54
306	42
66	22
298	40
422	42
354	34
150	38
56	24
1826	80
528	44
440	50
150	38
140	24
1144	66
456	40
244	44
154	42
200	40
876	62
148	32
278	34
964	64
564	36
232	28
82	20
950	74
322	34
380	48
1614	70
220	32
602	38
404	44
230	30
184	36
664	76
270	34
192	28
420	44
568	52
764	64
604	46
538	58
164	28
740	48
124	32
168	30
532	52
672	56
62	26
630	50
292	44
186	34
402	42
204	34
494	50
534	56
536	48
454	38
310	50
294	34
624	56
86	24
142	38
207	40
616	64
1050	70
184	32
614	54
158	26
404	52
126	30
342	36
210	34
222	34
188	30
1006	70
140	32
216	36
108	24
60	20
104	28
174	36
78	26
44	28
422	44
126	38
460	54
110	30
142	30
238	38
886	62
164	28
1816	80
88	28
300	38
114	26
138	34
440	44
210	46
424	40
368	54
410	38
426	46
326	34
102	34
46	18
80	16
188	26
288	40
494	46
260	32
352	46
126	42
498	46
788	56
64	24
232	44
428	44
234	26
336	36
584	60
296	44
142	30
46	22
96	28
248	24
40	24
332	40
294	42
90	18
466	54
196	36
472	56
210	38
364	54
290	30
596	60
1062	60
194	30
330	34
656	54
300	40
390	42
352	52
178	42
182	30
186	46
856	56
200	36
310	42
328	36
86	18
636	52
276	36
183	36
660	56
142	26
792	64
294	30
248	36
1978	84
340	52
312	42
352	36
228	32
286	46
228	30
190	38
1072	72
470	46
190	34
504	48
4201	125
220	38
400	54
400	40
926	50
468	48
164	28
140	40
200	32
164	32
674	52
336	44
314	34
90	26
266	36
588	48
342	42
498	42
246	26
134	34
150	30
170	34
1580	76
738	54
1142	74
352	48
472	54
284	52
164	28
468	40
172	28
72	32
388	40
164	40
284	52
166	28
796	54
326	42
352	42
432	44
288	44
256	32
2710	94
316	36
256	36
320	40
234	38
488	52
132	32
278	48
438	46
150	26
120	36
392	52
336	54
224	36
346	40
398	44
612	52
434	32
22	22
448	44
250	42
220	44
892	64
184	44
202	42
584	52
76	28
374	46
290	46
408	52
68	24
430	50
374	38
804	60
234	38
352	44
112	28
46	14
254	42
184	40
104	28
84	28
276	36
210	46
144	40
166	26
940	68
402	48
158	28
214	22
400	40
204	24
92	24
456	48
524	44
268	28
242	46
982	68
148	40
96	22
98	26
360	36
148	32
102	26
396	44
538	54
392	44
252	36
50	28
292	38
158	38
602	46
228	32
98	30
200	40
710	58
100	28
638	50
186	36
136	30
318	42
624	56
306	52
166	30
264	40
364	48
274	38
352	40
460	44
210	30
402	46
1072	84
382	52
332	44
612	50
142	30
194	34
295	40
276	42
704	56
156	28
112	20
494	54
90	26
720	52
2670	108
614	44
662	56
206	38
720	60
358	38
340	52
320	42
44	32
520	32
404	42
216	40
258	42
768	62
146	30
328	40
876	62
570	46
308	44
196	36
1258	80
66	26
424	48
338	42
392	44
286	38
356	48
198	38
664	48
788	48
282	38
276	40
462	58
777	55
498	46
1090	74
846	74
192	36
402	42
496	50
564	64
254	30
622	46
386	38
366	46
160	44
78	22
194	30
556	56
132	36
172	36
396	44
260	48
200	36
90	30
378	48
958	62
606	58
164	36
190	26
178	38
310	42
38	22
358	46
262	30
318	46
478	38
148	28
884	60
192	40
98	30
178	30
242	42
96	24
326	46
250	38
1348	80
124	24
182	34
46	16
698	54
224	28
252	36
228	32
358	46
260	32
360	36
588	52
310	40
432	40
138	30
316	40
556	40
28	20
528	44
1964	76
112	28
316	44
744	60
152	28
44	20
358	38
742	54
74	18
306	42
154	26
406	42
284	40
178	26
134	18
270	44
26	26
484	54
132	28
184	28
114	26
716	72
428	40
208	28
108	24
488	52
252	36
138	34
1102	58
144	32
372	52
336	44
826	58
100	20
382	38
150	34
152	32
466	46
594	42
180	28
128	28
156	32
234	42
206	32
236	40
130	34
108	28
134	20
450	50
74	22
116	22
68	28
716	48
408	52
68	32
376	32
478	54
964	64
474	50
218	26
1670	86
156	44
150	42
162	30
38	38
1784	86
106	26
496	48
118	22
142	30
338	46
1046	66
244	40
70	22
742	66
296	40
170	34
196	34
426	42
268	44
148	28
68	24
344	42
448	28
328	36
86	26
206	42
184	36
36	28
836	60
842	66
170	30
30	14
834	58
488	44
166	34
334	38
352	44
314	42
424	36
384	48
202	34
154	42
128	32
338	36
1026	74
224	40
782	58
238	42
486	46
90	30
180	32
283	42
158	30
264	28
128	20
266	42
304	40
538	50
320	40
96	24
132	32
696	56
824	76
100	28
842	54
40	24
130	26
58	18
166	34
366	46
328	44
62	26
344	44
148	40
92	24
118	30
334	50
322	38
1844	80
282	42
164	32
802	46
462	46
322	38
614	64
152	40
34	26
182	38
212	28
120	24
282	36
144	32
388	48
334	34
902	62
252	44
76	28
812	64
110	18
786	62
416	44
660	52
114	24
160	32
526	50
196	36
630	56
1934	98
186	32
150	30
532	54
280	40
100	28
520	52
104	26
218	34
180	28
56	20
518	46
708	52
188	32
224	28
352	50
646	52
164	36
138	26
328	40
730	64
676	56
156	32
294	38
208	28
214	28
698	62
232	34
296	40
440	52
194	38
72	28
620	44
150	26
1214	66
156	32
374	30
214	30
302	28
66	26
58	22
380	34
430	50
1480	72
28	24
130	34
550	46
510	54
102	30
916	56
162	34
154	30
462	46
258	36
1432	82
216	32
492	48
140	32
94	38
812	60
864	52
866	74
172	32
152	32
532	44
610	54
400	44
104	32
374	42
106	18
480	44
110	30
532	56
262	38
184	28
192	32
1134	66
466	44
244	40
1086	74
236	42
310	46
484	40
282	38
518	56
128	44
1364	80
198	42
396	46
922	64
490	46
528	54
340	40
268	34
128	32
1186	74
318	46
614	44
178	26
92	24
272	24
120	36
288	36
310	44
260	40
66	30
180	36
224	40
96	18
592	66
426	56
330	42
178	34
76	28
208	32
642	42
390	48
140	36
366	42
236	36
488	50
182	34
674	56
19	7
338	42
1406	76
242	32
196	38
750	54
176	36
662	58
184	44
252	32
184	28
80	28
252	32
64	16
486	46
210	40
30	22
186	26
218	38
38	14
524	52
270	46
134	30
70	30
34	14
102	38
180	32
232	40
384	48
22	14
262	44
406	54
624	62
332	36
320	56
838	52
3104	100
218	42
622	54
334	38
142	36
354	38
278	34
238	46
246	46
66	18
124	36
660	60
198	44
620	44
1032	60
1288	88
104	18
300	40
390	38
24	24
290	26
134	22
730	60
168	24
330	34
102	26
166	26
158	30
312	38
2058	84
408	44
152	28
160	32
64	28
428	38
260	38
266	30
162	38
342	46
154	38
234	34
19	7
692	52
2806	100
366	54
160	40
310	46
736	60
114	26
800	72
246	36
172	40
250	40
54	32
472	44
430	42
850	66
359	42
518	54
240	28
326	46
304	36
252	42
19	7
378	38
650	68
122	30
170	38
348	48
112	36
168	28
344	38
880	56
502	48
180	24
610	48
344	48
500	52
56	28
168	36
250	34
314	34
214	30
500	46
220	36
676	60
64	32
158	24
494	44
176	28
228	34
444	44
238	34
854	58
62	34
248	40
230	46
306	40
422	54
258	30
414	48
404	42
1602	70
236	36
168	32
54	18
226	42
340	36
164	32
160	28
252	36
528	58
724	40
206	30
224	44
216	44
448	48
316	40
260	36
268	28
328	52
816	70
40	20
1362	72
143	21
144	28
626	58
422	50
180	36
370	36
60	28
300	50
108	24
1258	82
258	36
174	30
188	40
862	64
236	32
378	38
178	38
712	64
292	44
224	32
420	48
814	60
400	50
308	40
618	66
294	50
384	36
310	38
192	36
102	30
260	36
506	42
362	42
638	46
332	42
156	32
180	36
44	28
558	50
128	26
170	30
964	66
146	26
198	26
736	44
648	54
46	18
50	14
102	30
772	56
804	66
122	30
394	42
410	46
1106	66
34	26
190	34
88	36
72	28
2413	84
190	28
102	18
978	60
44	28
502	38
974	62
100	36
234	38
128	32
80	24
1204	64
94	26
194	30
376	44
1144	80
486	54
930	52
882	62
350	46
604	48
94	38
270	42
334	46
204	20
332	30
970	72
58	18
484	44
440	56
424	52
26	26
228	40
190	38
300	52
920	60
372	44
70	30
350	58
320	36
278	44
270	42
182	30
496	36
586	58
302	42
712	60
1258	82
330	46
242	34
606	58
118	30
438	38
130	34
128	20
240	32
170	42
134	26
714	58
460	48
192	36
638	62
846	50
526	60
480	48
776	60
426	48
176	40
362	46
146	34
128	28
488	48
122	26
134	30
614	54
124	28
302	36
140	24
236	42
118	38
190	34
42	26
940	76
184	40
370	50
332	36
476	56
338	54
174	34
144	32
310	38
100	16
202	42
244	56
94	14
596	56
156	28
488	52
608	60
360	40
862	62
442	50
736	48
102	34
50	14
404	50
938	58
268	32
80	36
326	32
148	36
128	26
956	60
304	40
184	32
694	58
202	34
284	44
472	46
346	46
410	50
922	62
536	52
162	34
894	66
292	44
368	52
224	36
406	42
92	32
292	56
740	60
172	36
126	26
150	42
202	36
692	44
444	48
402	32
556	44
132	24
94	26
236	40
200	44
158	30
1604	80
284	36
200	32
282	34
1084	56
320	40
824	60
150	30
366	50
140	26
444	36
118	38
904	44
568	54
170	28
518	50
770	68
298	50
176	32
268	34
112	26
268	36
114	22
144	36
124	24
19	7
926	58
308	36
340	48
646	56
92	24
94	30
152	36
874	64
94	26
264	36
174	26
204	28
100	32
284	36
376	42
110	26
168	40
148	28
406	50
130	26
414	50
188	32
662	50
140	32
68	24
244	30
110	30
204	32
310	42
450	50
160	32
328	40
262	38
368	46
698	60
284	46
252	34
1266	82
168	36
558	50
146	34
200	36
678	54
328	36
1052	72
292	40
70	26
204	36
194	28
384	40
334	42
538	46
264	44
342	38
374	44
582	58
324	48
1032	72
274	34
200	32
350	34
128	24
1722	86
84	40
64	24
558	48
110	22
336	36
686	52
306	44
1676	84
196	28
356	44
848	56
520	48
292	38
230	34
292	28
66	26
194	38
618	58
19	7
228	36
498	50
248	32
1690	66
222	30
752	58
656	60
346	46
466	50
42	26
944	68
980	58
370	48
112	20
246	38
724	56
204	36
656	60
688	64
500	48
340	46
72	24
19	7
174	38
166	30
256	36
2508	104
80	24
682	60
162	34
340	48
266	46
120	28
596	48
322	34
244	30
220	32
320	42
258	34
326	38
4944	134
42	26
120	24
214	46
116	28
242	44
588	48
66	26
470	50
378	42
306	46
538	50
324	36
82	30
128	36
312	32
1386	70
166	42
1032	72
140	28
128	32
120	28
298	38
955	66
118	22
58	26
612	60
242	34
156	32
1460	92
1056	76
340	48
478	58
196	36
206	30
338	38
462	58
252	30
1432	88
462	50
106	30
518	48
604	52
134	30
190	34
292	36
340	40
366	48
668	58
400	46
532	56
862	80
144	32
747	57
168	20
224	28
284	28
204	24
218	34
138	34
494	44
64	24
310	30
852	58
92	28
390	46
204	32
1356	60
298	34
140	28
96	24
256	40
402	36
118	22
170	38
228	42
502	54
236	36
438	50
232	32
60	24
112	36
404	48
254	38
134	30
512	48
302	30
154	30
184	32
1776	78
846	66
590	54
128	16
230	38
212	28
162	30
124	28
42	30
78	18
402	42
84	28
224	40
110	30
154	34
202	30
940	68
82	34
398	36
800	60
166	34
270	34
508	56
394	46
884	64
946	66
596	58
66	30
146	22
368	42
84	20
450	34
544	48
24	24
1032	68
334	38
292	44
108	20
730	54
560	52
250	36
52	28
514	48
300	32
86	34
780	58
80	28
444	48
426	50
312	40
186	30
4394	126
302	38
1228	68
56	24
202	38
86	22
294	34
576	42
664	56
54	26
56	32
194	30
224	36
186	34
162	42
146	26
54	18
388	48
222	26
96	20
230	38
104	28
368	36
366	42
564	44
146	30
636	44
452	52
828	48
140	36
344	52
54	26
19	7
19	7
294	34
502	46
530	42
558	48
126	30
284	36
140	28
244	36
1114	66
352	40
356	44
978	58
122	30
142	34
222	34
526	50
774	66
372	44
1042	70
102	26
388	40
180	40
92	24
108	20
38	26
244	32
102	30
440	44
202	26
116	32
1156	72
764	66
218	22
306	42
264	36
656	48
306	38
330	46
358	44
548	56
314	42
472	56
212	36
414	46
202	38
494	50
100	32
520	48
312	42
290	42
360	48
246	38
342	40
164	32
694	50
184	32
306	42
104	24
192	32
186	44
158	50
1262	74
686	68
344	44
534	50
310	36
314	42
238	26
182	42
780	64
160	36
144	32
102	26
136	24
76	36
350	48
416	40
310	34
540	60
496	44
264	36
360	48
98	26
158	30
1342	78
572	48
78	26
146	22
488	58
162	34
660	58
790	54
388	48
198	30
40	16
748	44
76	24
150	30
62	26
378	38
246	34
260	36
72	20
236	44
156	28
666	52
178	34
266	38
94	30
228	36
602	58
750	64
444	44
212	36
506	34
114	38
102	26
142	30
42	14
100	36
308	40
210	38
390	50
212	36
256	48
784	64
1256	68
500	52
118	38
242	38
580	44
300	40
140	24
122	34
498	50
294	42
98	26
728	56
220	32
196	28
64	28
392	40
498	40
2698	90
302	34
590	54
300	32
316	44
342	42
170	38
158	34
192	36
104	20
118	30
262	34
226	38
154	46
222	34
264	24
230	32
680	48
194	38
430	50
922	62
586	48
258	38
148	36
19	7
728	56
326	34
944	74
276	36
484	40
104	20
1302	60
166	30
120	24
140	44
438	50
672	36
400	44
557	56
248	38
262	30
750	50
340	44
436	36
372	44
894	52
158	34
36	16
124	28
1262	68
170	30
794	52
96	28
268	48
448	42
486	58
192	40
674	52
262	36
630	48
188	30
84	24
574	54
358	46
172	32
198	34
270	34
234	38
96	28
88	28
944	74
428	44
740	60
142	22
144	28
54	30
84	20
186	30
570	50
848	52
204	28
196	40
52	20
502	38
352	40
672	52
120	28
2198	98
420	46
182	30
284	32
188	36
970	64
318	38
360	44
266	38
508	52
68	24
88	20
266	38
896	72
1284	80
126	22
112	24
738	54
362	38
144	28
198	42
1490	64
668	68
298	46
212	28
682	62
120	28
220	44
692	56
148	28
710	62
486	40
1382	82
1282	58
376	44
1084	62
492	36
314	46
54	26
196	52
76	16
98	30
284	44
192	36
528	54
444	44
90	26
76	24
1262	82
198	42
108	20
230	46
142	22
910	64
120	40
312	36
222	42
572	62
196	24
22	14
502	54
116	28
504	48
882	70
222	38
436	48
1296	78
452	44
336	40
308	42
184	32
500	40
322	40
136	36
756	62
626	58
312	52
80	24
130	26
250	30
268	46
192	32
278	38
76	24
156	32
506	62
146	26
752	54
294	30
196	40
162	38
272	42
126	26
100	24
252	32
382	38
62	22
436	48
142	42
136	30
170	26
2434	106
186	26
156	24
572	38
484	52
444	44
188	28
544	48
158	34
146	22
396	48
348	48
874	68
54	26
812	60
40	28
360	44
186	32
76	16
788	58
430	50
334	50
328	44
70	22
164	36
70	26
158	30
264	40
272	24
124	22
288	40
66	26
290	44
364	48
92	28
62	18
450	54
268	36
102	34
226	30
388	30
324	38
210	36
248	28
86	34
557	45
596	50
192	24
288	36
464	44
850	50
156	28
262	38
492	48
654	54
144	28
328	36
146	22
204	32
218	34
352	52
382	36
174	42
108	24
772	52
134	30
360	48
246	32
594	54
78	30
664	48
202	42
512	60
168	28
238	26
1216	68
292	40
230	34
392	44
592	64
104	14
226	42
158	38
266	38
172	32
410	40
338	46
112	30
476	52
364	52
106	26
98	30
212	28
220	30
668	44
74	18
338	50
990	60
160	36
206	38
98	26
112	28
208	24
390	42
82	14
476	36
228	36
520	36
68	20
322	40
246	30
2360	108
887	56
78	26
64	28
618	46
94	22
200	28
396	44
144	32
222	30
128	28
196	34
210	34
188	28
516	48
268	32
612	48
222	34
258	34
938	62
1018	56
142	38
380	48
564	56
208	36
418	46
404	30
578	50
480	60
94	22
122	34
562	46
728	60
110	30
264	34
1612	84
200	32
26	22
520	58
152	36
184	32
526	58
184	24
238	30
404	40
174	34
206	36
418	54
82	22
144	32
238	34
210	42
514	56
960	44
42	26
58	26
274	46
140	20
82	22
322	46
1632	84
1645	92
1212	60
280	36
96	24
3860	116
404	52
266	46
120	32
98	26
56	32
324	56
638	46
136	40
296	36
124	28
136	24
298	34
408	36
300	40
354	46
256	34
584	60
174	38
680	64
290	38
1058	72
338	50
148	26
40	16
166	30
1088	70
216	32
538	46
322	34
580	60
612	56
522	44
634	54
120	32
104	28
138	26
342	38
262	34
258	46
208	32
298	30
1440	78
280	36
176	36
744	46
258	38
126	34
178	38
438	50
706	50
210	38
72	22
64	24
478	46
222	42
400	34
62	20
82	30
1082	60
314	38
202	34
60	24
52	32
212	32
76	28
194	42
120	32
546	54
158	20
264	44
206	34
252	38
232	32
240	40
276	36
60	20
158	30
346	38
214	38
222	34
470	64
372	44
174	26
108	20
334	34
256	48
486	50
98	26
824	56
172	36
152	44
76	20
152	28
324	44
614	58
2032	84
332	32
186	30
244	36
36	20
396	48
232	32
976	74
136	28
554	50
446	50
156	32
608	60
286	34
158	30
518	52
306	42
900	64
596	38
568	64
1022	58
200	40
490	46
540	52
74	26
264	34
138	38
554	50
346	44
462	42
130	18
492	52
74	18
158	34
624	54
474	50
406	38
106	26
72	20
690	50
19	7
630	42
362	42
332	44
190	38
1372	64
218	38
286	38
1000	70
346	42
98	36
726	54
494	62
218	34
238	38
62	30
114	36
1510	66
156	44
130	26
348	40
976	64
392	62
358	38
178	34
342	44
164	32
98	22
224	40
592	48
470	56
256	36
768	64
316	42
194	30
72	16
232	40
874	70
258	32
240	40
84	28
370	38
1430	82
268	36
74	30
166	38
524	36
368	36
178	28
242	30
252	44
260	32
394	42
182	30
116	28
240	40
198	38
358	50
290	50
670	60
196	36
150	46
164	36
294	34
220	36
732	46
62	22
216	36
656	54
632	56
192	48
100	20
308	36
150	30
106	26
750	46
234	34
572	56
398	40
144	32
1010	70
246	38
124	44
354	50
270	34
36	28
268	32
232	24
178	38
376	42
66	26
200	36
62	14
128	40
58	26
144	32
164	28
216	36
130	30
294	34
330	44
30	14
336	44
198	30
62	30
210	34
202	38
320	32
200	32
336	50
732	40
162	34
188	24
146	30
624	48
614	42
854	64
270	40
136	30
158	38
700	54
222	34
1044	80
404	40
250	42
462	42
232	36
184	32
588	62
1274	70
106	26
144	30
398	40
988	80
168	44
532	56
258	48
212	36
172	32
104	28
342	46
436	48
498	54
174	34
322	34
374	38
1640	80
672	48
764	54
252	36
150	26
852	72
492	58
312	28
112	32
82	26
176	32
246	34
262	38
582	50
36	12
1142	76
134	30
636	58
414	44
336	40
168	24
158	34
166	32
252	40
96	20
140	24
970	70
396	62
136	32
108	32
548	52
276	40
914	58
64	16
38	30
1018	76
94	22
238	34
110	34
1848	84
370	42
42	14
266	24
322	48
372	40
162	30
386	42
126	34
344	40
2834	106
494	54
346	48
46	22
336	48
126	34
158	26
258	42
1216	80
368	36
350	42
180	32
204	36
842	72
166	34
134	26
292	32
192	30
80	24
136	44
418	46
1726	92
1044	68
68	16
318	38
218	30
726	54
52	20
30	30
278	42
270	38
306	34
276	40
260	32
350	46
314	34
376	44
324	38
250	26
440	52
188	28
208	28
430	50
1088	76
1032	62
1940	90
456	44
530	52
598	50
1114	68
474	40
274	42
246	42
156	28
216	36
114	30
68	26
168	24
746	56
198	34
364	40
110	26
240	28
516	48
240	44
72	20
52	32
298	34
1680	88
300	44
300	44
308	48
136	28
88	28
370	50
512	52
94	30
346	42
300	40
348	48
164	32
104	36
66	26
172	36
698	60
170	30
2660	108
196	32
208	30
350	52
154	34
498	46
120	28
168	28
100	32
400	40
660	52
184	32
78	18
518	50
692	62
400	48
290	34
300	36
148	28
2844	94
30	14
19	7
162	38
308	40
746	64
648	64
188	32
210	30
178	38
324	48
210	38
320	40
454	46
492	44
754	52
46	30
66	22
480	60
976	52
54	30
1200	72
58	30
206	34
256	44
190	34
482	54
288	44
464	44
208	44
832	68
346	42
194	34
134	28
152	32
466	50
112	24
452	40
850	58
364	44
294	42
48	28
616	46
158	26
198	22
314	50
272	44
258	42
120	24
92	22
486	42
400	40
496	44
224	36
796	56
284	42
496	62
408	50
290	46
102	26
238	26
368	44
546	46
274	38
132	44
210	38
690	66
388	42
480	30
620	52
118	18
410	50
802	64
778	50
76	36
322	42
810	50
100	28
19	7
618	50
352	48
220	32
208	32
928	66
156	32
244	32
278	42
194	38
80	32
3746	124
154	34
1342	76
1276	78
320	36
32	24
272	28
172	44
118	26
694	66
176	26
164	36
436	42
488	44
276	40
94	30
290	42
712	50
992	68
330	50
144	28
40	32
928	72
280	44
420	48
568	52
74	26
292	32
210	40
262	30
476	50
292	38
76	16
840	60
1530	84
208	52
210	30
896	64
110	42
202	26
922	68
96	28
1032	64
680	52
210	38
42	18
640	64
56	20
160	24
450	46
1558	72
66	22
176	36
102	30
210	34
892	60
88	20
192	44
448	56
286	42
322	42
866	70
414	50
60	28
508	40
78	26
120	32
556	44
112	28
118	34
206	38
118	26
306	34
144	32
712	62
226	30
52	28
1218	80
684	60
106	28
66	26
678	46
4053	124
100	28
502	50
638	46
172	36
142	26
1290	72
322	42
414	50
612	64
342	42
278	34
234	34
94	34
74	22
138	26
178	30
288	40
222	30
186	26
296	36
176	24
326	38
128	24
150	34
242	42
138	30
1014	76
214	38
588	42
146	34
524	46
132	32
160	36
62	38
390	40
86	22
186	38
92	28
82	30
82	26
92	32
258	46
400	44
350	46
374	46
368	48
1054	70
806	50
166	30
340	40
394	38
370	34
506	50
60	28
732	56
424	48
316	38
204	34
1222	70
42	14
42	26
156	32
380	44
19	7
270	38
515	43
108	32
318	46
752	54
86	26
134	34
416	48
324	32
19	7
290	38
328	36
150	34
324	36
224	28
144	32
668	68
178	38
2470	98
380	44
458	36
228	40
396	44
262	30
226	50
226	46
482	50
174	34
96	32
680	50
530	50
110	30
606	46
308	32
434	40
86	30
308	38
144	24
306	38
910	74
118	26
200	28
350	42
636	56
282	42
906	80
208	48
350	46
440	44
256	28
212	32
294	34
496	56
550	54
1330	68
254	42
102	34
298	34
420	44
296	44
152	28
86	34
34	18
292	44
308	38
258	34
98	18
128	32
244	40
128	40
88	32
92	28
500	56
210	30
656	54
856	64
86	18
788	68
936	60
154	34
118	34
320	40
262	38
128	36
204	44
236	24
722	58
60	26
88	24
240	40
1514	62
470	36
76	24
140	24
96	24
872	52
198	28
122	26
414	50
140	28
402	30
206	34
1280	88
222	30
610	50
122	22
104	28
748	54
192	32
858	62
106	26
98	30
116	28
1186	76
320	44
90	22
110	22
128	28
300	40
632	56
418	50
2414	96
1004	76
110	30
522	44
286	46
680	60
404	44
704	54
144	28
184	32
442	50
64	20
168	40
354	54
414	46
878	56
876	60
782	54
150	26
150	30
220	28
382	38
434	44
94	22
122	34
124	28
468	36
398	46
92	28
656	60
678	62
178	34
914	46
132	28
220	32
166	32
68	24
202	34
370	62
82	22
202	38
198	42
126	26
124	28
300	28
104	24
416	52
118	22
336	40
156	40
190	36
250	38
572	60
392	52
230	38
108	36
68	24
116	24
1260	78
304	34
54	18
404	52
144	24
1192	76
176	32
846	54
334	36
200	40
146	30
146	38
344	36
182	30
196	32
232	32
430	42
112	24
362	42
736	56
78	26
346	38
518	46
360	40
494	46
454	38
266	38
146	26
116	32
132	36
242	26
332	40
456	44
296	36
60	16
130	34
146	30
432	44
154	38
140	36
966	68
306	42
238	38
196	36
312	44
326	38
214	42
274	38
210	34
66	22
200	32
648	52
168	36
50	18
382	38
188	36
552	48
568	60
34	26
900	66
422	46
900	68
274	42
358	46
140	32
210	30
664	60
1604	76
92	20
586	38
380	52
580	56
88	24
126	38
496	48
148	32
54	22
186	32
868	60
432	40
312	36
274	34
180	28
154	34
374	36
174	38
582	52
404	48
180	24
186	34
252	38
85	17
386	42
196	26
198	50
296	48
264	40
662	50
142	38
162	26
68	32
164	24
356	48
294	38
170	34
110	30
290	38
252	28
100	32
394	42
156	28
500	44
90	30
754	44
372	52
388	44
78	18
580	52
834	52
1212	64
182	30
404	46
490	50
124	32
124	16
144	40
856	54
180	40
288	44
252	40
274	34
76	32
520	48
494	42
102	30
380	44
476	48
296	42
412	44
122	26
56	16
158	30
890	68
140	20
180	28
232	32
104	24
1498	78
142	34
294	46
290	34
286	46
314	50
324	56
74	30
566	54
112	28
130	26
258	42
1712	64
900	64
629	49
572	52
374	46
348	44
484	46
432	44
518	50
266	38
90	22
84	28
616	56
492	50
90	18
286	38
234	26
360	40
858	68
36	28
82	18
100	28
236	32
190	34
112	20
256	40
206	30
112	28
678	46
1178	66
1616	76
226	38
184	40
822	56
86	26
512	52
116	26
138	30
392	40
62	18
1088	62
88	28
382	48
1014	70
802	62
102	30
316	36
72	36
186	34
370	46
104	40
522	70
674	66
442	58
356	48
434	38
56	24
1050	62
166	34
874	66
306	34
1426	62
558	48
130	26
44	24
492	48
304	44
126	18
128	24
436	50
114	30
132	28
230	26
534	54
106	38
272	44
1106	68
784	68
308	46
814	58
2076	90
372	40
148	32
182	26
248	52
1394	70
638	58
162	30
100	20
70	18
992	76
526	56
154	30
510	46
410	46
174	30
256	40
60	32
96	30
302	42
258	38
316	40
70	26
176	32
110	22
36	20
362	42
376	48
156	40
272	36
1314	64
444	50
258	30
88	24
94	18
2206	80
580	48
198	34
136	24
268	44
58	30
438	42
716	60
734	54
204	32
34	22
262	46
708	56
44	26
756	56
1418	70
32	24
446	46
632	52
306	50
400	36
60	16
178	26
298	38
5302	130
46	30
406	42
822	74
228	24
86	30
184	28
396	40
146	34
842	66
734	66
136	36
1030	70
530	50
174	42
482	46
144	32
114	22
264	48
566	44
156	28
446	56
282	30
236	36
480	54
242	34
1064	50
358	36
1764	84
354	42
182	46
646	54
250	38
74	18
112	32
234	40
1508	86
150	34
256	40
426	54
986	66
246	42
156	28
1044	56
300	34
56	32
88	28
532	46
90	38
90	30
40	16
522	50
304	38
236	32
65	20
3574	112
650	56
152	36
334	46
574	52
96	36
82	22
118	18
974	66
198	34
174	42
158	26
64	16
254	36
878	60
124	24
244	32
138	26
356	52
158	38
190	34
272	28
1290	70
500	44
102	30
396	42
238	26
888	68
364	52
316	46
360	48
566	54
284	40
120	24
142	34
478	42
406	44
100	28
222	34
1446	72
700	52
56	20
90	26
19	7
92	22
402	38
626	46
84	32
90	22
778	70
220	36
422	42
3617	127
360	44
322	42
124	28
134	26
180	32
102	26
424	32
68	24
1098	74
338	34
178	42
234	38
54	22
132	24
146	38
160	36
126	30
1154	60
442	54
66	22
206	40
430	50
422	44
278	34
68	28
434	50
330	50
94	30
488	52
166	32
198	34
376	56
332	52
140	28
186	30
132	36
80	20
78	18
162	30
230	30
130	26
154	30
104	24
184	28
182	34
34	14
86	30
770	72
226	38
106	28
404	44
412	40
226	38
300	36
272	40
400	44
612	42
460	48
348	36
818	62
640	60
400	44
500	50
282	38
256	32
94	26
584	56
372	46
150	30
92	28
138	34
688	52
1224	70
376	50
248	32
22	14
178	38
344	42
542	56
186	34
628	52
466	46
3344	118
514	50
572	52
288	36
234	46
92	32
448	56
554	48
132	32
582	48
210	42
258	30
570	52
82	30
1126	82
72	32
274	42
182	42
62	26
354	54
136	32
402	58
428	46
462	42
90	22
834	60
78	30
420	38
36	16
772	56
380	50
296	36
272	36
226	38
2078	84
230	34
498	54
220	48
346	46
394	46
312	36
214	42
826	58
104	28
284	36
540	40
498	50
654	54
512	44
2119	93
142	38
42	14
66	34
322	34
140	40
1068	72
496	52
990	74
754	44
534	62
148	36
78	22
424	36
602	50
280	40
576	40
292	48
1146	62
242	46
552	54
138	30
94	30
874	70
608	48
682	54
88	32
1206	78
46	18
584	52
114	26
100	28
168	32
170	30
708	58
374	42
740	64
19	7
226	38
62	38
106	30
134	26
150	26
250	30
42	14
660	36
296	36
234	38
338	38
404	44
466	46
42	26
456	44
364	40
652	56
694	52
502	46
520	56
444	52
192	36
76	28
720	56
430	42
312	30
150	26
390	40
2676	90
1028	70
188	36
148	40
78	22
242	30
118	30
276	32
856	50
114	34
972	50
19	7
1232	78
372	36
230	30
306	46
92	24
442	32
608	44
612	56
92	24
1186	76
386	46
154	26
106	26
256	28
358	42
54	18
492	52
96	36
504	48
222	38
402	46
378	42
442	58
66	30
172	40
682	62
136	40
814	58
160	32
364	40
172	36
100	28
518	56
358	54
212	40
314	42
128	34
50	30
50	26
114	30
520	48
184	36
280	44
324	40
196	40
452	52
224	52
812	64
128	26
414	54
268	36
78	26
2326	92
62	22
230	30
190	34
186	38
104	20
182	42
188	30
358	42
158	34
232	38
248	44
1286	66
288	36
196	36
512	44
606	58
358	36
280	40
186	34
308	38
144	24
488	54
32	24
264	40
676	52
80	16
538	46
92	24
202	42
186	34
374	38
74	26
1554	78
46	18
100	36
196	36
300	44
50	34
912	66
122	34
522	50
76	16
730	54
516	44
316	48
162	26
644	52
224	28
344	46
386	46
32	20
200	38
352	40
412	46
506	46
682	58
144	32
322	42
286	42
522	46
1524	84
326	52
124	32
464	36
160	24
162	38
272	36
274	42
712	54
146	34
22	22
1314	78
58	22
634	54
466	42
214	38
66	26
916	68
292	48
194	36
88	28
2410	88
96	32
272	36
170	30
148	36
754	44
260	54
48	28
88	20
468	58
302	42
246	42
164	24
736	48
120	32
436	54
196	36
180	40
214	34
490	42
196	44
102	30
226	42
120	32
422	38
438	50
236	40
244	34
218	46
340	52
156	20
200	32
662	48
28	28
554	64
570	42
1006	66
192	36
300	40
104	32
258	42
206	30
430	50
948	72
216	28
130	26
146	32
276	40
164	28
202	34
120	28
1158	80
302	34
254	44
182	30
936	62
246	38
210	26
266	40
100	32
1248	74
210	34
172	40
122	30
124	28
164	34
134	22
194	26
384	44
174	30
162	34
382	56
170	38
72	20
92	28
222	36
176	26
252	36
1010	62
206	34
70	30
90	22
676	64
70	22
1710	84
328	40
738	62
352	56
340	36
568	50
306	38
206	30
526	50
150	30
302	46
158	34
182	32
324	36
118	34
214	30
298	46
402	48
398	40
230	42
282	34
190	30
1006	44
554	46
576	54
256	36
334	42
1458	94
368	44
810	54
718	52
122	26
180	36
306	42
568	48
974	78
232	32
320	40
380	36
226	38
148	34
626	48
110	26
38	26
76	32
158	34
278	38
346	30
506	42
632	56
668	44
182	26
764	62
562	46
500	52
150	32
204	24
782	60
292	44
90	26
466	44
562	66
98	26
966	68
1656	92
76	16
582	42
178	26
130	34
296	40
593	56
296	40
982	66
126	30
364	44
98	34
266	30
198	42
172	36
402	42
192	34
334	40
4341	105
246	34
76	20
276	38
810	60
190	26
230	38
158	30
90	34
156	36
268	44
38	30
150	28
720	56
112	28
448	52
1354	80
108	36
180	34
612	48
202	40
1122	74
248	40
540	52
64	28
22	22
1512	84
64	34
1998	96
562	48
196	28
404	44
310	34
128	28
806	58
550	52
122	30
506	56
64	24
372	40
88	20
48	20
40	16
134	30
374	38
856	68
266	36
700	52
276	42
528	44
196	34
234	38
746	68
298	38
392	42
114	32
490	50
310	44
622	58
532	48
482	38
406	54
624	48
312	40
98	26
180	26
128	32
292	38
756	58
786	66
482	50
86	30
94	24
96	20
66	26
160	28
19	7
54	30
470	50
998	62
108	34
272	28
100	28
62	30
598	44
206	34
394	50
380	40
232	32
1400	70
226	26
192	36
210	42
608	56
26	26
312	44
548	54
150	42
916	62
274	38
466	50
738	58
272	36
1332	84
468	50
286	50
874	58
254	34
560	54
550	50
876	60
104	24
138	34
176	28
288	36
518	50
228	36
404	36
148	30
602	62
528	54
978	62
184	36
788	56
184	32
398	48
176	36
616	54
296	40
164	36
1298	78
340	48
440	48
362	46
166	34
262	42
90	30
212	40
210	26
178	38
626	58
180	32
576	46
412	48
376	48
116	28
436	44
100	24
880	60
318	42
200	44
600	50
98	26
234	38
256	46
280	44
442	54
172	36
158	26
172	36
3136	122
188	30
204	32
244	36
152	32
244	32
274	42
114	30
132	32
642	50
156	32
220	36
254	42
96	28
108	20
880	54
388	40
124	36
268	28
206	34
492	40
158	26
120	36
62	26
214	30
662	62
208	40
200	28
272	40
238	38
526	50
278	42
120	24
312	42
164	40
196	28
276	36
502	66
248	36
126	26
370	52
156	36
588	40
186	34
792	48
680	58
684	54
346	42
246	42
272	36
22	10
1300	80
558	40
150	26
162	36
118	34
184	32
282	50
140	32
348	36
74	26
528	40
868	54
716	68
202	38
994	66
274	38
554	56
1368	64
172	28
82	26
866	70
1088	68
424	40
318	38
248	48
44	20
622	56
232	36
582	50
118	22
54	14
432	56
350	30
334	42
240	36
270	46
456	40
1260	60
396	40
324	40
182	30
150	34
272	36
58	18
608	50
122	26
206	42
676	52
418	50
30	30
246	36
214	28
558	66
192	30
140	44
146	26
19	7
666	60
376	44
112	28
1082	66
414	46
498	46
118	18
254	34
1392	78
128	36
170	30
194	30
294	46
606	46
90	26
346	42
172	24
306	42
66	24
402	50
314	42
348	52
462	46
216	28
488	40
260	28
798	70
234	40
386	40
1714	56
480	40
630	58
228	38
106	38
556	60
128	28
150	38
326	42
152	36
264	36
190	34
268	36
664	52
200	28
826	52
276	36
150	42
468	56
88	22
490	54
58	18
585	41
654	68
82	22
380	48
64	16
366	40
56	40
572	52
462	68
128	28
274	50
50	22
576	56
144	32
362	46
490	46
154	26
194	26
86	22
130	30
102	30
354	42
426	38
446	54
280	40
500	44
926	62
382	38
4834	128
76	28
560	52
312	40
134	34
158	34
1266	74
5471	131
240	40
394	44
158	30
108	32
262	46
2094	96
36	20
112	28
70	22
416	44
242	30
122	34
146	30
272	40
42	14
198	34
474	46
198	30
136	20
264	32
266	34
178	34
44	32
316	36
146	36
116	24
1180	84
22	22
438	48
510	50
408	52
402	44
704	58
216	28
782	54
42	14
198	42
2366	104
112	20
332	44
404	50
94	28
142	30
428	48
340	36
564	60
336	40
712	56
412	50
276	36
354	50
218	32
430	50
1362	74
516	52
124	24
442	42
596	62
112	28
290	36
218	38
242	46
118	34
352	40
128	28
492	48
378	48
262	26
448	44
1036	68
338	40
42	30
234	30
546	48
352	40
146	26
150	30
290	46
328	60
664	56
80	24
178	42
170	48
520	56
494	46
172	36
436	60
444	48
652	56
104	32
326	34
304	44
252	40
642	46
332	48
202	42
342	46
250	42
2332	100
76	16
1498	74
324	50
176	28
560	52
90	18
746	58
96	32
448	56
626	58
202	38
120	28
272	26
82	30
324	44
134	30
92	28
390	38
112	28
314	44
418	46
776	60
584	66
664	60
612	58
142	30
78	30
126	30
218	42
418	46
772	60
188	36
771	50
182	34
502	58
484	40
96	28
554	50
202	30
592	40
36	12
756	60
690	60
2532	88
234	46
476	48
374	46
1068	68
72	24
190	30
134	26
252	40
130	26
218	34
328	36
254	30
76	24
212	36
174	30
178	34
182	34
436	42
120	36
250	38
548	54
94	30
84	28
442	54
692	56
814	62
1104	68
258	38
404	44
154	26
584	50
360	48
604	60
356	40
292	44
96	36
270	38
492	44
434	44
92	24
112	24
188	40
46	18
608	54
586	70
50	30
56	24
178	42
284	36
252	36
556	44
754	62
556	52
402	44
352	36
232	40
910	62
212	36
402	42
194	30
96	28
840	66
40	24
1582	74
216	32
192	32
104	24
296	40
204	32
498	54
70	26
210	30
224	40
272	44
794	54
628	52
464	54
136	32
404	44
1794	64
782	58
90	26
1724	84
448	44
382	36
304	32
576	44
94	26
78	26
202	36
136	32
118	24
822	66
76	28
132	32
228	38
374	46
176	28
272	36
1812	82
448	54
328	44
440	40
558	54
264	44
82	22
202	34
832	68
594	54
392	46
470	46
470	46
176	24
170	26
410	54
54	26
376	34
442	42
132	32
328	36
618	50
212	36
164	24
486	48
390	42
248	34
156	44
262	34
254	38
506	50
190	26
114	34
352	36
120	28
854	60
306	50
236	40
408	48
176	36
234	26
226	34
414	48
230	30
164	36
122	22
2194	88
426	42
512	48
176	28
511	47
408	40
238	30
202	34
126	22
52	20
232	28
766	58
252	40
132	26
486	38
280	40
318	34
194	34
134	42
474	50
156	28
434	46
222	38
460	50
146	30
404	52
392	40
302	38
614	44
130	26
312	52
264	36
132	32
414	46
216	36
292	40
394	42
176	24
756	44
416	38
74	22
180	36
632	64
82	34
644	52
400	40
80	20
490	48
1338	80
132	28
616	60
404	48
188	28
222	38
106	34
676	56
230	38
70	22
122	30
722	52
1036	56
462	44
190	42
96	28
102	22
1044	60
586	46
536	44
152	24
122	34
138	30
102	22
272	44
96	24
1468	72
216	50
30	18
300	46
416	50
364	44
720	68
104	28
312	44
492	46
120	28
330	32
560	52
220	28
378	32
80	28
270	38
300	40
144	28
146	22
1396	82
194	46
90	26
528	60
136	28
382	46
1450	84
154	38
246	38
74	26
164	36
140	36
402	40
352	48
698	70
302	38
158	30
528	60
382	46
240	36
150	30
648	60
592	42
358	38
118	30
698	64
308	44
246	42
322	42
244	44
214	30
478	54
400	60
310	42
644	60
72	32
514	50
486	48
96	20
98	26
88	24
302	32
120	24
436	44
826	58
286	38
272	40
334	50
722	50
176	36
462	62
42	16
210	30
678	48
234	38
328	56
116	24
88	32
100	24
584	56
380	48
160	24
26	26
1198	82
330	42
194	34
270	48
190	30
540	52
176	36
178	38
44	28
514	50
206	36
418	42
482	46
682	50
72	32
110	26
352	30
318	34
334	46
386	34
134	26
288	40
422	46
252	36
346	38
904	64
956	66
258	38
116	32
686	44
84	24
294	38
290	46
972	56
458	50
170	38
336	36
714	62
328	40
280	44
592	46
122	34
580	58
1222	70
432	48
172	24
416	38
98	26
152	32
740	62
638	52
464	52
116	28
362	34
152	24
770	66
152	32
332	44
608	56
170	22
296	48
100	22
440	36
126	30
1120	66
212	28
892	76
468	48
254	38
204	32
430	40
470	48
254	42
514	48
116	28
182	30
204	40
806	68
164	36
74	30
400	42
376	44
158	30
82	30
131	23
72	32
170	34
86	30
162	24
174	38
146	30
712	60
378	38
190	28
1659	81
278	50
676	48
444	40
422	44
504	52
470	42
588	44
174	26
302	46
1530	82
258	44
378	40
130	32
362	38
52	16
464	40
470	56
736	60
278	40
150	30
250	42
96	24
174	30
180	36
622	54
72	16
628	60
120	24
204	40
256	32
122	30
72	28
174	28
34	26
202	30
96	20
310	50
406	38
162	26
572	56
204	46
488	46
302	38
138	42
382	34
102	26
300	44
548	44
336	40
74	26
48	24
750	62
608	56
2804	108
338	42
238	50
216	40
42	28
110	26
290	38
560	48
280	40
402	42
314	38
238	34
990	62
394	42
234	24
122	34
74	22
914	62
360	42
622	56
856	64
220	36
368	48
68	24
530	46
104	20
758	42
422	40
518	50
208	28
1132	64
210	42
428	38
76	36
314	42
280	36
206	38
446	46
162	30
104	28
222	44
202	42
356	40
270	46
154	38
296	36
232	40
184	36
434	40
80	28
188	32
336	36
470	38
516	48
120	28
436	42
474	52
324	44
340	42
844	56
188	32
150	30
88	32
402	48
220	40
1250	68
342	46
262	30
3348	110
136	40
128	24
262	40
166	34
516	52
188	32
470	34
154	32
266	38
436	48
162	34
202	42
394	42
408	46
330	44
512	64
422	44
272	36
262	34
486	40
160	34
128	26
266	34
132	36
264	36
42	14
266	42
636	44
180	44
224	48
92	28
414	46
114	38
526	38
590	56
176	32
734	62
258	30
124	20
812	60
104	24
240	36
220	44
216	36
1439	74
272	28
144	32
860	60
736	66
152	36
364	34
880	64
306	32
448	48
22	22
438	44
220	48
566	54
638	62
70	14
352	48
384	48
216	32
3254	108
278	38
360	48
610	54
588	40
1216	72
250	42
330	46
778	54
628	56
146	26
130	26
44	32
574	54
252	40
170	30
214	38
254	42
394	46
286	38
322	30
352	44
430	50
1032	66
354	46
170	42
378	42
62	18
586	48
122	30
266	50
434	56
312	36
494	38
294	34
124	28
252	36
414	42
210	26
910	70
168	40
130	26
574	42
516	44
136	28
248	32
184	34
460	48
618	56
32	24
186	34
248	46
394	50
588	44
158	30
30	14
1050	66
396	52
94	34
886	66
1856	86
188	32
46	14
254	34
924	58
194	18
856	70
550	50
380	44
68	20
50	26
188	36
344	28
164	36
540	48
440	54
154	30
378	38
2086	102
278	46
300	48
184	36
1990	86
302	38
110	30
2114	104
154	34
496	52
722	46
104	32
290	30
184	32
72	28
68	32
2202	98
276	36
258	42
126	38
1240	76
534	64
220	36
520	62
442	58
267	38
148	28
102	22
52	28
92	24
50	26
2418	98
214	30
114	30
450	50
124	34
184	28
400	44
144	28
112	32
382	36
392	44
134	26
146	28
254	38
614	54
532	54
274	38
336	48
252	36
396	48
680	42
298	38
114	22
982	74
234	42
534	52
322	38
124	24
1136	84
290	52
570	54
796	58
80	24
206	30
144	28
280	36
194	34
488	48
184	32
354	46
296	36
186	34
178	38
426	42
296	40
1204	80
438	38
1158	68
884	64
172	36
770	54
74	26
86	30
210	34
990	74
242	38
44	28
222	34
310	46
952	72
286	50
142	30
444	44
140	32
410	42
19	7
136	28
280	40
144	24
190	34
308	44
160	24
188	28
486	46
260	32
766	58
110	30
144	36
224	28
190	40
40	16
354	38
258	42
282	32
188	40
304	36
354	46
412	44
270	46
976	68
296	48
230	34
276	44
378	38
282	30
704	52
98	22
624	54
112	24
1122	64
182	34
348	44
872	64
242	30
300	48
676	60
312	38
172	32
212	32
1306	70
508	52
422	42
19	7
1360	82
240	38
514	56
268	40
86	22
120	26
1680	68
156	32
566	54
258	34
370	50
124	24
438	42
654	60
554	54
254	30
238	34
308	46
346	38
166	26
228	34
424	54
238	42
152	32
146	32
74	34
228	36
276	46
864	58
214	30
210	30
64	24
132	28
394	36
460	40
60	16
84	28
94	26
674	70
74	26
258	34
258	42
160	28
264	34
82	22
80	40
196	34
212	28
128	32
96	20
416	44
482	46
562	50
118	26
198	30
160	28
112	28
68	28
92	36
496	52
190	30
246	34
50	26
114	26
556	54
302	30
520	50
162	30
94	30
144	32
194	30
750	54
82	30
250	46
72	20
858	62
60	28
212	30
338	46
138	26
202	34
240	32
1040	88
356	36
92	28
722	56
66	26
244	32
1278	70
1106	72
368	40
746	56
116	28
202	30
270	34
452	52
132	28
132	36
222	38
502	56
340	52
248	40
98	26
132	28
92	24
264	36
1072	66
400	38
362	34
168	44
212	36
104	24
44	24
250	38
772	64
730	64
120	28
1418	70
68	32
908	58
318	50
194	32
208	28
1268	88
336	36
98	34
94	34
600	50
264	44
344	40
188	36
282	42
786	56
330	38
396	36
420	56
244	40
288	32
578	52
170	34
234	34
156	20
184	28
272	36
299	34
496	52
288	32
70	30
1250	80
722	56
728	60
100	24
180	36
934	62
886	62
104	24
134	34
90	18
112	32
58	16
328	40
46	14
638	60
402	44
74	26
180	28
264	40
448	44
536	52
146	34
618	68
836	48
118	30
108	32
482	46
274	38
388	48
122	20
112	24
316	48
226	22
188	36
260	48
274	34
174	30
162	34
519	54
148	36
1082	64
51	13
622	50
1510	74
340	36
134	34
276	36
98	30
19	7
24	24
64	24
720	64
96	32
110	18
90	22
370	46
252	32
474	52
596	50
120	28
248	32
326	50
178	34
610	58
240	32
68	20
274	50
388	40
458	48
206	30
826	58
776	52
220	44
590	48
138	38
240	32
804	52
704	60
328	48
584	52
384	44
818	54
462	42
280	40
218	38
94	30
282	34
366	38
168	36
86	22
146	38
816	64
144	32
316	40
276	36
675	56
198	38
412	48
182	34
166	26
422	52
490	54
826	58
386	46
406	46
608	48
644	56
346	42
842	58
294	42
76	32
391	66
454	48
588	48
154	38
774	50
252	28
610	54
236	34
197	25
750	46
282	34
416	44
680	60
178	34
540	40
436	48
134	30
300	48
512	48
440	50
5403	128
462	54
350	44
390	46
320	40
472	46
292	32
70	30
460	52
278	38
220	40
212	40
388	40
76	24
89	17
298	34
320	44
646	38
320	40
100	16
664	56
168	42
1092	76
556	52
316	52
450	58
301	50
448	48
240	36
86	26
1366	66
978	66
212	24
210	38
222	38
114	18
80	28
780	46
248	40
270	30
222	42
662	58
2718	90
308	40
44	28
290	46
266	30
70	22
750	62
166	38
384	40
158	34
44	32
452	48
436	44
196	32
82	34
364	40
538	46
502	42
120	38
82	22
116	28
478	58
1216	76
1066	82
660	50
172	28
482	50
188	32
122	30
192	32
222	38
590	48
542	52
122	24
710	54
662	52
196	36
260	32
1026	60
162	30
188	32
128	32
362	42
278	38
706	54
818	74
122	26
224	32
256	44
46	22
152	36
778	66
244	40
182	30
110	26
80	28
1856	88
442	42
222	34
140	24
186	38
406	44
148	32
294	46
380	54
130	30
204	26
284	28
44	28
66	30
322	34
798	72
492	40
128	28
70	26
592	52
382	42
208	32
418	50
48	20
64	20
140	24
234	40
436	44
452	52
490	38
2570	110
204	46
446	46
68	14
236	44
444	42
256	40
126	30
146	34
894	70
342	46
356	48
26	26
102	30
278	58
246	46
526	50
814	66
700	62
270	42
384	40
204	28
1100	64
264	32
372	44
880	68
496	44
36	24
418	42
62	38
200	36
92	16
336	40
524	52
693	70
200	32
146	30
152	36
632	56
330	38
860	64
484	48
112	30
318	42
1312	84
390	42
684	56
182	38
1070	58
1102	76
88	28
134	38
102	26
438	46
398	44
538	50
110	34
214	22
590	54
306	42
136	36
202	30
22	10
40	24
120	24
254	50
224	32
306	38
230	34
4817	137
140	28
760	60
94	26
2306	74
428	56
848	68
322	42
588	48
282	40
70	26
256	42
182	30
228	28
116	24
156	36
218	34
1598	78
48	24
126	30
196	32
272	40
106	30
26	14
194	36
282	34
64	16
634	46
1530	66
442	42
352	48
314	46
78	26
410	50
470	58
960	68
770	58
112	20
170	26
228	32
142	38
156	28
206	26
430	40
156	26
304	36
190	34
180	28
250	34
206	30
100	40
360	38
316	42
190	34
124	28
428	46
108	28
1654	82
234	34
138	30
411	44
416	44
684	60
152	28
254	42
19	7
370	42
368	40
370	30
408	48
86	26
142	38
134	30
106	46
140	28
220	42
182	26
486	42
528	44
524	54
188	36
1042	66
270	46
422	48
503	41
672	56
198	34
310	36
2042	86
758	58
226	38
334	42
116	32
236	36
116	28
566	54
332	28
514	50
388	36
148	28
300	24
286	38
262	34
362	54
196	28
203	27
482	54
236	36
1376	84
90	22
244	32
118	30
804	68
92	20
156	36
202	34
590	54
22	22
218	42
94	26
106	26
98	18
192	36
348	40
704	42
452	46
256	36
582	48
918	64
128	18
570	54
228	48
148	28
122	22
118	30
302	42
304	40
196	36
164	32
260	48
304	44
228	32
212	32
162	38
480	48
422	58
234	32
1434	78
808	54
320	44
144	32
470	38
386	40
364	48
656	52
326	46
1106	70
46	18
164	36
198	34
104	28
156	36
110	18
60	28
296	48
148	34
96	20
960	62
782	54
608	40
1052	76
794	66
444	40
720	56
516	48
288	36
120	28
276	36
74	30
536	36
596	52
362	48
184	34
52	28
300	52
114	26
608	60
166	30
194	42
310	50
336	48
54	18
178	38
246	34
218	38
336	44
358	50
750	62
222	38
794	58
1296	60
896	64
110	26
694	50
776	68
194	38
398	48
164	36
258	38
98	34
134	30
922	52
174	30
230	38
346	38
216	28
96	40
382	42
356	40
1786	62
324	48
234	30
270	46
46	22
918	58
350	50
416	50
474	62
142	30
356	44
114	22
148	36
1344	66
138	26
172	28
474	54
84	24
944	70
180	32
474	42
160	24
114	30
372	44
90	34
750	62
880	58
474	58
496	56
440	36
754	64
56	20
344	40
332	36
654	60
100	16
342	44
184	40
108	32
158	34
236	32
200	32
266	42
994	58
586	52
388	46
328	44
104	36
76	24
214	40
268	40
142	30
86	30
240	36
248	32
558	54
278	34
1212	76
264	36
256	32
432	50
476	46
228	32
144	40
362	34
350	46
302	34
226	34
206	42
422	52
324	28
218	38
294	38
124	24
654	54
414	44
132	32
166	34
486	50
598	54
270	34
562	48
218	32
136	32
72	16
228	38
378	42
204	24
270	30
122	26
140	36
30	14
174	26
136	32
114	34
1272	78
704	60
4191	126
334	38
584	54
104	32
840	60
352	44
416	44
408	46
308	44
52	32
304	40
148	32
254	46
286	36
96	28
200	32
312	36
232	44
140	28
34	22
802	66
338	42
94	24
532	60
316	36
230	34
270	46
1334	68
320	38
156	28
340	40
346	50
294	38
504	52
186	30
144	40
36	24
94	26
1386	72
282	34
222	38
310	46
164	32
116	32
326	34
36	12
84	28
354	42
580	52
78	26
212	36
402	42
2028	86
1130	56
140	28
374	38
488	44
324	52
102	30
94	30
684	52
128	26
24	12
1056	52
1210	68
1418	82
446	40
226	30
702	56
78	26
162	42
372	48
244	36
346	38
76	24
374	34
540	52
1608	60
42	14
330	36
494	48
72	24
126	26
812	80
1088	76
1500	84
176	30
382	42
232	28
230	42
100	34
196	28
138	30
3815	114
206	38
482	38
646	54
198	32
42	14
494	46
596	54
106	26
332	32
714	64
506	38
54	26
1322	76
290	38
166	30
268	24
284	34
360	48
376	44
1272	72
760	58
260	36
120	24
118	38
238	26
322	34
72	20
338	46
310	46
354	44
442	50
274	34
224	40
136	20
414	44
456	44
368	48
512	58
922	50
470	54
46	14
186	32
496	56
82	34
448	58
1730	80
156	32
880	52
112	24
768	64
246	34
620	44
76	20
172	40
412	40
664	56
994	64
210	26
278	44
128	32
700	56
410	38
252	36
194	38
84	24
120	32
502	46
184	36
240	44
62	18
242	42
320	42
74	26
106	26
42	14
94	26
538	54
70	34
2830	100
288	38
86	18
116	28
42	14
388	48
624	52
358	46
316	44
240	32
212	40
412	36
358	42
70	30
630	58
74	22
608	52
388	42
392	34
366	42
212	40
752	52
302	42
384	40
330	34
86	30
202	42
112	28
318	30
144	32
184	32
206	42
228	44
290	42
650	62
420	48
160	30
208	36
806	74
120	28
232	36
100	32
86	26
1066	66
688	56
36	28
508	56
464	52
218	26
244	44
232	40
198	42
154	30
338	38
502	50
358	46
512	48
136	24
444	44
198	30
396	44
90	22
198	38
960	56
214	34
122	26
2748	104
236	44
242	42
94	30
400	36
166	34
560	48
738	66
216	40
52	20
242	38
218	40
256	36
208	36
486	42
180	44
50	26
352	32
196	36
104	16
200	32
70	22
468	44
344	56
1224	70
558	54
684	48
366	42
88	24
552	48
764	60
468	56
60	22
288	44
1098	70
124	28
344	40
260	36
364	46
132	28
740	66
774	54
818	64
214	34
1060	70
586	46
302	42
330	34
468	48
422	44
938	66
192	32
138	26
264	36
476	52
180	44
156	20
82	34
62	22
62	38
394	42
208	40
456	44
808	60
474	38
566	56
686	70
102	34
86	26
220	36
404	48
354	46
178	30
740	60
594	58
128	24
292	44
162	26
52	20
78	30
72	32
2098	98
198	34
128	32
266	38
124	28
284	44
558	66
258	38
108	32
756	60
54	30
328	48
158	42
270	34
956	60
484	54
470	50
200	24
266	38
2328	78
982	58
870	58
72	24
408	44
120	28
544	58
232	36
186	30
390	46
652	64
298	38
256	32
1036	72
158	30
120	36
154	38
296	40
104	32
90	28
152	26
226	38
224	42
94	38
220	36
240	32
112	32
86	26
316	40
1402	62
156	32
450	46
122	26
160	24
282	34
196	28
78	22
844	62
440	56
310	42
148	32
890	62
320	40
854	60
366	38
100	32
462	48
88	32
1086	66
154	34
1066	74
714	52
592	58
438	38
832	72
300	40
118	30
224	36
1492	88
468	54
98	18
204	40
374	42
172	36
1066	62
324	48
1072	64
262	50
112	28
642	58
518	50
112	36
590	50
472	52
408	42
1054	70
300	44
1144	68
410	46
300	38
220	30
482	38
1198	78
130	38
150	22
660	48
150	30
534	44
302	30
208	36
588	54
284	32
1300	82
354	50
290	38
244	36
142	38
3630	124
250	46
254	34
660	64
214	22
652	52
246	38
448	52
144	24
116	20
136	32
19	7
2064	78
380	36
296	44
76	32
198	36
170	42
618	54
880	62
122	26
372	52
60	24
804	54
232	36
170	34
19	7
246	38
378	38
612	58
302	34
34	26
114	26
414	40
176	40
58	16
944	66
118	34
292	32
164	36
524	42
1652	90
116	28
200	44
232	36
182	30
566	50
118	22
124	18
486	50
2134	82
482	50
568	48
336	44
124	36
436	42
182	38
382	38
104	24
232	42
400	50
74	34
462	46
170	30
70	22
382	46
162	34
52	24
338	38
204	28
94	38
84	28
152	36
158	30
576	56
418	46
518	44
302	34
1024	60
246	38
488	52
2254	96
214	48
304	32
150	38
504	44
396	40
216	36
1246	70
126	22
394	34
470	54
382	46
216	32
92	40
348	36
406	34
316	44
1026	62
150	26
176	28
344	32
136	32
160	28
624	40
100	24
236	36
326	44
434	48
326	46
288	52
120	32
330	40
686	54
252	40
610	62
626	60
898	74
198	34
454	44
692	52
266	40
1408	70
754	70
174	38
142	34
28	20
222	34
958	66
60	28
1102	70
828	64
272	28
996	62
226	30
344	48
166	42
120	24
214	38
708	56
454	58
238	38
176	36
166	30
72	20
402	56
316	48
184	32
214	38
208	48
480	44
54	34
210	34
206	32
128	32
86	34
150	26
44	16
582	50
56	24
268	36
186	42
218	42
324	32
234	42
176	36
214	38
498	50
114	26
190	34
148	32
210	32
64	20
274	36
278	38
290	46
280	44
450	46
62	22
1642	72
170	38
530	46
490	54
42	14
92	16
176	32
194	22
522	46
874	66
478	54
184	32
272	36
116	32
886	58
538	42
688	60
32	24
1346	72
566	52
202	30
546	46
98	30
348	52
594	54
424	56
354	38
1928	88
704	60
446	38
118	26
96	20
248	40
118	38
512	52
1304	88
254	40
284	44
620	58
256	36
222	38
134	30
530	54
98	30
602	54
198	38
314	34
52	24
1182	90
76	16
698	62
234	34
170	30
274	38
232	40
436	44
238	30
318	46
60	20
134	30
150	40
544	52
1307	75
262	34
966	58
304	32
2372	94
238	26
78	26
436	44
602	50
296	36
104	28
1060	64
408	48
700	54
342	44
212	44
370	46
144	28
166	36
194	34
398	40
414	54
100	28
236	40
548	56
1052	76
886	62
1618	80
368	48
448	56
82	34
712	56
454	50
582	58
32	20
500	52
118	30
128	18
414	50
328	40
182	34
1128	68
182	38
276	40
190	34
108	28
404	36
320	44
98	26
1386	76
342	36
164	24
444	60
312	40
198	38
132	32
136	28
1190	74
430	40
224	28
508	50
174	32
660	46
144	24
86	22
572	68
1080	84
178	30
524	56
450	50
816	52
296	44
770	58
346	42
120	36
414	54
396	48
200	36
244	42
730	60
302	42
30	14
574	50
320	36
128	32
494	44
722	52
478	54
116	28
58	30
484	34
496	52
318	46
94	18
932	76
132	24
628	52
518	48
784	68
394	42
226	30
164	28
566	46
84	28
552	38
228	28
124	24
1648	78
2200	84
112	30
524	40
534	54
212	38
430	54
74	22
370	42
612	56
126	30
154	38
92	28
142	30
52	20
424	48
246	30
488	60
436	46
388	44
226	42
444	50
282	42
814	52
206	34
698	54
362	50
114	26
42	22
608	56
532	48
198	34
140	36
76	28
2392	100
498	42
72	24
402	46
164	24
712	52
606	64
232	40
230	38
274	38
604	60
530	46
108	36
46	22
598	50
19	7
452	52
96	32
126	30
286	46
566	52
244	36
212	40
282	32
82	34
226	24
160	28
178	30
80	20
180	36
348	36
248	40
128	32
380	36
64	24
192	40
44	16
146	38
136	28
132	32
334	42
314	42
116	32
288	32
182	22
386	46
528	64
600	56
296	42
230	34
656	52
464	64
448	40
66	34
122	34
256	40
404	48
2732	90
44	28
94	34
200	28
324	48
22	14
184	32
114	22
292	32
404	44
366	42
156	24
726	58
206	42
824	64
1616	84
590	62
394	40
58	18
298	34
302	36
504	52
880	60
182	32
200	40
228	32
2160	94
432	52
370	44
284	40
368	44
1066	62
96	24
1154	68
70	30
576	44
304	48
770	50
122	38
804	52
402	52
182	34
226	38
188	28
432	56
362	46
92	20
582	42
536	44
312	40
1428	74
450	36
498	50
194	38
58	14
518	54
378	38
96	20
1280	76
338	38
754	62
282	34
190	22
890	60
250	38
516	48
384	46
366	58
196	36
232	36
204	26
302	38
948	76
268	40
340	46
430	50
354	46
388	40
2198	90
288	48
52	28
274	38
164	24
256	36
54	18
500	54
88	24
150	34
236	36
158	30
344	48
1354	72
134	22
362	42
174	30
458	52
588	60
228	40
272	32
224	28
442	48
112	28
256	40
386	44
902	58
232	34
240	36
678	66
250	38
248	36
208	24
182	26
174	30
162	30
410	46
226	38
80	36
302	34
342	46
288	44
236	36
224	36
524	56
156	32
192	44
326	50
80	26
50	26
240	34
1004	62
556	36
86	30
228	36
502	48
132	28
184	34
302	34
100	28
112	32
140	32
130	30
194	34
278	34
188	24
344	48
386	54
176	40
478	42
88	28
760	52
834	62
624	40
176	32
150	40
416	46
174	38
250	42
598	50
336	40
374	36
208	40
602	52
640	56
632	52
254	38
300	36
190	38
494	50
374	38
102	26
120	24
142	30
130	24
890	74
1046	78
478	50
262	34
218	38
34	22
384	36
615	52
24	24
652	60
94	30
74	26
100	32
230	42
342	38
1542	62
376	56
336	40
144	32
380	28
62	30
304	44
56	16
248	32
78	26
380	44
394	46
274	46
98	30
126	30
126	32
880	56
210	32
978	70
22	10
184	32
366	42
1808	98
294	34
386	40
60	24
438	34
290	46
452	48
274	46
208	32
250	38
600	60
362	42
164	44
242	26
458	44
98	22
80	20
144	28
390	44
2484	86
340	40
174	34
150	34
324	40
146	34
376	44
1024	56
252	44
344	52
388	48
98	26
188	24
390	54
120	20
82	30
242	44
538	54
124	28
304	36
96	28
108	32
154	34
816	64
264	32
370	50
470	50
248	36
60	20
346	38
616	52
504	52
296	40
1010	74
306	46
194	34
408	46
346	60
232	44
194	34
298	30
104	28
216	38
304	44
176	32
240	26
298	50
502	58
232	40
316	44
400	48
296	40
212	40
114	26
388	44
160	20
294	42
368	42
928	56
76	32
1150	60
1156	72
162	26
262	34
58	30
290	38
274	34
922	60
42	14
324	44
368	40
136	24
324	36
512	54
652	56
130	34
232	36
704	52
114	30
396	32
60	20
252	34
48	24
78	22
506	44
76	24
828	72
152	24
260	28
132	24
294	30
548	50
202	40
418	54
810	58
92	24
44	28
684	68
234	38
94	26
228	40
166	26
304	44
426	62
168	28
88	20
178	28
240	32
108	28
236	28
132	28
112	36
40	24
84	28
1356	68
338	52
648	56
640	56
202	22
132	32
738	62
916	56
1088	66
150	30
554	60
212	36
246	30
460	44
118	22
98	26
494	40
404	48
172	36
322	38
304	36
280	40
290	38
76	24
198	34
154	30
110	30
454	50
76	24
476	40
184	32
700	54
298	44
108	30
382	42
206	26
650	58
718	58
294	38
126	24
670	54
64	20
190	36
270	32
142	30
220	28
164	38
240	44
364	36
140	28
574	54
402	40
134	30
494	38
136	40
44	24
492	58
130	22
690	62
122	34
472	48
308	42
1010	62
238	30
116	20
202	34
164	28
654	48
474	54
258	38
222	38
186	34
688	56
190	30
562	52
404	46
910	48
410	52
566	50
640	50
332	48
382	54
60	20
224	28
90	26
1172	84
150	32
32	16
342	46
891	64
522	44
258	46
226	34
146	24
298	34
38	26
194	34
456	40
40	16
534	46
148	32
220	44
1230	64
862	62
660	48
336	44
252	38
332	40
82	22
40	16
614	62
158	30
832	62
164	44
268	32
608	52
122	34
880	60
510	58
340	44
1328	72
110	34
206	42
100	24
586	52
208	28
256	48
302	38
334	48
348	48
278	26
570	52
792	64
486	34
318	34
234	34
204	36
1186	62
248	40
234	34
336	40
390	50
198	40
446	42
162	34
1280	68
672	56
1862	86
200	32
150	26
308	48
376	44
170	34
292	40
722	56
554	50
70	22
168	36
334	34
160	40
310	34
376	46
335	33
192	32
230	34
642	62
154	30
176	30
220	24
548	46
126	34
372	50
216	40
846	62
372	44
456	40
344	38
54	22
878	58
250	42
380	32
1006	58
412	42
496	48
286	50
168	28
1656	74
376	38
280	40
214	42
112	28
156	28
312	36
584	48
350	42
402	38
172	32
272	28
238	38
512	46
716	50
462	50
156	36
196	36
254	38
396	48
104	36
90	18
250	38
56	20
148	28
166	26
570	46
356	40
148	24
180	48
126	30
144	36
786	54
240	32
1448	82
190	30
84	24
240	36
264	44
224	40
528	44
302	58
682	46
380	44
156	24
384	42
132	32
350	48
454	42
540	52
126	30
144	36
88	28
170	34
278	26
316	40
138	26
132	40
160	38
102	26
1000	56
574	58
572	46
390	38
256	34
632	48
536	56
128	24
150	26
152	40
418	46
146	30
198	34
270	42
364	34
170	30
110	34
360	34
242	38
412	40
354	34
238	30
182	30
276	38
66	26
232	36
1000	66
712	44
142	34
102	18
278	34
382	50
178	34
294	42
114	30
62	30
92	32
386	46
628	56
606	62
142	22
306	42
44	20
294	44
88	28
462	42
152	32
120	36
134	34
248	32
168	32
506	42
262	30
43	11
636	60
390	50
382	44
314	42
242	38
512	48
174	30
178	34
498	50
7875	149
324	44
444	36
552	44
260	36
272	36
442	54
126	26
182	34
1594	80
140	28
226	34
1292	72
506	50
42	14
294	46
396	40
610	58
210	26
1112	50
1804	92
538	46
120	36
832	64
620	56
308	44
126	34
290	42
310	46
26	22
290	38
394	58
204	40
638	52
462	50
252	40
180	28
100	32
314	48
170	42
710	50
190	38
524	60
314	30
84	32
134	26
220	40
852	56
316	36
206	38
340	44
788	52
1494	86
222	38
848	60
256	36
562	46
200	32
172	32
336	48
210	32
1340	68
70	30
222	30
341	46
178	30
330	38
152	38
238	42
628	54
140	36
270	42
258	42
748	50
164	40
198	38
456	52
354	42
464	46
88	24
610	52
636	64
768	60
589	49
372	40
434	34
472	52
646	54
62	30
220	36
452	54
320	44
134	38
702	62
52	20
19	7
162	38
340	52
94	30
378	46
186	38
856	66
688	64
240	42
1304	72
464	40
272	40
104	28
278	34
200	28
50	22
456	54
140	24
70	30
218	46
690	58
76	36
1114	70
154	38
210	42
136	24
126	18
232	32
78	26
220	40
372	32
934	50
116	28
600	64
78	22
198	26
246	38
124	28
626	46
68	16
216	28
206	42
118	26
458	46
288	52
626	48
226	34
504	48
202	38
322	46
1166	70
2272	84
356	36
156	32
812	58
285	42
398	48
716	56
23	9
118	34
508	52
204	36
1134	68
270	38
198	38
428	44
82	30
1174	72
572	44
96	20
66	18
572	68
90	30
192	36
704	60
268	36
586	54
518	46
348	48
872	64
338	46
288	28
384	52
142	30
1110	70
1058	68
36	28
854	50
398	42
156	32
280	32
206	40
276	40
400	34
346	44
66	26
178	42
252	48
332	40
842	64
502	52
2396	100
600	56
268	40
74	30
844	64
885	72
156	28
180	36
412	40
380	38
242	38
976	64
64	28
222	26
256	36
294	50
142	36
646	54
88	28
226	30
130	26
346	34
146	34
124	36
186	34
296	44
976	64
24	24
434	46
160	44
348	40
336	36
174	38
322	32
224	36
158	30
478	58
118	22
564	62
1786	94
166	30
148	28
808	64
462	62
320	40
418	48
228	36
110	38
84	24
476	46
1182	60
502	46
194	38
464	46
336	52
402	46
508	32
168	36
1058	74
248	32
546	46
761	61
228	40
184	36
216	32
72	24
136	28
384	36
114	26
4080	122
94	22
338	42
472	52
92	24
396	56
236	40
508	64
252	48
536	48
192	40
76	16
430	50
252	36
188	40
144	32
84	16
282	46
130	22
873	62
82	22
104	24
84	24
160	22
294	34
144	24
374	42
96	40
106	26
84	24
86	26
1280	60
666	58
138	26
132	32
1782	92
80	28
1056	62
440	42
386	38
84	20
432	44
158	38
1102	70
238	42
446	48
296	36
272	44
238	42
146	30
302	42
128	28
200	40
328	44
226	34
114	26
388	44
214	38
362	42
1266	64
158	34
812	64
116	28
278	40
138	30
338	42
298	38
194	34
234	34
282	38
106	22
198	32
224	40
120	28
204	36
110	30
108	20
336	52
586	34
342	46
478	54
320	38
148	28
416	40
122	26
800	44
158	32
368	48
620	42
128	24
308	40
208	28
94	16
174	38
42	14
362	42
1750	86
770	54
114	34
974	66
272	36
290	42
92	20
726	50
116	24
294	38
434	42
1032	70
228	32
200	26
588	42
154	42
410	40
1654	78
710	58
166	34
208	28
732	52
1632	76
240	44
110	34
1044	64
908	64
558	54
530	50
118	26
206	36
116	36
156	28
76	24
50	26
76	16
58	26
808	62
452	38
230	22
174	26
608	58
414	42
280	48
174	38
1458	74
84	20
694	66
48	28
614	66
148	28
554	52
454	50
140	28
168	36
222	38
124	32
200	40
156	26
626	50
402	54
454	52
1122	68
166	28
304	40
106	34
88	24
942	46
66	22
168	36
132	28
598	54
19	7
120	28
86	26
248	32
326	36
62	18
314	38
630	38
204	32
194	26
316	40
138	34
440	50
466	50
236	40
112	20
506	46
154	30
180	32
108	24
354	38
192	32
34	14
230	34
512	50
210	34
104	28
84	32
108	28
172	32
132	18
314	38
195	23
380	38
288	36
152	28
180	36
502	52
636	54
286	34
224	40
379	46
216	36
220	36
374	52
220	36
72	28
566	52
198	30
1116	66
456	36
388	46
108	24
464	56
826	62
408	34
1004	64
948	58
182	32
452	44
356	32
104	32
166	34
56	36
132	28
338	42
84	16
156	36
352	36
154	26
452	44
1224	66
146	30
128	16
126	26
690	42
254	34
714	50
62	26
404	44
366	54
734	54
72	24
2478	100
248	40
202	50
1380	82
316	40
506	54
106	22
98	30
838	56
190	34
84	30
214	38
48	16
326	44
86	26
202	30
132	30
124	28
162	36
1268	72
234	46
122	34
222	30
646	70
576	52
564	48
52	24
122	26
248	36
158	34
248	40
246	38
438	62
194	42
702	58
682	52
54	14
276	36
326	42
48	28
74	26
190	28
386	38
358	42
1034	60
448	48
224	36
54	30
334	46
110	30
856	60
700	44
434	46
596	52
154	34
116	32
610	52
80	20
244	36
268	32
220	32
428	38
96	32
154	34
466	46
128	28
468	40
166	26
308	40
644	48
234	30
264	44
112	24
332	32
138	24
540	48
486	50
232	32
768	64
594	44
372	44
536	50
504	36
616	56
220	36
226	38
138	42
766	66
370	46
584	56
156	32
140	24
652	62
84	44
512	52
192	40
346	50
1194	78
298	34
48	24
1462	76
780	54
78	22
72	16
262	38
144	36
302	46
728	56
324	40
1006	56
224	40
30	14
336	50
4196	122
102	26
542	46
294	38
274	28
232	32
1072	68
608	44
298	42
134	22
26	22
58	18
102	34
324	44
372	48
414	48
908	60
216	26
268	40
134	42
562	60
564	52
118	22
538	40
416	44
290	30
82	14
122	34
182	30
196	32
668	58
872	56
266	34
570	40
620	64
382	38
182	42
19	7
724	68
532	40
260	44
42	30
1536	90
108	36
106	26
160	44
72	28
176	44
590	54
248	42
934	66
1778	80
436	50
136	46
274	40
156	36
114	26
354	38
184	44
140	30
1178	70
234	34
390	48
314	44
1056	72
246	38
316	44
182	38
240	32
292	30
204	40
310	34
782	58
110	22
340	44
480	54
356	52
716	56
468	34
220	32
170	30
510	50
214	30
236	40
410	44
272	36
186	42
224	36
334	48
300	40
548	60
116	30
122	30
800	52
236	36
1302	70
150	26
70	22
586	54
689	49
198	38
162	30
344	48
220	36
54	22
286	36
436	40
218	38
536	50
428	58
394	44
558	46
482	42
66	26
344	36
184	32
372	56
582	66
452	40
170	34
408	36
1048	64
298	38
226	44
726	58
50	26
184	32
982	66
246	42
108	40
502	46
190	32
380	42
698	46
294	34
300	40
94	26
102	30
306	34
428	50
84	24
196	36
362	40
962	70
284	48
70	26
148	28
222	38
198	34
188	40
628	56
566	46
282	26
424	44
204	32
462	50
998	62
412	44
104	24
168	36
160	26
208	42
286	30
432	52
346	42
304	40
108	24
188	24
580	40
678	54
502	50
408	48
128	26
540	52
190	34
312	40
484	52
424	40
188	32
200	44
244	40
352	40
128	32
446	38
152	28
92	32
234	38
356	44
230	38
690	56
164	32
104	20
112	36
238	30
176	24
212	28
252	28
432	38
314	40
567	44
84	28
290	26
158	34
566	50
416	40
54	30
282	30
154	30
538	54
278	30
202	26
328	40
410	50
74	26
76	26
574	58
98	26
50	26
254	30
646	56
124	32
546	46
124	28
674	62
64	22
198	28
424	38
558	50
474	50
232	28
418	50
1158	62
96	28
656	48
254	26
98	34
120	24
2542	102
230	30
286	30
178	38
184	40
178	30
962	60
420	40
414	50
644	56
564	52
700	50
174	34
212	40
48	28
128	28
262	34
249	33
122	30
202	30
238	30
630	44
126	26
578	58
210	34
248	44
224	36
160	36
326	38
74	30
98	22
134	30
984	72
590	54
2572	96
272	44
148	28
64	24
150	22
116	36
184	36
618	66
638	58
136	48
98	38
158	34
350	44
362	42
486	42
1476	64
100	28
176	40
388	40
282	46
194	34
100	24
234	46
296	32
48	16
556	56
1396	80
520	48
534	54
464	52
1426	88
208	48
220	32
160	24
672	64
506	44
326	42
1110	76
286	30
194	36
290	44
138	34
604	48
200	28
514	54
632	60
424	48
162	30
1650	80
90	30
78	26
392	42
337	37
84	20
122	38
626	58
978	64
388	44
62	22
1070	68
186	38
558	44
488	50
208	40
646	64
722	56
322	46
236	36
538	42
340	40
1124	84
118	18
432	40
202	34
88	24
236	40
104	24
298	46
870	62
164	36
212	32
350	34
1404	60
160	40
318	46
372	44
432	42
432	46
510	50
50	22
58	22
168	32
1050	58
84	36
558	62
280	44
664	64
438	42
130	30
266	42
214	34
78	26
620	52
1040	72
450	42
942	76
204	38
120	30
156	32
90	26
794	66
222	38
416	44
558	50
110	30
212	36
166	38
150	38
426	48
1006	62
292	40
140	28
228	40
210	32
400	40
180	32
358	38
366	46
200	32
214	38
512	48
378	44
276	48
256	40
340	44
796	48
228	24
348	46
524	44
310	36
356	40
174	30
202	38
638	58
498	50
82	26
492	52
138	30
174	36
510	52
100	24
166	46
234	30
192	36
298	38
168	38
664	56
294	42
116	20
430	42
114	30
236	38
132	28
286	46
86	18
810	58
270	34
104	28
478	50
380	44
86	22
1306	80
182	30
160	32
542	54
60	24
368	36
182	38
94	26
676	60
292	28
520	50
358	46
202	30
52	24
256	48
272	40
268	36
144	28
438	44
150	30
620	48
502	54
98	24
210	32
236	40
60	20
466	42
202	34
494	58
234	42
682	54
702	64
194	30
286	38
328	54
378	46
450	50
654	46
168	32
84	24
312	48
148	28
1402	70
280	44
124	32
231	27
30	14
102	30
366	46
514	44
168	32
618	62
148	32
370	42
590	50
126	30
722	70
70	30
44	28
842	68
19	7
184	32
180	36
158	42
196	32
506	44
498	46
802	54
48	32
196	40
720	60
860	52
72	32
256	36
2342	90
316	48
212	40
1044	52
454	50
112	24
488	52
190	34
978	56
384	40
550	66
228	36
366	46
62	38
256	52
34	26
530	48
454	52
124	24
154	26
670	52
1618	88
104	24
426	48
228	40
226	34
464	42
260	36
164	36
212	36
112	36
276	40
130	34
136	28
452	40
114	30
2408	114
390	40
416	52
668	56
226	42
776	60
204	44
42	14
272	40
1086	76
1778	74
86	22
664	48
402	50
38	14
132	28
124	24
388	48
102	22
100	28
784	74
1106	70
19	7
368	40
284	40
140	36
92	24
222	38
252	36
1036	70
220	32
112	32
1008	62
96	32
610	60
622	58
362	46
172	28
126	34
704	54
280	36
188	32
2214	92
256	40
156	32
148	30
496	34
74	26
1266	70
346	34
632	56
36	28
670	54
246	28
668	52
834	46
284	42
482	50
296	30
204	24
124	32
152	40
548	44
374	40
772	60
158	30
28	28
544	54
332	40
338	42
644	60
1016	66
56	20
330	30
104	28
328	48
594	46
19	7
156	28
204	32
780	56
552	36
104	28
260	36
344	40
222	30
352	48
224	44
214	38
110	26
364	36
156	28
198	38
258	30
800	72
390	40
306	42
340	52
168	28
23	9
146	38
162	28
114	26
444	46
156	28
162	30
1160	76
424	40
526	48
120	24
426	50
166	30
600	54
354	40
190	34
84	32
354	32
292	32
917	63
102	26
448	46
284	40
96	32
96	24
102	34
546	54
306	42
432	52
174	34
440	52
104	20
332	32
302	42
158	24
196	36
378	30
182	38
394	50
246	38
378	46
332	36
438	54
650	46
1330	70
370	34
124	20
326	34
262	38
466	46
74	26
470	50
442	42
624	66
1804	84
120	40
312	44
248	24
318	34
142	34
278	42
58	16
280	36
98	22
232	32
372	44
186	30
198	38
590	66
326	34
184	36
19	7
240	40
506	54
702	54
278	46
134	34
290	46
162	38
738	62
238	26
134	30
390	42
138	30
168	32
154	38
340	38
220	26
536	52
510	46
622	58
140	28
48	24
804	52
508	48
146	34
132	26
596	56
396	44
1584	68
166	40
294	38
218	42
298	46
172	36
512	52
438	46
150	38
138	34
50	18
80	32
298	42
292	34
134	38
190	30
242	34
1018	66
412	56
860	56
360	42
276	40
140	28
240	36
226	30
112	20
212	36
466	42
132	28
274	38
62	22
476	54
470	46
152	28
762	58
542	50
100	28
300	32
200	28
154	36
734	66
476	48
340	48
362	38
338	46
370	42
278	38
280	40
540	44
464	56
536	56
318	44
320	40
490	48
326	34
66	22
100	28
402	46
228	36
224	28
164	34
328	42
294	30
142	30
956	50
66	22
474	50
616	58
194	46
138	38
106	42
38	22
510	42
258	38
184	40
178	38
414	48
56	32
90	38
380	42
248	44
92	26
100	32
904	60
858	58
96	28
164	32
60	36
276	44
178	34
70	30
786	54
132	32
148	32
212	48
476	52
156	32
980	70
1120	64
478	62
344	40
778	58
126	30
178	42
730	64
162	34
146	38
192	30
202	38
250	42
154	26
30	14
1792	80
530	46
164	32
62	30
3786	116
302	38
410	46
288	52
236	32
174	30
476	44
318	36
1340	82
1178	66
192	44
664	56
508	44
732	64
50	26
52	24
750	68
1112	64
488	56
496	56
542	46
78	18
294	36
944	60
448	32
98	26
162	30
304	44
170	30
484	46
170	26
90	26
22	22
592	44
782	46
426	46
224	36
234	26
284	40
218	42
642	54
486	48
436	60
252	36
896	62
148	36
138	42
172	40
56	16
360	48
884	56
652	64
142	26
78	22
448	42
276	36
308	36
66	26
186	38
274	38
62	30
420	48
52	28
138	34
244	36
256	44
692	72
234	34
152	32
192	40
174	30
520	52
190	42
320	36
118	26
794	60
162	34
628	52
80	32
66	26
128	36
270	38
580	56
126	46
114	30
376	48
1306	72
1052	68
346	34
306	38
352	36
376	48
264	24
710	54
196	28
222	26
962	78
430	50
292	40
404	56
518	38
184	32
200	36
52	24
428	48
242	38
850	72
42	22
296	40
230	42
146	26
1010	70
842	58
72	24
1030	70
504	56
842	72
390	40
74	26
696	56
86	36
106	30
108	24
162	38
324	40
1608	64
632	52
514	58
288	36
264	40
132	32
176	32
202	46
248	40
318	58
288	44
256	44
250	26
314	42
1384	62
76	28
354	44
92	22
240	44
138	26
90	22
52	20
410	46
80	28
330	50
98	34
332	46
738	68
812	64
80	28
1056	68
358	38
478	60
190	38
1477	82
160	28
362	38
556	56
90	30
170	38
94	34
114	26
482	42
772	64
170	26
188	40
686	58
634	58
154	34
412	32
970	52
116	24
114	30
240	36
262	38
376	40
108	20
19	7
290	38
216	28
228	32
182	26
222	34
300	36
290	30
140	24
376	44
426	54
1725	72
3006	106
134	30
924	72
368	44
24	24
400	40
112	40
472	48
148	32
934	64
108	32
330	40
136	28
644	60
132	28
1746	68
362	34
72	20
138	30
474	48
104	24
660	60
196	36
984	76
1356	74
596	48
106	30
242	38
602	46
312	44
792	56
28	20
318	38
416	44
336	36
766	62
666	54
102	28
134	34
302	34
132	28
764	54
474	54
120	24
346	38
168	32
284	40
80	24
56	24
292	48
174	22
832	56
44	24
370	46
412	44
190	34
84	28
210	30
1584	60
434	44
158	26
582	52
304	40
1842	82
522	46
386	38
98	24
1270	60
228	40
660	56
492	56
1364	78
474	54
126	26
1618	84
426	30
833	62
372	56
128	36
396	44
418	46
88	28
1416	72
622	54
238	38
630	58
408	44
396	44
902	66
788	64
516	48
200	32
148	36
150	30
110	30
142	30
472	48
374	46
90	26
602	46
124	28
96	20
182	26
308	52
270	34
258	42
892	60
108	32
682	58
36	12
242	42
176	30
96	24
154	34
770	54
312	34
128	20
106	22
290	30
260	44
136	36
1012	60
168	32
2820	108
914	60
850	58
222	32
208	32
348	42
310	46
292	40
84	24
182	38
788	50
100	28
1386	68
416	36
400	44
448	48
280	24
658	54
118	34
310	40
76	24
132	40
342	54
838	58
410	56
442	54
176	40
128	36
54	18
502	50
174	44
796	48
172	36
194	34
294	42
1088	78
460	52
328	44
188	36
284	28
352	44
672	48
232	40
100	32
698	62
202	34
88	28
304	28
666	62
236	30
150	38
504	40
24	24
212	40
570	44
718	68
240	32
138	26
176	32
362	42
192	36
740	52
172	28
360	40
1232	76
600	52
102	26
274	26
34	30
986	66
702	62
1094	74
326	42
220	40
90	26
2556	98
1026	80
858	62
366	38
238	42
272	40
64	16
322	42
124	30
252	48
526	54
468	48
86	38
72	24
154	26
238	46
94	30
736	60
144	28
294	34
326	42
280	48
438	44
432	48
1060	52
702	58
282	38
762	66
1134	70
358	34
264	32
50	22
144	36
4212	116
19	7
318	34
102	30
52	28
494	46
62	22
538	46
332	36
394	38
838	54
706	56
43	11
424	44
252	36
246	38
72	20
500	40
176	36
212	44
416	36
1064	72
182	30
144	34
554	50
410	38
928	84
982	70
1166	66
226	38
288	40
136	36
136	28
526	42
1264	82
256	44
42	14
154	30
84	32
849	51
272	36
218	30
506	50
128	24
948	60
230	34
1474	76
2150	92
114	34
658	58
80	28
216	36
312	38
102	18
506	58
920	64
1306	86
2132	88
98	34
334	38
428	52
614	58
136	28
158	36
146	38
96	20
130	34
212	36
470	42
298	42
576	64
166	30
76	24
114	30
504	48
226	30
120	28
398	54
458	46
770	66
178	38
234	36
198	34
718	54
558	48
458	50
538	46
98	18
180	32
134	18
148	36
294	46
438	46
398	46
948	54
176	48
256	36
270	38
214	42
56	16
818	54
490	50
1060	64
88	40
230	30
434	42
256	28
262	38
200	32
382	42
356	40
122	30
180	36
240	32
186	34
690	66
110	18
332	40
1220	80
84	28
194	34
262	38
710	58
188	36
514	46
550	52
248	36
100	28
234	30
420	38
296	44
334	38
82	28
522	54
976	66
232	36
207	36
1490	70
358	46
134	26
488	52
300	36
454	64
200	36
224	32
212	36
110	26
264	52
216	44
330	40
48	16
62	34
546	54
192	34
558	50
126	22
74	30
76	28
628	52
202	42
568	56
144	28
992	72
190	30
408	44
292	44
238	34
116	20
276	36
148	32
468	48
548	54
170	30
194	26
328	48
118	26
270	50
30	14
