Score	Length
33	9
18	10
22	10
30	10
8	8
36	12
33	9
16	8
18	10
18	10
24	12
22	10
30	10
16	8
8	8
20	8
20	8
8	8
16	8
16	8
20	8
12	8
22	10
50	14
10	10
12	8
30	10
20	8
30	10
26	10
18	10
16	8
8	8
20	8
22	10
12	8
12	8
30	10
22	10
16	8
22	10
12	8
8	8
28	12
8	8
14	10
16	8
112	16
22	10
8	8
36	12
16	8
30	10
28	12
19	7
18	10
12	8
19	7
8	8
36	12
16	8
22	10
8	8
20	8
33	9
18	10
18	10
42	14
43	11
36	12
22	10
26	10
10	10
8	8
32	12
18	10
22	10
18	10
8	8
43	11
30	10
110	16
33	9
109	17
20	8
29	9
86	16
43	11
28	10
16	8
30	10
19	7
16	8
8	8
22	10
33	9
30	10
33	9
16	8
8	8
48	12
19	7
22	10
43	11
28	10
12	8
16	8
18	10
36	12
43	11
10	10
16	8
38	10
28	10
14	8
20	8
8	8
22	10
44	12
43	11
30	10
16	8
18	10
43	11
43	11
20	8
20	8
16	8
44	12
22	10
18	10
12	8
16	8
14	10
43	11
22	10
8	8
16	8
16	8
38	10
22	10
20	8
20	8
18	10
38	10
29	9
28	10
42	14
18	10
12	8
19	7
38	10
38	10
20	8
36	12
26	10
28	10
30	10
18	10
48	12
26	10
22	10
18	10
22	10
8	8
20	8
29	9
28	10
22	10
16	8
36	12
22	10
28	10
22	10
18	10
20	8
30	10
22	10
110	14
44	12
35	11
30	10
33	9
50	14
40	12
29	9
18	10
12	8
22	10
16	8
18	10
20	8
29	9
38	10
20	8
22	10
28	12
35	11
16	8
38	10
20	8
12	8
48	12
20	8
22	10
58	14
16	8
133	17
38	10
43	11
30	10
29	9
38	10
30	10
18	10
24	12
30	10
24	12
8	8
37	11
12	8
8	8
26	10
12	8
12	8
56	14
12	8
38	10
19	7
35	11
8	8
102	16
38	10
16	8
18	10
8	8
8	8
35	11
8	8
16	8
30	10
8	8
12	8
108	16
28	10
48	14
20	8
8	8
22	10
22	10
16	8
26	10
36	12
18	10
10	10
22	10
19	7
10	10
26	10
8	8
22	10
8	8
16	8
12	8
14	8
8	8
24	12
18	10
18	10
18	10
22	10
12	8
18	10
30	10
10	10
38	10
38	10
22	10
12	8
8	8
28	10
16	8
19	7
30	10
20	8
22	10
18	10
29	9
20	8
16	8
16	8
12	8
35	11
40	12
90	16
12	8
18	10
104	16
18	10
8	8
12	8
30	10
44	12
16	8
38	10
28	10
8	8
8	8
38	10
8	8
22	10
33	9
8	8
18	10
18	10
88	16
43	11
22	10
26	12
18	10
30	10
18	10
18	10
19	7
16	8
20	8
20	8
30	10
20	8
20	8
16	8
43	11
20	8
24	12
30	10
8	8
28	10
19	7
46	14
33	9
22	10
22	10
32	12
30	10
16	8
43	11
16	8
24	12
8	8
8	8
116	16
29	9
37	11
43	11
12	8
18	10
10	10
22	10
8	8
18	10
18	10
35	11
26	10
22	10
10	10
22	10
30	10
20	8
29	9
20	8
38	10
12	8
16	8
10	10
18	10
26	10
10	10
30	10
38	10
12	8
36	12
18	10
43	11
12	8
16	8
18	10
29	9
38	10
33	9
16	8
29	9
38	10
36	12
8	8
20	8
90	16
8	8
8	8
30	10
22	10
29	9
8	8
18	10
16	8
74	14
12	8
22	10
20	8
30	10
16	8
20	8
12	8
43	11
32	12
22	10
20	8
38	10
8	8
16	8
26	10
12	8
18	10
22	10
48	12
29	9
100	16
20	8
20	8
16	8
36	12
43	11
26	10
20	8
16	8
10	10
38	10
30	10
39	11
22	10
30	10
16	8
8	8
30	10
28	10
16	8
22	10
20	8
24	12
43	11
30	10
20	8
30	10
19	7
19	7
16	8
16	8
28	10
16	8
16	8
16	8
22	10
8	8
38	10
40	12
22	10
38	10
20	8
8	8
28	10
30	10
112	16
22	10
18	10
35	11
19	7
8	8
104	16
18	10
38	10
22	10
12	8
19	7
18	10
30	10
16	8
12	8
24	12
22	10
8	8
16	8
8	8
16	8
16	8
16	8
16	8
30	10
33	9
19	7
38	10
20	8
18	10
18	10
8	8
16	8
12	8
16	8
16	8
16	8
38	10
18	10
38	10
18	10
38	10
29	9
18	10
16	8
18	10
20	8
44	12
20	8
8	8
12	8
20	8
22	10
18	10
19	7
22	10
26	10
16	8
8	8
28	12
16	8
18	10
12	8
50	14
20	8
38	10
14	8
30	10
26	10
22	10
8	8
35	11
16	8
16	8
22	10
20	12
105	17
19	7
12	8
28	10
30	10
20	8
16	8
24	12
8	8
20	8
12	8
22	10
16	8
22	10
14	10
18	10
35	11
19	7
16	8
22	10
22	10
30	10
43	11
30	10
38	10
20	8
35	11
16	8
19	7
22	10
40	12
18	10
30	10
18	10
101	17
43	11
18	10
8	8
22	10
12	8
20	8
30	10
48	12
24	12
18	10
38	10
16	8
19	7
8	8
19	7
22	10
20	8
8	8
19	7
24	12
43	11
158	20
16	8
16	8
38	10
12	8
22	10
14	8
22	10
18	10
18	10
48	12
33	9
18	10
8	8
88	16
29	9
44	12
38	10
80	16
8	8
10	10
8	8
16	8
20	8
12	8
8	8
8	8
109	17
16	8
18	10
16	8
18	10
19	7
16	8
38	10
35	11
18	10
16	8
30	10
12	8
29	9
38	10
20	8
12	8
16	8
36	12
48	12
29	9
43	11
8	8
8	8
18	10
12	8
18	10
12	8
50	14
16	8
12	8
14	10
43	11
8	8
14	8
8	8
20	8
18	10
30	10
12	8
29	9
12	8
20	8
38	10
14	8
8	8
30	10
30	10
43	11
36	12
90	16
112	16
18	10
8	8
16	8
20	8
22	10
18	10
26	10
10	10
8	8
20	8
35	11
16	8
22	10
18	10
38	10
16	8
30	10
8	8
112	16
18	10
90	16
18	10
33	9
16	8
8	8
12	8
29	9
22	10
12	8
15	9
22	10
20	8
26	10
36	12
14	10
22	10
43	11
18	10
22	10
22	10
28	10
76	14
18	10
101	17
18	10
18	10
112	16
22	10
22	10
110	14
36	12
12	8
36	12
16	8
12	8
18	10
20	8
20	8
43	11
16	8
19	7
16	8
12	8
8	8
16	8
16	8
43	11
10	10
16	8
22	10
20	8
16	8
22	10
32	12
22	10
12	8
8	8
12	8
12	8
18	10
26	10
16	8
12	8
20	8
40	12
22	10
12	8
22	10
110	18
18	10
38	10
20	8
8	8
20	8
22	10
16	8
38	10
16	8
18	10
16	8
30	10
18	10
20	8
12	8
35	11
8	8
36	12
43	11
43	11
20	8
22	10
12	8
16	8
30	10
20	8
8	8
22	10
38	10
12	8
18	10
110	16
15	9
44	12
33	9
22	10
16	8
16	8
35	11
22	10
16	8
20	8
22	10
30	10
19	7
26	10
8	8
39	11
43	11
20	8
20	8
22	10
24	12
30	10
16	8
22	10
35	11
12	8
36	12
16	8
28	12
29	9
18	10
22	10
33	9
29	9
18	10
16	8
12	8
12	8
37	11
8	8
8	8
12	8
38	10
14	10
16	8
15	9
130	18
43	11
44	12
20	8
20	8
76	14
30	10
8	8
22	10
22	10
30	10
18	10
18	10
20	8
38	10
16	8
12	8
28	10
12	8
29	9
20	8
16	8
16	8
35	11
32	12
22	10
18	10
34	12
43	11
8	8
18	10
44	12
8	8
15	9
16	8
22	10
8	8
12	8
43	11
32	12
12	8
12	8
33	9
28	10
16	8
43	11
29	9
22	10
22	10
16	8
16	8
26	10
18	10
16	8
118	18
12	8
19	7
8	8
43	11
19	7
8	8
16	8
20	8
116	18
38	10
50	14
16	8
16	8
36	12
12	8
22	10
22	10
16	8
30	10
16	8
54	14
48	12
22	10
10	10
20	8
94	16
20	8
20	8
8	8
18	10
40	12
18	10
22	10
12	8
22	10
20	8
8	8
104	16
18	10
20	8
19	7
33	9
30	10
28	10
16	8
38	10
30	10
33	9
43	11
43	11
26	10
36	12
16	8
30	10
8	8
26	10
8	8
20	8
18	10
40	12
18	10
43	11
18	10
12	8
16	8
43	11
16	8
8	8
22	10
16	8
18	10
20	8
20	8
8	8
16	8
18	10
12	8
44	12
26	10
33	9
30	10
94	14
29	9
46	14
26	10
22	10
36	12
20	12
16	8
22	10
20	8
26	12
22	10
39	11
22	10
35	11
18	10
20	8
40	12
18	10
12	8
20	8
24	12
36	12
20	12
20	8
18	10
16	8
18	10
20	8
44	12
14	10
30	10
20	8
14	10
28	12
8	8
134	18
22	10
16	8
22	10
8	8
16	8
18	10
19	7
30	10
19	7
38	10
33	9
20	8
43	11
18	10
18	10
18	10
18	10
16	8
38	10
24	12
20	8
44	12
43	11
26	10
38	10
50	14
12	8
16	8
19	7
8	8
16	8
18	10
30	10
15	9
38	10
10	10
22	10
30	10
36	12
22	10
22	10
33	9
24	12
30	10
22	10
43	11
8	8
20	8
22	10
50	14
22	10
43	11
19	7
8	8
12	8
29	9
18	10
28	10
44	12
35	11
22	10
22	10
48	12
36	12
20	8
18	10
56	14
15	9
8	8
20	8
40	12
16	8
26	10
22	10
8	8
98	14
16	8
8	8
10	10
10	10
19	7
80	16
16	8
38	10
18	10
20	8
29	9
26	10
16	8
29	9
8	8
36	12
22	10
22	10
29	9
22	10
14	8
18	10
28	10
43	11
18	10
22	10
18	10
28	10
8	8
43	11
22	10
19	7
22	10
12	8
43	11
16	8
36	12
22	10
8	8
20	8
18	10
20	8
18	10
28	10
22	10
29	9
18	10
12	8
30	10
30	10
98	14
22	10
12	8
12	8
28	10
38	10
20	8
14	8
20	8
8	8
30	10
8	8
18	10
33	9
22	10
19	7
22	10
12	8
106	14
22	10
20	8
48	12
38	10
50	14
18	10
33	9
24	12
42	14
30	10
30	10
38	10
20	8
20	8
12	8
30	10
38	10
18	10
20	8
80	14
22	10
22	10
26	10
28	12
16	8
20	8
22	10
16	8
22	10
22	10
32	12
18	10
76	16
20	8
36	12
22	10
20	8
14	10
22	10
30	10
30	10
130	18
22	10
22	10
30	10
8	8
14	8
26	10
16	8
16	8
10	10
43	11
8	8
8	8
12	8
37	11
43	11
38	10
20	8
38	10
10	10
19	7
12	8
43	11
43	11
43	11
32	12
38	10
30	10
36	12
8	8
8	8
22	10
8	8
19	7
43	11
18	10
20	8
28	10
20	8
38	10
43	11
22	10
38	10
10	10
22	10
12	8
94	14
20	8
160	20
33	9
16	8
30	10
20	8
22	10
18	10
30	10
8	8
38	10
8	8
12	8
15	9
19	7
18	10
38	10
8	8
20	8
8	8
32	12
29	9
20	8
8	8
38	10
24	12
18	10
8	8
28	10
12	8
20	8
44	12
20	8
18	10
12	8
30	10
18	10
16	8
8	8
8	8
18	10
36	12
8	8
12	8
110	14
35	11
16	8
19	7
44	12
100	16
20	8
38	10
22	10
29	9
8	8
24	12
12	8
26	10
18	10
18	10
8	8
12	8
8	8
15	9
29	9
8	8
26	10
8	8
44	12
19	7
16	8
22	10
16	8
38	10
8	8
22	10
43	11
29	9
35	11
22	10
12	8
8	8
22	10
44	12
22	10
20	8
30	10
26	10
26	10
8	8
35	11
8	8
40	12
12	8
43	11
16	8
24	12
12	8
16	8
22	10
20	8
8	8
22	10
8	8
18	10
16	10
43	11
43	11
30	10
12	8
22	10
28	10
16	8
12	8
20	8
22	10
24	12
12	8
38	10
8	8
14	8
38	10
28	12
12	8
100	16
108	16
8	8
18	10
43	11
8	8
43	11
12	8
8	8
22	10
16	8
20	8
30	10
30	10
22	10
8	8
38	10
30	10
8	8
24	12
30	10
40	12
18	10
29	9
29	9
22	10
20	8
22	10
160	20
20	8
29	9
12	8
22	10
8	8
26	10
36	12
44	14
12	8
26	10
22	10
33	9
8	8
38	10
28	10
18	10
16	8
44	12
16	8
38	10
18	10
38	10
22	10
38	10
18	10
12	8
26	10
18	10
26	10
20	8
44	12
48	12
18	10
16	8
16	8
18	10
29	9
22	10
29	9
20	8
22	10
8	8
20	8
36	12
18	10
22	10
20	8
16	8
12	8
32	12
30	10
28	10
20	8
24	12
19	7
32	12
20	8
20	8
38	10
10	10
12	8
18	10
16	8
8	8
18	10
30	10
43	11
80	16
32	12
12	8
22	10
12	8
14	10
43	11
8	8
20	12
18	10
35	11
43	11
22	10
22	10
30	10
30	10
16	8
24	12
18	10
22	10
8	8
22	10
8	8
30	10
29	9
19	7
48	12
18	10
12	8
18	10
12	8
30	10
20	8
12	8
43	11
38	10
43	11
8	8
30	10
40	12
12	8
43	11
18	10
16	8
22	10
22	10
43	11
16	8
38	10
30	10
8	8
26	10
30	10
16	8
33	9
22	10
16	8
35	11
12	8
29	9
8	8
10	10
30	10
20	8
30	10
58	14
16	8
35	11
8	8
12	8
38	10
18	10
22	10
8	8
18	10
18	10
43	11
16	8
18	10
44	12
20	8
30	10
12	8
30	10
16	8
18	10
18	10
8	8
30	10
28	10
8	8
8	8
43	11
30	10
22	10
12	8
12	8
12	8
38	10
22	10
19	7
8	8
16	8
12	8
12	8
40	12
19	7
38	10
22	10
30	10
22	10
16	8
18	10
22	10
36	12
20	8
20	8
26	12
43	11
12	8
16	8
33	9
12	8
22	10
22	10
8	8
30	10
16	8
18	10
12	8
98	14
16	8
12	8
40	12
30	10
20	8
22	10
28	10
30	10
18	10
30	10
18	10
16	8
12	8
8	8
33	9
22	10
12	8
16	8
22	10
35	11
22	10
8	8
22	10
44	12
18	10
88	16
20	8
18	10
32	12
10	10
18	10
20	8
12	8
19	7
28	12
152	20
33	9
30	10
43	11
12	8
42	12
22	10
16	8
20	8
20	8
38	10
20	8
12	8
8	8
8	8
19	7
29	9
8	8
28	10
12	8
18	10
28	12
43	11
20	8
22	10
30	10
22	10
44	12
39	11
38	10
22	10
8	8
30	10
43	11
29	9
12	8
38	10
20	8
8	8
22	10
18	10
18	10
16	8
20	8
30	10
20	8
8	8
19	7
30	10
38	10
30	10
8	8
137	17
22	10
24	12
12	8
48	12
30	10
18	10
122	18
36	12
30	10
16	8
33	9
8	8
26	10
20	8
20	8
12	8
14	8
24	12
16	8
18	10
30	10
14	10
35	11
16	8
32	12
16	8
38	10
30	10
44	12
22	10
12	8
18	10
38	10
30	10
16	8
20	8
22	10
35	11
18	10
26	10
43	11
48	12
16	8
38	10
20	8
30	10
30	10
35	11
22	10
30	10
22	10
38	10
8	8
78	14
8	8
22	10
16	8
84	16
12	8
33	9
33	9
28	10
20	8
20	8
43	11
19	7
16	8
14	8
22	10
18	10
33	9
43	11
30	10
33	9
18	10
35	11
35	11
22	10
43	11
8	8
40	12
43	11
12	8
18	10
58	14
20	8
38	10
116	18
36	12
22	10
8	8
29	9
43	11
30	10
18	10
30	10
30	10
18	10
16	8
14	10
177	21
22	10
18	10
12	8
12	8
20	8
20	8
20	8
22	10
30	10
36	12
30	10
20	8
12	8
44	12
8	8
48	12
43	11
112	16
38	10
30	10
16	8
22	10
33	9
22	10
38	10
43	11
10	10
22	10
8	8
22	10
8	8
30	10
19	7
12	8
44	12
28	10
30	10
26	10
18	10
16	8
8	8
22	10
28	10
18	10
8	8
12	8
30	10
48	12
28	10
33	9
22	10
8	8
20	8
20	8
20	8
12	8
18	10
18	10
22	10
16	8
12	8
8	8
24	12
22	10
22	10
15	9
22	10
8	8
43	11
24	12
22	10
8	8
16	8
15	9
43	11
8	8
43	11
8	8
18	10
16	8
22	10
12	8
16	8
16	8
40	12
18	10
22	10
16	8
15	9
12	8
28	12
30	10
20	8
12	8
10	10
28	10
22	10
22	10
33	9
38	10
22	10
8	8
12	8
22	10
28	10
16	8
8	8
37	11
20	8
12	8
16	8
19	7
43	11
33	9
30	10
16	8
33	9
18	10
12	8
26	10
8	8
22	10
12	8
106	14
43	11
40	12
22	10
28	10
22	10
30	10
18	10
43	11
22	10
14	8
8	8
38	10
20	12
18	10
18	10
18	10
38	10
18	10
26	10
16	8
22	10
8	8
22	10
10	10
22	10
26	10
8	8
16	8
8	8
137	17
28	10
16	8
33	9
8	8
8	8
18	10
18	10
22	10
22	10
30	10
8	8
22	10
20	8
18	10
20	8
8	8
8	8
26	10
104	16
22	10
20	8
12	8
29	9
18	10
18	10
18	10
19	7
18	10
18	10
38	10
26	10
32	12
62	14
19	7
12	8
22	10
15	9
12	8
30	10
16	8
12	8
22	10
33	9
22	10
16	8
18	10
12	8
12	8
12	8
12	8
20	12
43	11
20	8
88	16
22	10
22	10
20	8
30	10
20	8
38	10
38	10
19	7
8	8
24	12
94	14
43	11
22	10
20	8
28	10
30	10
29	9
22	10
22	10
28	10
22	10
16	8
8	8
16	8
22	10
16	8
8	8
43	11
12	8
38	10
20	8
36	12
19	7
22	10
22	10
38	10
30	10
20	8
22	10
30	10
20	8
16	8
22	10
8	8
12	8
8	8
16	8
18	10
18	10
22	10
38	10
30	10
8	8
43	11
26	10
8	8
22	10
30	10
8	8
29	9
30	10
16	8
12	8
38	10
30	10
30	10
30	10
16	8
26	10
8	8
18	10
30	10
18	10
22	10
19	7
48	12
8	8
26	10
16	8
19	7
16	8
19	7
22	10
22	10
18	10
43	11
38	10
8	8
29	9
12	8
16	8
20	8
8	8
18	10
12	8
20	8
22	10
16	8
43	11
8	8
18	10
8	8
12	8
78	14
22	10
16	8
22	10
22	10
33	9
22	10
19	7
22	10
12	8
18	10
43	11
56	14
36	12
19	7
12	8
43	11
18	10
22	10
26	10
43	11
30	10
32	12
20	8
22	10
18	10
110	14
22	10
22	10
38	10
10	10
12	8
18	10
16	8
18	10
22	10
18	10
30	10
44	12
12	8
125	17
12	8
36	12
28	10
16	8
18	10
20	8
22	10
50	14
20	8
80	16
43	11
20	8
8	8
30	10
30	10
30	10
22	10
20	8
30	10
18	10
16	8
30	10
20	8
12	8
20	8
43	11
18	10
28	10
19	7
22	10
20	8
20	12
38	10
36	12
20	12
16	8
10	10
8	8
19	7
15	9
20	8
10	10
12	8
8	8
16	8
40	12
39	11
22	10
28	12
43	11
35	11
22	10
10	10
18	10
16	8
20	8
28	10
19	7
30	10
30	10
84	16
8	8
19	7
38	10
12	8
44	12
8	8
20	12
38	10
38	10
20	8
106	14
20	8
20	8
43	11
18	10
8	8
20	12
16	8
33	9
18	10
14	10
36	12
16	8
20	8
28	10
22	10
156	20
22	10
18	10
12	8
43	11
16	8
19	7
18	10
20	8
26	10
54	14
43	11
12	8
48	12
12	8
12	8
18	10
38	10
20	8
30	10
22	10
8	8
35	11
12	8
18	10
16	8
22	10
22	10
20	8
19	7
20	8
22	10
88	16
43	11
22	10
8	8
22	10
22	10
18	10
38	10
16	8
32	12
38	10
8	8
43	11
20	8
33	9
152	20
43	11
8	8
18	10
29	9
38	10
12	8
20	8
14	10
20	8
16	8
22	10
18	10
19	7
43	11
8	8
38	10
19	7
20	8
22	10
26	10
88	16
22	10
18	10
18	10
14	8
34	12
20	8
10	10
43	11
19	7
28	10
35	11
22	10
38	10
19	7
18	10
44	12
20	8
12	8
18	10
126	18
8	8
8	8
12	8
44	12
43	11
26	10
38	10
18	10
16	8
24	12
16	8
8	8
18	10
43	11
18	10
18	10
43	11
29	9
8	8
18	10
18	10
12	8
19	7
26	10
19	7
43	11
15	9
28	10
18	10
8	8
16	8
22	10
12	8
16	8
36	12
26	10
22	10
12	8
8	8
16	8
43	11
19	7
18	10
22	10
18	10
18	10
8	8
16	8
8	8
35	11
30	10
22	10
18	10
43	11
16	8
15	9
16	8
36	12
12	8
8	8
134	18
8	8
20	8
16	8
18	10
40	12
18	10
16	8
28	10
38	10
19	7
12	8
35	11
22	10
43	11
8	8
18	10
30	10
22	10
20	8
12	8
8	8
30	10
32	12
12	8
22	10
18	10
38	10
12	8
33	9
76	14
22	10
8	8
12	8
16	8
44	12
110	16
58	14
16	8
12	8
16	8
18	10
32	12
18	10
38	10
22	10
50	14
12	8
28	10
40	12
8	8
16	8
10	10
40	12
26	10
12	8
16	8
12	8
16	8
43	11
20	8
22	10
30	10
22	10
130	18
15	9
18	10
16	8
16	8
35	11
20	8
8	8
22	10
16	8
43	11
24	12
43	11
22	10
38	10
116	18
38	10
50	14
43	11
8	8
28	10
8	8
8	8
22	10
28	10
8	8
30	10
22	10
12	8
8	8
33	9
22	10
33	9
22	10
20	8
28	10
22	10
12	8
43	11
18	10
90	16
38	10
28	10
16	8
20	8
12	8
24	12
8	8
30	10
8	8
22	10
12	8
8	8
30	10
8	8
12	8
22	10
8	8
32	12
16	8
40	12
12	8
18	10
30	10
22	10
10	10
40	12
19	7
8	8
8	8
18	10
30	10
43	11
22	10
43	11
33	9
38	10
38	10
18	10
38	10
12	8
35	11
18	10
18	10
8	8
40	12
12	8
20	8
20	8
50	14
30	10
12	8
18	10
24	12
12	8
12	8
22	10
35	11
16	8
36	12
18	10
8	8
38	10
43	11
36	12
16	8
19	7
8	8
18	10
8	8
16	8
40	12
19	7
14	10
12	8
38	10
8	8
20	8
18	10
48	12
22	10
94	14
8	8
18	10
30	10
35	11
18	10
22	10
8	8
8	8
22	10
24	12
8	8
92	16
8	8
28	10
24	12
19	7
28	10
12	8
43	11
30	10
36	12
18	10
22	10
30	10
20	8
44	12
43	11
12	8
20	12
20	8
18	10
106	14
30	10
38	10
8	8
22	10
8	8
29	9
18	10
38	10
20	8
18	10
8	8
18	10
20	8
22	10
12	8
50	14
43	11
20	8
28	10
30	10
28	12
16	8
22	10
88	16
22	10
30	10
43	11
30	10
16	8
26	10
18	10
12	8
30	10
20	8
16	8
8	8
18	10
20	8
19	7
20	8
43	11
8	8
12	8
30	10
30	10
43	11
26	10
22	10
38	10
16	8
16	8
30	10
36	12
16	8
26	10
112	16
33	9
22	10
40	12
22	10
16	8
8	8
30	10
20	8
33	9
8	8
16	8
43	11
8	8
12	8
12	8
16	8
36	12
40	12
43	11
19	7
18	10
18	10
20	8
22	10
12	8
76	14
22	10
16	8
43	11
18	10
18	10
38	10
43	11
22	10
22	10
38	10
30	10
32	12
16	8
19	7
80	16
33	9
22	10
18	10
18	10
16	8
10	10
26	10
43	11
16	8
19	7
12	8
112	16
104	16
22	10
28	12
16	8
18	10
14	8
30	10
12	8
30	10
19	7
16	8
18	10
22	10
12	8
20	8
16	8
16	8
18	10
12	8
35	11
8	8
16	8
12	8
18	10
18	10
22	10
8	8
43	11
43	11
20	8
30	10
16	8
43	11
18	10
19	7
8	8
22	10
22	10
43	11
30	10
16	8
48	12
22	10
19	7
32	12
30	10
18	10
8	8
18	10
30	10
12	8
18	10
22	10
38	10
18	10
30	10
26	10
12	8
18	10
22	10
95	17
20	8
28	10
19	7
35	11
18	10
43	11
28	10
10	10
8	8
14	10
30	10
140	20
8	8
8	8
12	8
43	11
8	8
8	8
16	8
20	8
16	8
18	10
22	10
8	8
19	7
18	10
12	8
22	10
28	10
20	8
38	10
22	10
22	10
38	10
12	8
116	18
12	8
28	12
19	7
19	7
29	9
18	10
30	10
38	10
40	12
40	12
18	10
28	10
22	10
12	8
76	14
43	11
16	8
8	8
14	10
90	16
20	8
28	10
8	8
18	10
26	10
12	8
18	10
22	10
43	11
28	10
18	10
22	10
43	11
36	12
20	8
33	9
44	12
38	10
76	14
8	8
30	10
43	11
28	10
16	8
20	8
36	12
38	10
29	9
38	10
80	16
20	8
18	10
18	10
18	10
12	8
18	10
12	8
8	8
16	8
8	8
18	10
22	10
36	12
30	10
28	10
8	8
20	8
36	12
12	8
16	8
33	9
38	10
40	12
33	9
26	12
35	11
8	8
30	10
18	10
38	10
20	8
38	10
22	10
28	10
29	9
12	8
22	10
12	8
20	8
29	9
18	10
43	11
18	10
20	8
16	8
22	10
32	12
22	10
8	8
8	8
16	8
12	8
50	14
16	8
38	10
48	12
12	8
16	8
12	8
24	12
18	10
12	8
20	8
36	12
18	10
22	10
22	10
12	8
20	8
18	10
29	9
22	10
16	8
20	8
16	8
44	12
35	11
38	10
18	10
30	10
116	16
18	10
16	8
37	11
56	14
12	8
88	16
8	8
20	8
19	7
12	8
8	8
18	10
20	8
16	8
12	8
16	8
24	12
26	10
20	8
16	8
40	12
32	12
8	8
37	11
18	10
8	8
30	10
12	8
18	10
28	10
22	10
19	7
18	10
16	8
16	8
28	10
22	10
16	8
22	10
32	12
38	10
58	14
18	10
8	8
20	8
33	9
16	8
20	8
100	16
24	12
40	12
22	10
15	9
22	10
28	10
16	8
12	8
18	10
30	10
43	11
19	7
30	10
16	8
20	8
35	11
30	10
22	10
28	10
20	8
8	8
12	8
8	8
16	8
16	8
16	8
116	18
37	11
30	10
74	14
16	8
12	8
14	10
16	8
18	10
43	11
22	10
22	10
19	7
18	10
22	10
8	8
36	12
8	8
22	10
26	10
36	12
22	10
22	10
22	10
18	10
92	16
20	8
12	8
16	8
18	10
38	10
30	10
26	10
44	12
38	10
16	8
22	10
8	8
14	8
8	8
38	10
35	11
38	10
12	8
20	8
29	9
35	11
30	10
20	8
18	10
18	10
8	8
16	8
12	8
39	11
22	10
28	10
35	11
38	10
100	16
29	9
116	18
22	10
29	9
28	10
40	12
16	8
20	8
44	12
30	10
33	9
36	12
12	8
20	8
33	9
22	10
12	8
43	11
22	10
22	10
8	8
8	8
19	7
20	8
44	12
18	10
90	16
58	14
38	10
32	12
35	11
18	10
16	8
22	10
36	12
18	10
20	12
30	10
16	8
16	8
18	10
30	10
15	9
12	8
12	8
30	10
12	8
8	8
16	8
16	8
12	8
16	8
8	8
16	8
18	10
22	10
30	10
20	8
8	8
28	10
22	10
16	8
22	10
18	10
38	10
8	8
20	8
30	10
38	10
30	10
20	8
35	11
20	8
38	10
12	8
8	8
20	8
18	10
8	8
16	8
30	10
18	10
20	8
90	16
8	8
12	8
16	8
29	9
22	10
18	10
20	8
104	16
20	8
38	10
36	12
29	9
35	11
30	10
76	14
20	8
12	8
22	10
33	9
12	8
18	10
38	10
43	11
18	10
19	7
30	10
30	10
88	16
29	9
18	10
24	12
106	16
12	8
22	10
26	10
18	10
18	10
20	8
22	10
106	14
12	8
20	8
43	11
12	8
8	8
22	10
8	8
22	10
20	8
22	10
8	8
12	8
38	10
16	8
12	8
15	9
12	8
26	10
12	8
16	8
12	8
20	8
19	7
12	8
8	8
20	8
8	8
35	11
8	8
26	10
30	10
18	10
35	11
43	11
38	10
20	8
8	8
12	8
8	8
22	10
18	10
88	16
22	10
18	10
20	8
36	12
18	10
18	10
43	11
43	11
22	10
22	10
19	7
14	10
22	10
16	8
16	8
22	10
44	12
19	7
38	10
30	10
12	8
8	8
22	10
18	10
8	8
33	9
30	10
22	10
19	7
33	9
16	8
36	12
156	20
22	10
43	11
35	11
8	8
28	10
48	12
30	10
8	8
43	11
44	12
52	14
16	8
15	9
35	11
36	12
22	10
22	10
20	8
8	8
38	10
22	10
19	7
16	8
14	8
16	8
16	8
16	8
30	10
16	8
28	10
35	11
43	11
43	11
12	8
38	10
18	10
12	8
38	10
22	10
33	9
12	8
30	10
19	7
33	9
30	10
8	8
36	12
8	8
10	10
30	10
18	10
12	8
18	10
22	10
20	8
20	8
12	8
8	8
22	10
12	8
35	11
22	10
20	8
18	10
26	10
43	11
35	11
22	10
22	10
22	10
30	10
26	10
43	11
30	10
16	8
44	12
18	10
12	8
44	12
24	12
30	10
18	10
16	8
8	8
16	8
19	7
48	12
33	9
20	8
50	14
18	10
28	12
22	10
16	8
30	10
16	8
40	12
30	10
33	9
18	10
35	11
16	8
18	10
8	8
12	8
29	9
22	10
28	12
38	10
39	11
22	10
8	8
44	12
8	8
8	8
12	8
38	10
19	7
22	10
14	10
12	8
20	8
20	8
30	10
18	10
8	8
16	8
38	10
12	8
43	11
20	8
30	10
20	8
30	10
30	10
35	11
18	10
12	8
20	8
36	12
38	10
22	10
16	8
14	10
18	10
12	8
29	9
35	11
16	8
29	9
33	9
28	10
22	10
20	8
12	8
19	7
43	11
74	14
28	10
26	10
36	12
18	10
18	10
40	12
33	9
22	10
43	11
42	14
22	10
40	12
43	11
32	12
12	8
36	12
8	8
110	16
28	10
20	8
30	10
22	10
20	8
30	10
30	10
38	10
29	9
12	8
8	8
20	8
18	10
16	8
36	12
20	8
22	10
30	10
20	8
28	10
22	10
12	8
12	8
30	10
8	8
8	8
18	10
10	10
12	8
33	9
18	10
22	10
16	8
8	8
43	11
30	10
33	9
39	11
19	7
36	12
38	10
33	9
16	8
18	10
12	8
8	8
12	8
30	10
38	10
18	10
43	11
22	10
24	12
28	10
22	10
30	10
18	10
8	8
12	8
46	14
43	11
8	8
43	11
28	10
30	10
8	8
18	10
22	10
22	10
43	11
22	10
22	10
22	10
30	10
20	8
12	8
29	9
30	10
38	10
12	8
43	11
8	8
30	10
8	8
22	10
12	8
8	8
8	8
22	10
20	8
12	8
18	10
20	8
30	10
37	11
44	12
44	12
20	8
76	14
8	8
43	11
8	8
18	10
12	8
30	10
38	10
35	11
8	8
30	10
36	12
38	10
20	8
29	9
12	8
22	10
12	8
22	10
16	8
22	10
28	10
8	8
30	10
22	10
29	9
12	8
16	8
33	9
22	10
16	8
30	10
8	8
20	8
20	12
16	8
22	10
18	10
38	10
22	10
18	10
20	12
20	8
29	9
8	8
8	8
30	10
18	10
30	10
37	11
20	8
18	10
20	8
15	9
22	10
14	10
29	9
16	8
44	14
22	10
16	8
12	8
16	8
30	10
8	8
40	12
22	10
38	10
18	10
22	10
22	10
16	8
43	11
22	10
39	11
8	8
30	10
12	8
22	10
22	10
22	10
29	9
98	14
43	11
8	8
38	10
20	8
18	10
30	10
22	10
46	14
8	8
30	10
22	10
30	10
19	7
26	10
16	8
12	8
28	10
30	10
12	8
36	12
18	10
20	8
12	8
28	12
8	8
33	9
18	10
43	11
88	16
8	8
18	10
22	10
40	12
30	10
8	8
30	10
8	8
18	10
8	8
18	10
44	12
28	10
18	10
22	10
22	10
16	8
26	10
42	12
44	14
43	11
28	12
19	7
16	8
28	12
19	7
12	8
14	10
88	16
18	10
22	10
20	8
28	10
20	8
28	10
30	10
44	12
50	14
22	10
22	10
14	8
16	8
22	10
18	10
29	9
20	8
43	11
16	8
18	10
50	14
43	11
35	11
20	8
16	8
30	10
29	9
43	11
22	10
30	10
16	8
19	7
20	8
18	10
12	8
35	11
19	7
8	8
18	10
18	10
8	8
38	10
16	8
16	8
19	7
14	8
20	8
38	10
8	8
18	10
22	10
20	8
12	8
16	8
24	12
20	8
28	10
18	10
12	8
8	8
44	12
38	10
22	10
16	8
16	8
36	12
18	10
14	10
35	11
16	8
35	11
12	8
18	10
12	8
22	10
20	8
8	8
28	10
20	8
36	12
19	7
24	12
29	9
26	12
33	9
12	8
40	12
18	10
18	10
28	10
18	10
20	8
18	10
40	12
20	8
30	10
20	8
40	12
12	8
12	8
20	8
20	8
19	7
28	10
22	10
43	11
28	12
36	12
16	8
16	8
8	8
19	7
14	8
10	10
48	12
22	10
8	8
14	8
15	9
19	7
8	8
24	12
14	8
28	12
16	8
20	8
20	8
10	10
16	8
29	9
12	8
38	10
36	12
8	8
12	8
43	11
16	8
19	7
44	12
56	14
26	10
10	10
8	8
98	14
22	10
30	10
30	10
20	8
33	9
18	10
8	8
8	8
29	9
8	8
12	8
16	8
30	10
16	8
22	10
24	12
22	10
162	20
8	8
36	12
14	10
22	10
44	12
36	12
38	10
29	9
24	12
30	10
38	10
44	12
50	14
18	10
22	10
22	10
8	8
29	9
44	12
20	8
16	8
8	8
30	10
43	11
12	8
20	8
22	10
16	8
22	10
12	8
22	10
22	10
40	12
16	8
22	10
20	8
8	8
18	10
18	10
20	8
30	10
16	8
12	8
22	10
36	12
46	14
8	8
20	8
18	10
38	10
16	8
20	8
16	8
43	11
8	8
20	8
20	8
8	8
18	10
38	10
18	10
28	10
8	8
18	10
8	8
18	10
28	12
36	12
22	10
12	8
20	8
8	8
14	10
26	10
22	10
30	10
18	10
43	11
22	10
36	12
30	10
18	10
18	10
18	10
32	12
38	10
22	10
18	10
50	14
35	11
30	10
35	11
16	8
29	9
12	8
8	8
18	10
33	9
18	10
12	8
8	8
40	12
38	10
8	8
8	8
20	8
92	16
22	10
18	10
12	8
43	11
22	10
30	10
8	8
30	10
43	11
16	8
33	9
20	8
29	9
16	8
10	10
20	8
30	10
20	8
18	10
8	8
12	8
12	8
16	8
110	16
16	8
10	10
22	10
18	10
20	12
43	11
16	8
38	10
16	8
22	10
22	10
8	8
16	8
18	10
30	10
16	8
36	12
16	8
8	8
16	8
40	12
126	18
33	9
16	8
15	9
58	14
22	10
18	10
20	8
36	12
8	8
18	10
16	8
12	8
16	8
20	8
16	8
8	8
12	8
80	16
8	8
19	7
38	10
28	10
16	8
18	10
33	9
20	8
8	8
22	10
22	10
8	8
8	8
26	10
36	12
22	10
26	10
12	8
22	10
14	10
43	11
22	10
20	8
29	9
8	8
18	10
20	8
22	10
43	11
20	8
22	10
43	11
43	11
16	8
43	11
18	10
19	7
20	8
43	11
26	10
12	8
32	12
18	10
38	10
18	10
8	8
16	8
38	10
18	10
8	8
30	10
28	10
12	8
20	8
12	8
12	8
35	11
20	8
16	8
88	16
43	11
12	8
20	8
30	10
18	10
18	10
30	10
18	10
30	10
22	10
19	7
22	10
22	10
88	16
16	8
94	14
22	10
12	8
8	8
36	12
18	10
8	8
22	10
22	10
8	8
30	10
8	8
76	14
38	10
37	11
43	11
43	11
22	10
12	8
20	8
20	8
43	11
16	8
14	10
16	8
8	8
38	10
38	10
12	8
12	8
38	10
18	10
32	12
12	8
22	10
14	8
16	8
38	10
30	10
43	11
12	8
18	10
8	8
20	8
12	8
18	10
20	8
18	10
22	10
96	16
35	11
20	8
18	10
43	11
33	9
16	8
43	11
36	12
43	11
8	8
38	10
86	16
16	8
130	18
10	10
12	8
43	11
22	10
8	8
33	9
30	10
16	8
33	9
16	8
20	8
18	10
8	8
16	8
16	8
20	8
39	11
30	10
88	16
36	12
20	8
18	10
16	8
16	8
22	10
44	12
18	10
30	10
29	9
38	10
22	10
16	8
18	10
44	12
16	8
22	10
22	10
39	11
16	8
26	10
29	9
32	12
22	10
20	8
8	8
22	10
20	8
18	10
19	7
16	8
30	10
8	8
16	8
36	12
18	10
20	8
22	10
18	10
18	10
20	8
33	9
16	8
40	12
26	10
22	10
18	10
26	10
22	10
12	8
32	12
22	10
8	8
8	8
12	8
19	7
22	10
16	8
26	10
22	10
43	11
32	12
16	8
30	10
16	8
112	16
30	10
18	10
16	8
30	10
24	12
18	10
43	11
20	8
38	10
19	7
22	10
18	10
12	8
8	8
22	10
32	12
30	10
22	10
16	8
26	10
22	10
22	10
12	8
108	16
12	8
22	10
30	10
80	14
22	10
43	11
35	11
22	10
165	21
18	10
22	10
38	10
38	10
38	10
32	12
29	9
38	10
16	8
29	9
48	12
19	7
16	8
18	10
28	10
20	8
38	10
38	10
18	10
8	8
8	8
19	7
26	10
14	10
35	11
38	10
16	8
22	10
38	10
43	11
20	8
22	10
8	8
22	10
38	10
12	8
12	8
43	11
32	12
20	8
12	8
18	10
8	8
12	8
15	9
8	8
18	10
20	8
18	10
32	12
20	8
32	12
8	8
16	8
18	10
30	10
26	10
12	8
50	14
26	10
50	14
30	10
30	10
18	10
40	12
38	10
18	10
29	9
36	12
134	18
18	10
30	10
30	10
22	10
80	16
32	12
18	10
16	8
12	8
18	10
20	8
16	8
8	8
36	12
22	10
18	10
12	8
43	11
18	10
22	10
18	10
16	8
40	12
22	10
8	8
12	8
43	11
14	8
22	10
29	9
126	18
32	12
30	10
30	10
16	8
16	8
18	10
38	10
88	16
8	8
12	8
22	10
19	7
12	8
19	7
35	11
8	8
16	8
14	8
38	10
43	11
20	8
8	8
12	8
29	9
22	10
30	10
16	8
8	8
22	10
12	8
29	9
16	8
24	12
20	8
22	10
36	12
20	8
18	10
12	8
16	8
20	8
12	8
16	8
88	16
22	10
28	10
16	8
22	10
104	16
36	12
16	10
94	16
8	8
12	8
43	11
33	9
26	10
8	8
20	8
12	8
8	8
19	7
33	9
22	10
8	8
22	10
28	10
12	8
36	12
28	10
8	8
18	10
29	9
18	10
20	8
22	10
28	10
30	10
12	8
12	8
18	10
16	8
8	8
43	11
12	8
14	8
8	8
19	7
30	10
16	8
33	9
18	10
12	8
38	10
12	8
20	8
30	10
12	8
20	8
50	14
16	8
8	8
20	8
8	8
18	10
16	8
28	10
24	12
38	10
22	10
18	10
22	10
43	11
8	8
32	12
18	10
14	8
19	7
36	12
12	8
20	8
20	8
12	8
16	8
16	8
20	8
8	8
18	10
20	8
18	10
18	10
19	7
22	10
16	8
22	10
43	11
18	10
58	14
8	8
30	10
38	10
20	8
8	8
30	10
20	8
8	8
16	8
38	10
144	20
33	9
20	8
43	11
26	10
12	8
20	8
18	10
43	11
8	8
16	8
38	10
22	10
30	10
18	10
112	16
20	8
22	10
18	10
18	10
18	10
22	10
22	10
14	8
35	11
39	11
38	10
18	10
20	8
38	10
8	8
29	9
16	8
18	10
20	8
36	12
38	10
33	9
22	10
14	10
30	10
8	8
35	11
20	8
18	10
22	10
18	10
16	8
20	8
38	10
30	10
30	10
12	8
43	11
22	10
18	10
16	8
12	8
36	12
38	10
16	8
19	7
28	10
8	8
22	10
22	10
22	10
29	9
18	10
40	12
30	10
22	10
8	8
20	8
76	14
18	10
32	12
22	10
24	12
22	10
29	9
19	7
30	10
20	8
18	10
118	18
43	11
19	7
20	8
12	8
48	12
50	14
18	10
8	8
8	8
44	12
50	14
16	8
30	10
12	8
62	14
22	10
43	11
22	10
18	10
18	10
18	10
22	10
22	10
22	10
30	10
8	8
22	10
22	10
58	14
35	11
22	10
43	11
18	10
30	10
20	8
38	10
18	10
19	7
16	8
44	12
22	10
43	11
40	12
20	8
38	10
12	8
12	8
40	12
22	10
8	8
33	9
76	14
12	8
16	8
18	10
38	10
12	8
20	8
26	10
16	8
28	12
15	9
16	8
32	12
12	8
26	10
20	8
44	12
12	8
26	10
28	10
22	10
18	10
40	12
30	10
30	10
22	10
18	10
8	8
8	8
22	10
30	10
20	8
19	7
20	8
18	10
15	9
30	10
16	8
20	8
12	8
38	10
22	10
16	8
40	12
29	9
22	10
38	10
12	8
30	10
30	10
20	8
16	8
16	8
8	8
8	8
20	8
33	9
37	11
8	8
50	14
22	10
8	8
8	8
22	10
18	10
36	12
8	8
22	10
20	8
8	8
18	10
44	12
22	10
18	10
22	10
22	10
20	8
26	10
12	8
30	10
22	10
43	11
35	11
16	8
8	8
20	8
22	10
33	9
18	10
16	8
20	8
8	8
50	14
18	10
22	10
8	8
26	10
22	10
8	8
20	8
30	10
20	8
8	8
8	8
18	10
12	8
20	12
35	11
18	10
29	9
43	11
18	10
20	8
26	10
43	11
74	14
8	8
16	8
38	10
42	12
44	12
12	8
19	7
18	10
22	10
43	11
16	8
33	9
18	10
8	8
8	8
18	10
43	11
12	8
78	14
8	8
30	10
92	16
22	10
18	10
22	10
38	10
22	10
16	8
12	8
8	8
19	7
42	14
12	8
26	10
40	12
12	8
56	14
12	8
20	8
22	10
14	8
30	10
20	8
22	10
40	12
48	12
15	9
18	10
16	8
38	10
32	12
12	8
22	10
18	10
20	12
22	10
19	7
38	10
32	12
22	10
43	11
12	8
12	8
16	8
16	8
22	10
19	7
30	10
18	10
8	8
26	10
22	10
18	10
22	10
18	10
20	8
44	12
28	10
12	8
19	7
37	11
28	10
38	10
30	10
18	10
38	10
28	12
16	8
12	8
43	11
12	8
74	14
19	7
26	10
16	8
43	11
38	10
18	10
32	12
18	10
28	10
20	8
40	12
18	10
8	8
38	10
30	10
22	10
12	8
18	10
12	8
16	8
20	8
18	10
80	16
8	8
33	9
30	10
43	11
16	8
8	8
22	10
16	8
50	14
38	10
16	8
30	10
16	8
16	8
18	10
28	10
22	10
29	9
22	10
22	10
22	10
52	14
29	9
32	12
29	9
16	8
8	8
16	8
20	8
20	8
22	10
30	10
20	8
109	17
8	8
38	10
20	8
44	12
40	12
20	8
8	8
18	10
16	8
18	10
116	16
8	8
22	10
22	10
43	11
16	8
16	8
16	8
8	8
12	8
28	10
26	10
22	10
20	8
16	8
38	10
20	8
12	8
15	9
48	12
30	10
22	10
16	8
18	10
20	8
50	14
22	10
38	10
20	8
40	12
18	10
16	8
24	12
36	12
16	8
20	8
20	8
35	11
14	10
16	8
14	10
30	10
10	10
22	10
20	8
29	9
30	10
8	8
35	11
43	11
110	18
22	10
8	8
33	9
14	10
122	18
20	8
20	8
19	7
33	9
18	10
29	9
26	10
16	8
22	10
8	8
29	9
26	10
33	9
20	8
28	10
18	10
22	10
20	8
22	10
20	8
20	8
38	10
18	10
19	7
20	12
35	11
22	10
18	10
16	8
28	10
12	8
36	12
16	8
20	8
48	12
28	10
16	8
8	8
32	12
18	10
12	8
30	10
18	10
16	8
18	10
30	10
16	8
16	8
38	10
20	8
43	11
29	9
8	8
20	8
12	8
16	8
20	8
28	10
8	8
8	8
12	8
8	8
30	10
22	10
28	10
43	11
20	12
22	10
8	8
8	8
38	10
90	16
30	10
30	10
38	10
104	16
18	10
18	10
36	12
16	8
16	8
43	11
24	12
12	8
19	7
43	11
46	14
38	10
22	10
8	8
28	10
26	10
12	8
22	10
44	12
8	8
16	8
18	10
22	10
14	8
20	8
200	20
18	10
16	8
20	8
22	10
12	8
43	11
26	10
38	10
19	7
30	10
22	10
18	10
12	8
20	8
12	8
8	8
18	10
15	9
16	8
43	11
30	10
20	8
19	7
8	8
22	10
30	10
16	10
30	10
12	8
20	8
158	20
22	10
22	10
22	10
16	8
28	10
22	10
16	8
38	10
18	10
43	11
28	10
12	8
20	8
28	10
22	10
22	10
18	10
18	10
22	10
36	12
10	10
12	8
8	8
12	8
43	11
16	8
30	10
20	8
12	8
18	10
12	8
12	8
32	12
30	10
12	8
42	14
8	8
44	12
18	10
22	10
16	8
22	10
44	12
8	8
22	10
38	10
43	11
30	10
18	10
30	10
40	12
20	8
38	10
22	10
43	11
20	8
30	10
22	10
18	10
28	10
18	10
22	10
84	16
16	8
18	10
14	8
26	10
16	8
22	10
20	8
22	10
18	10
39	11
28	10
28	10
18	10
20	8
58	14
28	10
16	8
10	10
20	8
29	9
22	10
110	14
20	12
18	10
26	10
20	8
39	11
18	10
29	9
16	8
18	10
12	8
20	8
18	10
38	10
8	8
16	8
43	11
14	8
42	12
10	10
32	12
35	11
43	11
8	8
22	10
8	8
20	8
12	8
22	10
144	20
20	8
29	9
35	11
16	8
38	10
20	8
8	8
20	8
36	12
20	8
22	10
12	8
18	10
16	8
8	8
18	10
8	8
14	10
8	8
30	10
48	12
18	10
20	8
16	8
22	10
30	10
18	10
43	11
22	10
8	8
14	8
12	8
16	8
38	10
44	12
8	8
30	10
19	7
22	10
12	8
50	14
22	10
8	8
32	12
22	10
10	10
19	7
26	10
18	10
30	10
20	8
22	10
22	10
18	10
22	10
30	10
16	8
48	12
18	10
8	8
8	8
28	10
43	11
12	8
16	8
33	9
19	7
30	10
50	14
20	8
8	8
18	10
14	10
48	14
16	8
18	10
22	10
8	8
36	12
22	10
20	8
8	8
18	10
28	10
44	12
24	12
16	8
12	8
38	10
8	8
38	10
18	10
30	10
36	12
16	8
22	10
16	8
16	8
8	8
18	10
26	10
16	8
20	8
16	8
30	10
30	10
20	8
12	8
38	10
22	10
33	9
43	11
16	8
16	8
22	10
8	8
22	10
12	8
16	8
78	14
16	8
30	10
18	10
12	8
18	10
18	10
18	10
20	8
20	8
30	10
76	14
50	14
22	10
44	12
19	7
16	8
16	8
28	10
22	10
22	10
20	8
16	8
38	10
18	10
28	10
22	10
16	8
36	12
18	10
35	11
29	9
19	7
44	12
16	8
36	12
8	8
12	8
16	8
10	10
18	10
20	8
18	10
8	8
37	11
22	10
43	11
18	10
18	10
20	8
12	8
10	10
8	8
18	10
22	10
30	10
26	10
38	10
8	8
30	10
12	8
32	12
22	10
30	10
42	14
19	7
20	8
18	10
29	9
16	8
37	11
16	8
18	10
28	10
30	10
20	8
20	8
30	10
36	12
30	10
22	10
43	11
12	8
18	10
18	10
19	7
33	9
20	8
36	12
8	8
16	8
38	10
35	11
18	10
16	8
16	8
16	8
18	10
22	10
20	8
18	10
22	10
100	16
43	11
8	8
38	10
28	10
80	14
36	12
20	8
20	8
20	8
12	8
18	10
20	8
28	10
18	10
8	8
43	11
44	12
38	10
38	10
30	10
38	10
12	8
22	10
43	11
16	8
16	8
122	18
16	8
43	11
19	7
96	16
16	8
38	10
30	10
16	8
16	8
38	10
24	12
8	8
16	8
16	8
12	8
22	10
10	10
22	10
36	12
30	10
38	10
16	8
12	8
18	10
32	12
30	10
20	8
15	9
33	9
8	8
22	10
12	8
20	8
12	8
12	8
20	8
8	8
43	11
20	8
8	8
18	10
20	12
8	8
29	9
16	8
22	10
40	12
8	8
33	9
22	10
16	8
22	10
35	11
8	8
74	14
19	7
20	8
18	10
12	8
18	10
30	10
22	10
10	10
30	10
33	9
12	8
16	8
16	8
18	10
38	10
20	8
35	11
22	10
18	10
88	16
36	12
38	10
8	8
8	8
28	10
26	10
20	8
8	8
8	8
42	14
30	10
44	12
18	10
30	10
30	10
29	9
22	10
20	8
15	9
22	10
32	12
15	9
58	14
22	10
8	8
20	8
22	10
8	8
22	10
16	8
22	10
43	11
14	10
38	10
19	7
18	10
22	10
29	9
38	10
43	11
12	8
16	8
43	11
38	10
28	10
16	8
48	12
16	8
8	8
30	10
15	9
12	8
28	10
22	10
12	8
30	10
18	10
12	8
40	12
19	7
22	10
12	8
18	10
22	10
12	8
18	10
43	11
19	7
16	8
18	10
38	10
43	11
22	10
20	8
18	10
35	11
20	8
36	12
30	10
18	10
8	8
30	10
58	14
19	7
116	18
16	8
8	8
33	9
14	10
12	8
18	10
106	14
14	10
8	8
18	10
12	8
18	10
43	11
130	18
38	10
12	8
42	12
20	8
22	10
22	10
12	8
15	9
18	10
18	10
30	10
18	10
15	9
18	10
12	8
22	10
30	10
39	11
24	12
12	8
8	8
18	10
30	10
20	8
12	8
110	14
20	8
22	10
8	8
12	8
14	10
30	10
18	10
20	8
12	8
30	10
20	8
40	12
8	8
43	11
10	10
12	8
22	10
16	8
39	11
10	10
16	8
20	8
22	10
30	10
8	8
20	8
18	10
35	11
22	10
43	11
22	10
38	10
36	12
8	8
30	10
50	14
12	8
30	10
18	10
28	10
16	8
20	8
100	16
28	10
29	9
15	9
43	11
20	8
28	12
43	11
16	8
22	10
30	10
40	12
22	10
20	8
30	10
43	11
18	10
19	7
16	8
20	8
43	11
16	8
18	10
22	10
32	12
33	9
33	9
18	10
12	8
94	14
22	10
30	10
22	10
26	10
36	12
30	10
44	12
18	10
14	8
18	10
8	8
43	11
30	10
36	12
8	8
22	10
38	10
44	12
18	10
15	9
22	10
18	10
106	14
38	10
8	8
42	12
58	14
14	10
20	8
43	11
22	10
20	8
22	10
12	8
22	10
16	8
43	11
22	10
12	8
12	8
20	8
43	11
16	8
30	10
22	10
101	17
16	8
38	10
30	10
19	7
12	8
165	21
16	8
22	10
22	10
18	10
8	8
15	9
16	8
35	11
36	12
43	11
12	8
8	8
8	8
36	12
16	8
8	8
12	8
18	10
38	10
33	9
15	9
18	10
8	8
18	10
74	14
18	10
76	16
22	10
20	8
20	8
33	9
44	12
18	10
18	10
20	8
108	16
18	10
26	10
22	10
16	8
16	8
22	10
8	8
8	8
14	8
38	10
22	10
18	10
38	10
22	10
43	11
24	12
18	10
20	8
43	11
32	12
30	10
15	9
48	12
16	8
48	12
16	8
16	8
43	11
18	10
43	11
33	9
22	10
20	8
12	8
43	11
28	10
20	8
28	12
38	10
29	9
16	8
8	8
16	8
30	10
20	8
33	9
22	10
40	12
20	12
38	10
12	8
30	10
33	9
30	10
8	8
30	10
12	8
8	8
33	9
8	8
22	10
30	10
33	9
26	12
30	10
16	8
22	10
16	8
8	8
16	8
10	10
8	8
33	9
44	12
16	8
20	8
8	8
46	14
12	8
16	8
19	7
22	10
28	10
29	9
22	10
42	14
18	10
22	10
8	8
78	14
15	9
8	8
16	8
36	12
32	12
8	8
30	10
16	8
36	12
36	12
30	10
16	8
22	10
8	8
22	10
18	10
48	12
30	10
76	14
26	10
43	11
29	9
20	8
33	9
35	11
38	10
44	12
18	10
33	9
20	8
22	10
88	16
22	10
26	10
44	12
20	8
8	8
43	11
20	8
12	8
157	21
18	10
26	10
30	10
32	12
43	11
43	11
36	12
37	11
22	10
22	10
20	8
10	10
12	8
26	10
29	9
12	8
14	10
33	9
8	8
18	10
30	10
29	9
18	10
28	12
33	9
14	8
30	10
12	8
26	10
22	10
112	16
8	8
20	8
110	14
38	10
22	10
18	10
42	14
16	8
8	8
16	8
14	10
8	8
10	10
29	9
38	10
29	9
16	8
18	10
44	12
20	8
8	8
12	8
16	8
30	10
22	10
38	10
32	12
18	10
44	12
24	12
16	8
18	10
12	8
22	10
8	8
22	10
16	8
30	10
8	8
28	10
22	10
20	8
38	10
30	10
30	10
38	10
22	10
19	7
30	10
36	12
20	8
29	9
43	11
12	8
18	10
40	12
18	10
36	12
134	18
8	8
112	16
18	10
28	10
38	10
22	10
16	8
43	11
19	7
35	11
88	16
12	8
22	10
20	8
12	8
94	14
76	14
29	9
22	10
22	10
12	8
22	10
8	8
33	9
16	8
16	8
16	8
18	10
20	8
12	8
30	10
16	8
40	12
32	12
30	10
24	12
22	10
19	7
38	10
29	9
43	11
16	8
30	10
16	8
58	14
12	8
30	10
18	10
14	8
18	10
12	8
22	10
38	10
19	7
20	8
22	10
12	8
18	10
36	12
16	8
33	9
12	8
8	8
38	10
22	10
28	10
24	12
33	9
38	10
22	10
16	8
22	10
30	10
38	10
10	10
18	10
22	10
62	14
22	10
12	8
12	8
12	8
8	8
22	10
43	11
8	8
20	8
8	8
18	10
22	10
18	10
16	8
30	10
30	10
8	8
16	8
12	8
30	10
38	10
22	10
18	10
22	10
12	8
8	8
20	8
30	10
22	10
24	12
106	14
30	10
8	8
29	9
16	8
28	10
8	8
22	10
16	8
30	10
22	10
19	7
8	8
30	10
22	10
14	8
22	10
8	8
16	8
16	8
8	8
43	11
43	11
40	12
22	10
8	8
24	12
12	8
16	8
43	11
30	10
10	10
19	7
12	8
12	8
16	8
20	8
38	10
20	8
18	10
20	8
30	10
18	10
19	7
20	8
16	8
18	10
18	10
22	10
20	8
22	10
16	8
29	9
30	10
29	9
22	10
18	10
16	8
12	8
20	8
22	10
8	8
33	9
35	11
22	10
15	9
12	8
16	8
30	10
26	10
19	7
116	16
22	10
22	10
43	11
12	8
33	9
18	10
22	10
38	10
18	10
20	8
26	10
16	8
22	10
26	10
8	8
18	10
38	10
28	12
22	10
18	10
35	11
12	8
20	8
26	10
18	10
16	8
12	8
12	8
19	7
29	9
30	10
19	7
43	11
20	8
43	11
38	10
16	8
30	10
8	8
10	10
32	12
8	8
18	10
40	12
30	10
28	10
12	8
16	8
22	10
8	8
12	8
22	10
20	8
22	10
22	10
28	10
19	7
22	10
44	12
50	14
28	10
15	9
22	10
38	10
16	8
18	10
16	8
40	12
43	11
16	8
22	10
16	8
38	10
8	8
62	14
43	11
20	8
20	8
22	10
12	8
18	10
38	10
22	10
20	8
38	10
10	10
8	8
22	10
38	10
44	12
38	10
12	8
36	12
18	10
8	8
33	9
22	10
28	12
18	10
19	7
8	8
28	12
33	9
19	7
18	10
26	10
12	8
18	10
20	12
26	10
43	11
32	12
18	10
22	10
30	10
36	12
36	12
30	10
8	8
22	10
38	10
20	8
18	10
44	12
20	8
12	8
12	8
43	11
30	10
8	8
29	9
14	8
38	10
16	8
32	12
8	8
16	8
35	11
22	10
16	8
22	10
8	8
88	16
20	8
20	8
18	10
43	11
22	10
32	12
8	8
16	8
22	10
20	8
26	10
19	7
16	8
22	10
38	10
43	11
8	8
22	10
16	8
30	10
12	8
12	8
16	8
33	9
19	7
20	8
8	8
8	8
20	8
8	8
19	7
16	8
18	10
26	10
20	8
18	10
30	10
12	8
44	12
22	10
12	8
22	10
12	8
22	10
16	8
16	8
22	10
18	10
26	10
18	10
43	11
90	16
22	10
29	9
8	8
26	10
16	8
16	8
8	8
38	10
15	9
8	8
16	8
12	8
30	10
43	11
20	8
8	8
134	18
20	8
44	12
8	8
8	8
12	8
38	10
20	8
18	10
22	10
58	14
19	7
12	8
22	10
42	14
28	10
8	8
22	10
28	10
8	8
28	10
30	10
19	7
20	8
8	8
16	8
18	10
16	8
20	12
43	11
22	10
20	8
30	10
8	8
22	10
18	10
35	11
12	8
28	12
36	12
24	12
48	12
20	8
22	10
19	7
84	16
16	8
28	10
22	10
18	10
18	10
22	10
30	10
43	11
12	8
38	10
16	8
33	9
29	9
18	10
22	10
14	8
14	8
16	8
43	11
18	10
12	8
40	12
22	10
8	8
18	10
12	8
43	11
18	10
43	11
14	8
16	8
18	10
18	10
8	8
20	8
19	7
12	8
22	10
16	8
18	10
38	10
38	10
18	10
33	9
28	10
30	10
18	10
36	12
36	12
8	8
44	12
18	10
15	9
24	12
16	8
16	8
20	8
44	12
22	10
18	10
16	8
12	8
18	10
19	7
30	10
35	11
18	10
26	10
22	10
38	10
16	8
16	8
20	12
24	12
40	12
19	7
15	9
28	10
16	8
10	10
43	11
28	10
16	8
50	14
33	9
35	11
30	10
8	8
33	9
38	10
16	8
12	8
8	8
22	10
43	11
114	18
22	10
88	16
20	8
12	8
22	10
30	10
19	7
22	10
22	10
28	10
22	10
30	10
30	10
22	10
29	9
12	8
28	10
18	10
18	10
28	10
22	10
22	10
8	8
18	10
38	10
12	8
16	8
20	8
30	10
43	11
22	10
20	8
18	10
26	10
29	9
110	14
20	8
16	8
43	11
43	11
12	8
30	10
8	8
20	8
43	11
36	12
18	10
125	17
30	10
33	9
30	10
16	8
16	8
18	10
14	10
28	10
30	10
90	16
88	16
16	8
33	9
22	10
22	10
43	11
30	10
22	10
20	8
32	12
12	8
16	8
30	10
18	10
40	12
38	10
16	8
8	8
16	8
8	8
33	9
26	10
18	10
8	8
29	9
30	10
16	8
29	9
18	10
18	10
16	8
18	10
20	8
12	8
20	8
18	10
15	9
94	14
18	10
28	10
22	10
149	21
8	8
35	11
32	12
40	12
35	11
43	11
22	10
12	8
8	8
18	10
94	14
19	7
22	10
19	7
8	8
22	10
30	10
18	10
26	10
8	8
18	10
38	10
12	8
19	7
14	10
22	10
28	10
12	8
16	8
14	8
29	9
48	12
26	10
38	10
16	8
22	10
12	8
43	11
10	10
30	10
22	10
30	10
16	8
43	11
16	10
28	10
16	8
8	8
24	12
8	8
12	8
12	8
20	8
18	10
43	11
8	8
19	7
42	14
28	10
20	8
20	8
16	8
28	10
12	8
22	10
43	11
12	8
19	7
33	9
18	10
43	11
22	10
26	10
22	10
36	12
35	11
18	10
12	8
12	8
16	8
43	11
18	10
22	10
16	8
29	9
110	14
16	8
22	10
38	10
8	8
43	11
8	8
112	16
43	11
10	10
12	8
16	8
20	8
16	8
16	8
22	10
20	8
16	8
33	9
22	10
33	9
12	8
50	14
22	10
8	8
50	14
43	11
36	12
16	8
26	10
16	8
8	8
43	11
22	10
43	11
20	8
20	8
22	10
20	8
18	10
30	10
30	10
20	8
38	10
12	8
22	10
16	8
37	11
20	8
38	10
28	10
18	10
8	8
18	10
28	10
16	8
18	10
43	11
30	10
16	8
18	10
40	12
30	10
22	10
16	8
8	8
30	10
32	12
22	10
18	10
19	7
18	10
16	8
20	8
22	10
30	10
20	8
12	8
100	16
18	10
12	8
16	8
12	8
20	8
12	8
43	11
18	10
30	10
18	10
18	10
8	8
26	10
12	8
36	12
18	10
37	11
43	11
20	8
8	8
20	8
22	10
18	10
16	8
8	8
22	10
30	10
8	8
38	10
20	8
48	12
20	8
36	12
20	8
36	12
22	10
22	10
18	10
50	14
38	10
10	10
30	10
10	10
8	8
16	8
28	10
12	8
76	14
22	10
33	9
22	10
20	8
18	10
19	7
30	10
8	8
16	8
40	12
38	10
20	8
14	8
10	10
35	11
20	8
19	7
29	9
20	8
12	8
12	8
18	10
18	10
40	12
22	10
30	10
16	8
12	8
8	8
20	8
30	10
33	9
30	10
22	10
30	10
16	8
8	8
19	7
30	10
38	10
30	10
44	12
29	9
18	10
38	10
18	10
20	8
43	11
8	8
33	9
43	11
16	8
12	8
28	10
8	8
18	10
12	8
8	8
14	10
22	10
33	9
40	12
16	8
38	10
12	8
20	12
36	12
30	10
20	8
12	8
8	8
40	12
18	10
18	10
22	10
20	8
20	8
22	10
22	10
22	10
22	10
43	11
22	10
20	8
26	10
130	18
16	8
44	12
30	10
88	16
20	8
20	8
30	10
22	10
44	12
40	12
22	10
20	8
40	12
20	8
22	10
20	8
50	14
20	8
8	8
20	8
18	10
28	10
33	9
40	12
16	8
12	8
36	12
15	9
12	8
18	10
22	10
20	8
14	10
122	18
43	11
36	12
15	9
8	8
30	10
106	14
15	9
22	10
8	8
16	8
36	12
36	12
8	8
44	12
12	8
8	8
20	8
22	10
18	10
28	10
42	14
12	8
16	8
36	12
38	10
16	8
42	12
8	8
26	10
20	8
30	10
10	10
12	8
18	10
18	10
12	8
16	8
20	12
18	10
12	8
22	10
18	10
8	8
8	8
19	7
20	8
18	10
30	10
12	8
18	10
18	10
22	10
80	16
16	8
30	10
16	8
22	10
28	12
12	8
28	10
40	12
16	8
8	8
48	12
15	9
18	10
19	7
18	10
8	8
26	10
12	8
20	8
38	10
26	10
16	8
16	8
22	10
26	10
18	10
15	9
16	8
20	8
40	12
38	10
18	10
22	10
24	12
12	8
22	10
26	10
30	10
8	8
20	8
29	9
20	8
22	10
18	10
28	10
22	10
22	10
22	10
33	9
14	10
42	14
28	10
38	10
20	8
30	10
38	10
42	12
8	8
14	8
38	10
18	10
22	10
8	8
30	10
38	10
22	10
12	8
43	11
8	8
12	8
16	8
22	10
30	10
22	10
8	8
12	8
18	10
16	8
38	10
18	10
8	8
22	10
43	11
43	11
35	11
16	8
22	10
16	8
22	10
160	20
29	9
22	10
8	8
10	10
14	10
30	10
15	9
20	8
22	10
35	11
42	12
33	9
29	9
12	8
8	8
15	9
43	11
18	10
30	10
8	8
43	11
28	10
28	10
16	8
26	10
15	9
8	8
16	8
20	8
19	7
156	20
8	8
22	10
8	8
18	10
38	10
20	8
20	8
16	8
16	8
35	11
38	10
12	8
22	10
43	11
30	10
26	10
12	8
20	8
22	10
18	10
16	8
38	10
22	10
32	12
16	8
24	12
36	12
28	10
12	8
42	14
36	12
38	10
8	8
8	8
8	8
12	8
12	8
22	10
19	7
18	10
22	10
18	10
20	8
35	11
22	10
16	8
8	8
16	8
22	10
22	10
26	10
30	10
22	10
19	7
12	8
18	10
40	12
30	10
8	8
8	8
38	10
19	7
20	8
33	9
22	10
20	8
8	8
22	10
8	8
29	9
36	12
50	14
16	8
16	8
8	8
12	8
20	8
43	11
43	11
20	8
22	10
8	8
26	10
15	9
22	10
19	7
118	18
130	18
28	10
22	10
18	10
18	10
22	10
10	10
18	10
8	8
8	8
12	8
19	7
16	8
8	8
28	10
12	8
12	8
18	10
16	8
22	10
44	12
12	8
38	10
38	10
35	11
22	10
30	10
38	10
20	8
30	10
20	8
38	10
12	8
12	8
43	11
18	10
20	8
8	8
8	8
38	10
22	10
20	8
18	10
43	11
12	8
36	12
30	10
22	10
22	10
22	10
19	7
26	10
35	11
18	10
16	8
8	8
43	11
24	12
8	8
35	11
12	8
8	8
30	10
44	12
16	8
30	10
74	14
38	10
12	8
43	11
19	7
16	8
36	12
30	10
20	8
38	10
19	7
8	8
20	8
38	10
20	8
10	10
18	10
12	8
22	10
30	10
58	14
22	10
38	10
50	14
22	10
28	10
38	10
38	10
20	8
16	8
16	8
14	10
26	10
43	11
18	10
58	14
26	10
12	8
35	11
48	14
16	8
18	10
22	10
29	9
38	10
18	10
18	10
22	10
22	10
12	8
16	8
8	8
8	8
20	8
22	10
18	10
16	8
12	8
18	10
104	16
8	8
38	10
8	8
22	10
38	10
16	8
18	10
16	8
16	8
30	10
18	10
20	8
8	8
22	10
22	10
8	8
22	10
12	8
36	12
22	10
22	10
20	8
38	10
18	10
22	10
8	8
30	10
16	8
16	10
36	12
18	10
30	10
36	12
16	8
18	10
36	12
43	11
30	10
8	8
16	8
43	11
16	8
38	10
74	14
18	10
18	10
36	12
30	10
84	16
22	10
19	7
48	12
8	8
32	12
22	10
12	8
20	8
28	10
8	8
26	10
18	10
12	8
29	9
16	8
18	10
20	12
20	8
15	9
16	8
16	8
12	8
8	8
18	10
20	12
22	10
22	10
20	8
42	14
28	10
30	10
15	9
22	10
16	8
12	8
22	10
22	10
106	14
20	8
20	8
16	8
18	10
18	10
12	8
12	8
37	11
18	10
38	10
8	8
16	8
30	10
12	8
33	9
28	10
33	9
15	9
18	10
18	10
16	8
18	10
16	8
8	8
43	11
22	10
90	16
38	10
16	8
44	14
12	8
26	10
38	10
36	12
8	8
12	8
43	11
18	10
43	11
19	7
38	10
16	8
22	10
18	10
30	10
20	8
29	9
16	8
10	10
22	10
36	12
22	10
90	16
40	12
18	10
20	8
22	10
19	7
134	18
29	9
18	10
30	10
8	8
20	12
22	10
38	10
8	8
8	8
43	11
20	8
20	8
20	8
38	10
28	10
22	10
22	10
38	10
20	8
18	10
22	10
8	8
8	8
50	14
36	12
12	8
44	12
36	12
16	8
16	8
38	10
38	10
8	8
26	10
16	8
20	8
16	8
16	8
12	8
38	10
12	8
28	10
14	10
12	8
24	12
20	8
18	10
18	10
16	8
50	14
33	9
22	10
12	8
12	8
106	14
16	8
14	8
22	10
20	12
29	9
20	8
16	8
22	10
20	8
16	8
18	10
38	10
43	11
36	12
8	8
8	8
12	8
22	10
18	10
8	8
20	8
16	8
40	12
44	12
18	10
16	8
18	10
22	10
22	10
18	10
43	11
19	7
40	12
33	9
16	8
15	9
15	9
38	10
16	8
26	10
22	10
12	8
36	12
16	8
12	8
22	10
8	8
16	8
8	8
8	8
30	10
19	7
18	10
38	10
20	8
18	10
43	11
22	10
30	10
19	7
40	12
56	14
8	8
32	12
12	8
22	10
16	8
8	8
12	8
24	12
12	8
98	14
38	10
33	9
22	10
14	8
32	12
30	10
22	10
26	10
16	8
33	9
8	8
29	9
30	10
20	8
22	10
20	8
30	10
18	10
16	8
16	8
50	14
12	8
43	11
20	8
110	18
18	10
38	10
20	8
40	12
30	10
20	8
14	10
16	8
12	8
19	7
12	8
18	10
30	10
20	8
44	12
38	10
16	8
12	8
38	10
38	10
44	12
8	8
30	10
12	8
19	7
40	12
30	10
20	8
18	10
18	10
8	8
36	12
22	10
12	8
8	8
16	8
38	10
8	8
78	14
35	11
18	10
12	8
8	8
50	14
20	8
18	10
12	8
40	12
33	9
22	10
22	10
16	8
28	12
43	11
24	12
28	10
20	8
12	8
12	8
43	11
18	10
104	16
8	8
36	12
20	8
20	8
12	8
48	12
22	10
8	8
12	8
22	10
18	10
22	10
18	10
22	10
38	10
36	12
10	10
19	7
8	8
152	20
22	10
18	10
20	8
22	10
32	12
12	8
38	10
20	8
35	11
22	10
16	8
16	8
20	8
8	8
36	12
18	10
22	10
22	10
30	10
19	7
22	10
28	10
18	10
36	12
22	10
18	10
16	8
12	8
22	10
29	9
8	8
22	10
16	8
22	10
32	12
8	8
16	8
106	14
19	7
16	8
16	8
19	7
18	10
12	8
30	10
8	8
16	8
20	8
36	12
8	8
18	10
12	8
20	8
28	10
18	10
130	18
18	10
15	9
43	11
19	7
8	8
8	8
12	8
22	10
28	10
36	12
20	8
26	10
12	8
22	10
30	10
20	8
18	10
20	8
20	8
16	8
28	10
43	11
48	12
8	8
12	8
12	8
16	8
33	9
16	8
28	10
33	9
22	10
12	8
20	8
18	10
20	12
8	8
28	10
18	10
30	10
16	8
36	12
30	10
44	12
43	11
22	10
16	8
8	8
16	8
110	14
18	10
38	10
8	8
8	8
30	10
19	7
28	10
16	8
8	8
43	11
22	10
8	8
30	10
16	8
22	10
22	10
14	10
18	10
26	12
18	10
12	8
30	10
18	10
15	9
36	12
10	10
18	10
18	10
20	8
18	10
22	10
20	8
30	10
38	10
12	8
18	10
20	8
14	10
22	10
38	10
30	10
40	12
20	8
22	10
22	10
30	10
16	8
18	10
33	9
16	8
35	11
43	11
22	10
30	10
8	8
22	10
44	12
8	8
35	11
20	8
12	8
12	8
22	10
18	10
22	10
28	10
54	14
20	8
19	7
20	8
36	12
12	8
8	8
38	10
8	8
22	10
43	11
38	10
22	10
43	11
8	8
38	10
8	8
20	8
20	8
16	8
36	12
18	10
22	10
8	8
22	10
88	16
43	11
18	10
22	10
12	8
8	8
43	11
22	10
20	8
38	10
24	12
40	12
14	8
16	8
19	7
177	21
18	10
18	10
8	8
19	7
16	8
16	8
8	8
50	14
20	8
28	10
22	10
36	12
28	12
40	12
16	8
18	10
30	10
18	10
48	12
22	10
12	8
10	10
22	10
104	16
12	8
22	10
16	8
12	8
22	10
26	10
106	14
38	10
43	11
43	11
22	10
8	8
22	10
28	12
28	10
22	10
18	10
38	10
18	10
18	10
30	10
18	10
30	10
42	14
43	11
8	8
18	10
20	8
14	8
16	8
16	8
26	10
8	8
16	8
22	10
50	14
26	10
116	16
38	10
20	8
16	8
20	8
22	10
20	12
8	8
16	8
22	10
24	12
18	10
40	12
8	8
12	8
22	10
35	11
22	10
38	10
30	10
43	11
92	16
20	8
98	14
22	10
20	8
14	8
29	9
136	20
36	12
20	8
38	10
22	10
12	8
20	8
30	10
22	10
44	12
43	11
28	12
12	8
18	10
8	8
18	10
8	8
20	8
30	10
16	8
8	8
43	11
8	8
22	10
18	10
38	10
38	10
30	10
20	8
18	10
38	10
30	10
20	8
22	10
20	8
20	8
20	8
26	10
22	10
100	16
20	8
43	11
22	10
19	7
16	8
20	8
12	8
8	8
30	10
43	11
29	9
18	10
18	10
43	11
22	10
18	10
8	8
104	16
22	10
8	8
20	8
20	8
16	8
8	8
30	10
22	10
20	8
18	10
19	7
22	10
20	8
22	10
26	12
22	10
18	10
18	10
44	12
8	8
10	10
22	10
10	10
18	10
35	11
30	10
18	10
8	8
24	12
28	10
16	10
16	8
22	10
43	11
16	8
30	10
18	10
38	10
16	8
8	8
22	10
18	10
50	14
36	12
22	10
16	8
8	8
30	10
88	16
43	11
20	8
18	10
12	8
12	8
26	10
88	16
18	10
33	9
43	11
16	8
22	10
12	8
130	18
22	10
24	12
30	10
18	10
30	10
12	8
38	10
18	10
58	14
30	10
30	10
26	10
30	10
44	12
28	10
18	10
20	8
12	8
20	8
90	16
32	12
8	8
8	8
33	9
16	8
22	10
19	7
43	11
8	8
22	10
19	7
35	11
22	10
12	8
8	8
34	12
36	12
15	9
44	14
8	8
28	10
8	8
8	8
20	8
12	8
20	8
20	8
20	8
18	10
18	10
22	10
36	12
12	8
12	8
22	10
12	8
32	12
22	10
29	9
32	12
14	8
29	9
12	8
43	11
30	10
18	10
18	10
8	8
15	9
8	8
20	8
20	8
20	8
19	7
14	10
18	10
35	11
30	10
43	11
18	10
22	10
14	10
43	11
8	8
22	10
20	8
22	10
26	10
18	10
19	7
40	12
20	12
26	10
22	10
44	12
18	10
16	8
10	10
19	7
22	10
8	8
18	10
43	11
8	8
12	8
8	8
16	8
8	8
30	10
29	9
38	10
44	12
30	10
43	11
30	10
20	8
18	10
43	11
16	8
32	12
22	10
22	10
22	10
18	10
30	10
8	8
40	12
26	10
22	10
22	10
29	9
44	12
36	12
18	10
38	10
30	10
44	12
43	11
12	8
33	9
84	16
22	10
18	10
44	12
18	10
36	12
30	10
36	12
16	8
22	10
8	8
26	10
30	10
22	10
35	11
18	10
18	10
50	14
14	10
30	10
22	10
33	9
12	8
20	8
33	9
43	11
20	12
8	8
76	14
22	10
16	8
18	10
106	14
20	8
18	10
8	8
16	8
37	11
20	8
12	8
22	10
18	10
8	8
19	7
18	10
8	8
18	10
20	8
43	11
16	8
44	12
33	9
22	10
20	8
20	8
12	8
22	10
20	8
8	8
58	14
38	10
44	12
48	12
18	10
32	12
28	10
110	14
20	12
22	10
22	10
38	10
43	11
20	8
36	12
38	10
16	8
108	16
22	10
12	8
30	10
16	8
43	11
18	10
15	9
16	8
18	10
112	16
18	10
20	8
33	9
8	8
28	10
29	9
8	8
20	8
106	14
14	10
18	10
20	8
8	8
29	9
30	10
20	8
8	8
16	8
33	9
22	10
43	11
16	8
18	10
18	10
20	8
22	10
18	10
20	8
10	10
36	12
35	11
30	10
19	7
20	8
18	10
94	14
20	8
8	8
26	10
10	10
16	8
12	8
48	12
15	9
38	10
43	11
16	8
43	11
32	12
18	10
20	8
38	10
28	10
18	10
43	11
118	18
18	10
19	7
16	8
43	11
12	8
8	8
29	9
8	8
20	8
35	11
35	11
8	8
22	10
12	8
50	14
12	8
38	10
12	8
8	8
12	8
22	10
20	8
36	12
38	10
35	11
18	10
28	10
36	12
104	16
30	10
30	10
20	8
19	7
29	9
16	8
30	10
22	10
43	11
18	10
19	7
18	10
28	10
12	8
16	8
20	8
48	12
22	10
43	11
22	10
19	7
12	8
12	8
20	8
22	10
20	8
12	8
32	12
44	12
22	10
29	9
8	8
18	10
8	8
12	8
12	8
36	12
12	8
50	14
19	7
36	12
22	10
20	8
12	8
19	7
20	8
35	11
20	8
12	8
33	9
33	9
28	10
16	8
20	8
16	8
18	10
18	10
40	12
22	10
12	8
35	11
38	10
156	20
30	10
20	8
22	10
22	10
26	10
24	12
8	8
18	10
22	10
16	8
30	10
12	8
44	12
22	10
16	8
20	12
43	11
16	8
37	11
152	20
8	8
37	11
50	14
18	10
30	10
10	10
12	8
30	10
18	10
43	11
8	8
43	11
20	8
12	8
12	8
16	8
12	8
200	20
18	10
22	10
22	10
12	8
8	8
28	10
16	8
30	10
15	9
30	10
18	10
22	10
33	9
22	10
18	10
52	14
28	10
38	10
30	10
29	9
20	8
18	10
12	8
43	11
8	8
39	11
24	12
38	10
56	14
20	8
43	11
16	8
16	8
12	8
20	8
20	8
28	10
16	8
28	10
28	10
8	8
12	8
18	10
16	8
106	14
18	10
8	8
22	10
22	10
38	10
52	14
22	10
26	10
16	8
12	8
8	8
38	10
20	8
12	8
18	10
8	8
22	10
22	10
33	9
18	10
18	10
18	10
22	10
20	8
30	10
18	10
28	10
33	9
38	10
38	10
22	10
18	10
12	8
22	10
26	10
18	10
8	8
18	10
22	10
35	11
20	8
35	11
37	11
16	8
16	8
8	8
12	8
20	8
16	8
18	10
15	9
8	8
8	8
19	7
20	8
16	8
28	10
33	9
50	14
22	10
38	10
22	10
18	10
22	10
12	8
22	10
18	10
12	8
29	9
18	10
8	8
12	8
18	10
18	10
48	12
28	12
20	8
22	10
43	11
29	9
43	11
8	8
18	10
35	11
20	8
22	10
28	10
22	10
18	10
22	10
18	10
36	12
43	11
20	8
14	10
29	9
18	10
43	11
12	8
16	8
12	8
20	8
8	8
43	11
8	8
22	10
20	8
20	12
26	10
8	8
28	10
18	10
12	8
38	10
22	10
12	8
12	8
16	8
16	8
16	8
8	8
8	8
18	10
30	10
22	10
30	10
12	8
38	10
15	9
20	8
36	12
116	18
12	8
16	8
58	14
29	9
22	10
18	10
22	10
12	8
38	10
18	10
20	8
20	8
16	8
16	8
20	8
38	10
18	10
20	8
16	8
20	8
18	10
12	8
36	12
8	8
18	10
12	8
8	8
18	10
22	10
16	8
18	10
12	8
18	10
38	10
35	11
22	10
28	10
22	10
20	8
8	8
80	16
33	9
26	10
8	8
20	8
18	10
12	8
20	8
38	10
30	10
24	12
22	10
19	7
8	8
18	10
30	10
35	11
12	8
20	8
18	10
8	8
22	10
22	10
30	10
19	7
12	8
18	10
10	10
8	8
20	8
43	11
24	12
20	8
30	10
30	10
18	10
20	8
18	10
58	14
19	7
78	14
48	12
16	8
12	8
12	8
18	10
12	8
35	11
16	8
38	10
14	10
12	8
12	8
8	8
24	12
26	10
18	10
18	10
18	10
20	8
50	14
8	8
76	14
28	10
38	10
28	10
22	10
24	12
35	11
38	10
40	12
12	8
16	8
22	10
30	10
19	7
30	10
20	8
12	8
22	10
20	8
40	12
30	10
32	12
19	7
30	10
18	10
43	11
12	8
22	10
16	8
22	10
29	9
18	10
12	8
10	10
30	10
43	11
22	10
22	10
10	10
14	8
16	8
18	10
43	11
18	10
12	8
22	10
18	10
29	9
12	8
19	7
18	10
18	10
16	8
22	10
33	9
8	8
22	10
43	11
98	14
20	8
22	10
18	10
18	10
19	7
30	10
38	10
28	10
22	10
30	10
30	10
20	8
30	10
16	8
76	14
19	7
18	10
39	11
168	20
36	12
8	8
30	10
8	8
8	8
38	10
14	10
18	10
8	8
30	10
36	12
16	8
18	10
30	10
20	8
22	10
19	7
18	10
110	18
10	10
14	8
8	8
38	10
24	12
8	8
29	9
22	10
18	10
8	8
16	8
12	8
30	10
22	10
18	10
8	8
18	10
38	10
8	8
12	8
30	10
22	10
30	10
12	8
20	8
12	8
18	10
38	10
28	10
42	14
22	10
18	10
19	7
16	8
43	11
18	10
22	10
22	10
16	8
8	8
38	10
20	8
38	10
12	8
16	8
16	8
8	8
12	8
29	9
16	8
33	9
22	10
43	11
20	12
38	10
12	8
29	9
10	10
16	8
20	8
30	10
16	8
22	10
12	8
16	8
43	11
38	10
16	8
38	10
16	8
14	10
104	16
26	10
28	10
28	10
19	7
19	7
8	8
12	8
30	10
22	10
22	10
8	8
8	8
20	8
16	8
10	10
22	10
18	10
18	10
28	10
12	8
32	12
30	10
12	8
22	10
12	8
16	8
173	21
18	10
116	18
12	8
48	12
35	11
12	8
18	10
12	8
19	7
22	10
130	18
38	10
24	12
20	8
18	10
8	8
22	10
12	8
22	10
29	9
48	12
20	8
18	10
32	12
18	10
8	8
20	8
18	10
12	8
30	10
28	12
18	10
16	8
22	10
22	10
43	11
14	10
20	8
8	8
18	10
30	10
20	8
8	8
14	8
20	8
32	12
32	12
38	10
16	8
40	12
18	10
20	8
36	12
43	11
16	8
16	8
40	12
8	8
22	10
22	10
29	9
18	10
8	8
20	8
88	16
35	11
88	16
38	10
22	10
18	10
43	11
12	8
18	10
22	10
22	10
29	9
36	12
38	10
38	10
56	14
8	8
35	11
20	8
20	8
38	10
16	8
20	8
8	8
24	12
26	10
38	10
16	8
36	12
22	10
10	10
26	10
20	8
43	11
22	10
90	16
22	10
18	10
18	10
18	10
20	8
26	10
43	11
22	10
20	8
19	7
8	8
16	8
8	8
20	8
14	10
19	7
22	10
20	8
16	8
43	11
110	18
38	10
16	8
28	12
19	7
8	8
20	8
18	10
18	10
18	10
30	10
16	8
16	8
18	10
18	10
19	7
8	8
12	8
26	10
20	8
16	8
16	8
22	10
12	8
30	10
18	10
76	14
16	8
18	10
20	8
22	10
20	8
20	8
20	8
18	10
43	11
37	11
18	10
18	10
22	10
8	8
30	10
12	8
19	7
22	10
43	11
20	8
26	10
19	7
18	10
8	8
8	8
30	10
29	9
19	7
22	10
16	8
22	10
12	8
12	8
22	10
48	12
16	8
12	8
48	12
18	10
30	10
22	10
19	7
8	8
12	8
16	8
30	10
30	10
12	8
38	10
40	12
22	10
12	8
18	10
22	10
15	9
28	12
16	8
136	20
18	10
22	10
15	9
28	10
8	8
12	8
8	8
8	8
22	10
26	12
100	16
29	9
8	8
50	14
19	7
20	8
29	9
12	8
28	10
16	8
12	8
22	10
16	8
22	10
112	16
22	10
30	10
28	10
28	10
123	17
20	8
8	8
20	8
136	20
142	18
10	10
8	8
16	8
43	11
42	12
19	7
12	8
8	8
18	10
30	10
43	11
18	10
8	8
29	9
22	10
36	12
12	8
18	10
22	10
76	14
36	12
28	10
30	10
22	10
8	8
19	7
30	10
30	10
33	9
16	8
8	8
8	8
19	7
18	10
36	12
18	10
169	21
29	9
24	12
22	10
8	8
19	7
12	8
28	10
43	11
12	8
22	10
18	10
12	8
12	8
30	10
48	12
16	8
16	8
8	8
12	8
8	8
12	8
12	8
8	8
30	10
19	7
12	8
40	12
18	10
18	10
28	12
20	8
38	10
22	10
18	10
18	10
20	8
26	10
28	10
18	10
54	14
29	9
14	8
12	8
22	10
43	11
12	8
14	8
16	8
22	10
36	12
8	8
33	9
16	8
26	10
8	8
16	8
12	8
12	8
8	8
8	8
35	11
43	11
43	11
35	11
20	8
56	14
50	14
16	8
44	12
16	8
18	10
8	8
30	10
50	14
10	10
36	12
20	8
20	8
43	11
20	8
28	10
12	8
26	10
16	8
16	8
16	8
38	10
15	9
22	10
30	10
18	10
30	10
33	9
30	10
16	8
33	9
26	12
18	10
12	8
10	10
8	8
22	10
16	8
8	8
30	10
38	10
16	8
43	11
43	11
12	8
22	10
48	14
28	10
18	10
8	8
33	9
18	10
30	10
8	8
35	11
12	8
46	14
44	12
94	14
78	14
20	8
28	12
38	10
18	10
16	8
22	10
18	10
22	10
22	10
18	10
16	8
107	17
20	8
12	8
18	10
43	11
28	10
18	10
22	10
8	8
16	8
22	10
36	12
28	10
8	8
22	10
12	8
12	8
20	8
19	7
18	10
30	10
16	8
8	8
22	10
30	10
18	10
8	8
14	8
94	14
43	11
32	12
36	12
50	14
12	8
130	18
16	8
10	10
18	10
28	10
28	10
8	8
39	11
30	10
18	10
38	10
22	10
22	10
19	7
28	10
16	8
30	10
18	10
20	8
48	12
33	9
19	7
8	8
16	8
16	8
38	10
33	9
16	8
116	16
16	8
30	10
33	9
36	12
22	10
22	10
20	8
33	9
48	12
26	10
26	10
30	10
38	10
33	9
88	16
19	7
20	8
12	8
28	10
22	10
38	10
35	11
38	10
18	10
19	7
16	8
16	8
126	18
38	10
12	8
38	10
8	8
20	8
35	11
28	12
43	11
16	8
20	8
28	10
22	10
12	8
48	12
43	11
12	8
8	8
30	10
22	10
22	10
29	9
33	9
48	12
35	11
22	10
42	14
18	10
38	10
14	10
43	11
36	12
8	8
22	10
10	10
160	20
30	10
18	10
8	8
8	8
36	12
44	12
16	8
18	10
15	9
38	10
20	8
22	10
16	8
26	10
26	10
18	10
12	8
16	8
16	8
19	7
104	16
8	8
30	10
43	11
16	8
12	8
40	12
43	11
38	10
50	14
16	8
100	16
12	8
10	10
22	10
8	8
20	8
16	8
16	8
22	10
12	8
26	10
30	10
22	10
28	10
20	8
8	8
16	8
16	8
8	8
8	8
44	12
22	10
35	11
30	10
26	10
28	10
30	10
22	10
29	9
48	12
8	8
19	7
20	8
8	8
20	8
18	10
80	16
50	14
8	8
24	12
18	10
22	10
36	12
8	8
18	10
35	11
18	10
18	10
16	8
28	10
18	10
28	10
8	8
22	10
15	9
38	10
15	9
16	8
28	10
18	10
14	8
8	8
18	10
19	7
24	12
8	8
28	12
38	10
20	8
22	10
28	10
37	11
20	8
18	10
18	10
16	8
20	8
22	10
20	8
8	8
8	8
43	11
20	8
26	10
16	10
38	10
28	10
30	10
43	11
20	8
35	11
30	10
30	10
20	8
38	10
18	10
12	8
12	8
19	7
58	14
35	11
10	10
30	10
20	8
43	11
28	10
44	12
18	10
42	14
20	8
20	8
35	11
38	10
8	8
19	7
18	10
43	11
48	12
8	8
35	11
24	12
30	10
33	9
8	8
38	10
30	10
98	14
18	10
19	7
20	8
14	10
22	10
20	8
8	8
18	10
20	8
8	8
26	10
43	11
43	11
22	10
20	8
35	11
8	8
8	8
18	10
8	8
16	8
35	11
8	8
18	10
14	10
12	8
16	8
30	10
32	12
100	16
16	8
35	11
40	12
28	12
33	9
8	8
18	10
36	12
18	10
28	12
26	10
16	8
35	11
22	10
8	8
8	8
10	10
33	9
12	8
12	8
32	12
126	18
28	10
16	8
10	10
26	10
22	10
18	10
22	10
18	10
12	8
28	10
20	8
20	12
92	16
44	12
22	10
30	10
12	8
24	12
30	10
50	14
18	10
38	10
30	10
44	12
44	12
16	8
50	14
26	10
16	8
33	9
20	8
44	12
8	8
38	10
22	10
38	10
20	8
44	12
16	8
20	8
18	10
116	18
33	9
37	11
12	8
12	8
112	16
30	10
28	10
30	10
22	10
110	16
22	10
112	16
18	10
35	11
16	8
28	12
48	12
38	10
20	8
43	11
20	12
36	12
20	8
22	10
16	8
43	11
18	10
16	8
12	8
20	8
80	14
12	8
30	10
12	8
8	8
16	8
12	8
50	14
18	10
22	10
12	8
20	8
52	14
18	10
19	7
16	8
44	12
12	8
35	11
18	10
16	8
22	10
43	11
38	10
30	10
18	10
20	8
8	8
107	17
76	14
36	12
16	8
20	8
22	10
16	8
54	14
38	10
22	10
8	8
16	8
43	11
12	8
18	10
8	8
38	10
16	8
8	8
94	14
43	11
8	8
22	10
118	18
22	10
19	7
43	11
35	11
149	21
24	12
12	8
24	12
10	10
38	10
8	8
12	8
43	11
19	7
20	8
20	8
28	10
8	8
8	8
16	8
18	10
22	10
20	8
26	10
30	10
22	10
22	10
33	9
12	8
18	10
43	11
20	8
16	10
22	10
40	12
18	10
38	10
8	8
28	10
22	10
35	11
12	8
22	10
18	10
22	10
12	8
22	10
20	8
33	9
20	8
19	7
16	8
22	10
50	14
28	10
32	12
8	8
20	12
29	9
22	10
40	12
43	11
8	8
30	10
12	8
18	10
26	10
38	10
12	8
20	12
20	8
43	11
38	10
8	8
12	8
8	8
16	8
32	12
38	10
78	14
38	10
8	8
20	8
14	8
14	8
24	12
33	9
38	10
22	10
16	8
20	8
26	10
30	10
43	11
16	8
22	10
8	8
15	9
134	18
19	7
16	8
8	8
8	8
12	8
18	10
35	11
16	8
8	8
48	12
109	17
8	8
8	8
38	10
16	8
30	10
36	12
28	10
36	12
36	12
18	10
8	8
30	10
12	8
12	8
43	11
26	10
22	10
38	10
16	8
15	9
20	8
10	10
22	10
40	12
12	8
101	17
38	10
29	9
29	9
20	8
8	8
43	11
38	10
30	10
18	10
58	14
18	10
8	8
43	11
76	14
16	8
35	11
36	12
22	10
8	8
8	8
28	10
20	8
38	10
84	16
40	12
22	10
19	7
16	8
12	8
18	10
35	11
18	10
50	14
20	8
43	11
29	9
19	7
38	10
50	14
20	8
43	11
19	7
30	10
16	10
30	10
16	8
50	14
18	10
20	8
133	17
8	8
28	10
22	10
8	8
18	10
12	8
12	8
32	12
22	10
8	8
28	10
30	10
38	10
8	8
20	8
16	8
22	10
20	8
16	8
19	7
18	10
22	10
8	8
19	7
22	10
36	12
35	11
22	10
22	10
18	10
16	8
12	8
30	10
8	8
26	10
19	7
8	8
30	10
30	10
38	10
20	8
19	7
16	8
16	8
38	10
20	8
44	12
26	10
30	10
36	12
20	8
18	10
12	8
22	10
16	8
24	12
38	10
8	8
8	8
8	8
8	8
8	8
22	10
16	8
8	8
28	12
20	8
38	10
22	10
20	8
22	10
30	10
40	12
18	10
24	12
22	10
8	8
8	8
30	10
16	8
30	10
8	8
22	10
16	8
19	7
16	8
58	14
19	7
30	10
18	10
18	10
22	10
38	10
44	12
20	8
38	10
8	8
96	16
18	10
12	8
30	10
22	10
28	10
22	10
43	11
78	14
43	11
43	11
38	10
8	8
20	8
8	8
20	8
48	12
16	8
12	8
94	16
22	10
40	12
33	9
29	9
22	10
12	8
8	8
38	10
8	8
22	10
18	10
14	10
43	11
43	11
8	8
19	7
18	10
30	10
28	10
12	8
15	9
22	10
22	10
22	10
43	11
35	11
24	12
33	9
12	8
126	18
38	10
33	9
24	12
100	16
8	8
19	7
16	8
18	10
18	10
8	8
8	8
38	10
50	14
8	8
15	9
43	11
160	20
18	10
26	10
16	8
30	10
12	8
12	8
20	8
18	10
18	10
32	12
19	7
8	8
20	8
30	10
30	10
8	8
20	12
12	8
22	10
40	12
22	10
30	10
12	8
36	12
22	10
80	16
19	7
22	10
18	10
30	10
18	10
29	9
22	10
35	11
94	14
20	8
22	10
20	8
20	8
22	10
8	8
8	8
28	10
30	10
20	8
18	10
20	8
8	8
108	16
20	8
12	8
22	10
18	10
43	11
43	11
18	10
29	9
30	10
38	10
12	8
15	9
8	8
8	8
20	8
18	10
33	9
22	10
30	10
8	8
8	8
12	8
43	11
14	10
19	7
18	10
46	14
22	10
43	11
43	11
16	8
12	8
8	8
22	10
20	8
20	8
8	8
19	7
22	10
18	10
38	10
8	8
18	10
28	10
16	8
8	8
26	10
22	10
20	12
8	8
29	9
36	12
43	11
22	10
22	10
20	8
18	10
8	8
12	8
30	10
18	10
20	8
43	11
16	8
12	8
43	11
8	8
30	10
16	8
28	10
16	8
169	21
18	10
16	8
33	9
106	14
43	11
12	8
18	10
39	11
12	8
35	11
19	7
16	8
28	10
30	10
12	8
19	7
10	10
16	8
30	10
22	10
22	10
33	9
22	10
18	10
43	11
30	10
40	12
20	8
12	8
18	10
30	10
18	10
38	10
18	10
8	8
20	8
20	8
18	10
44	12
8	8
20	8
43	11
44	12
18	10
16	8
12	8
16	8
20	8
20	12
12	8
8	8
29	9
30	10
16	8
38	10
12	8
18	10
18	10
33	9
12	8
22	10
18	10
8	8
18	10
30	10
20	8
14	10
44	12
8	8
8	8
28	10
43	11
38	10
18	10
30	10
12	8
10	10
40	12
22	10
19	7
33	9
26	10
37	11
35	11
44	12
33	9
12	8
16	8
33	9
16	8
30	10
22	10
16	8
20	8
33	9
38	10
20	8
44	12
38	10
18	10
19	7
18	10
20	8
8	8
35	11
12	8
19	7
36	12
16	8
40	12
35	11
22	10
90	16
33	9
18	10
22	10
58	14
12	8
12	8
8	8
36	12
18	10
36	12
18	10
40	12
8	8
18	10
22	10
38	10
38	10
16	8
43	11
30	10
8	8
43	11
38	10
20	8
8	8
33	9
30	10
36	12
35	11
18	10
30	10
29	9
33	9
8	8
8	8
16	8
16	8
12	8
16	8
16	8
16	8
20	8
26	10
8	8
8	8
12	8
29	9
36	12
19	7
12	8
38	10
16	8
36	12
52	14
22	10
14	8
8	8
18	10
44	12
12	8
16	8
8	8
48	12
14	10
18	10
35	11
38	10
20	8
38	10
18	10
8	8
58	14
12	8
28	12
38	10
43	11
16	8
16	8
22	10
8	8
18	10
16	10
28	10
16	8
16	8
16	8
12	8
32	12
40	12
12	8
26	10
8	8
16	8
18	10
38	10
16	8
10	10
8	8
8	8
16	8
106	14
22	10
12	8
15	9
16	8
38	10
18	10
18	10
50	14
19	7
8	8
44	12
43	11
30	10
20	8
10	10
19	7
20	8
22	10
26	10
30	10
20	8
8	8
33	9
43	11
19	7
18	10
22	10
38	10
30	10
22	10
12	8
36	12
20	8
38	10
30	10
22	10
20	8
16	8
12	8
12	8
8	8
26	10
18	10
22	10
40	12
18	10
18	10
19	7
38	10
30	10
33	9
16	8
20	8
8	8
40	12
8	8
16	8
16	8
40	12
28	10
32	12
16	8
8	8
36	12
16	8
12	8
12	8
30	10
18	10
18	10
16	8
18	10
26	10
12	8
38	10
30	10
12	8
12	8
43	11
8	8
22	10
28	10
20	8
33	9
43	11
30	10
16	8
30	10
19	7
20	8
8	8
22	10
20	8
22	10
22	10
18	10
18	10
8	8
16	8
30	10
22	10
8	8
19	7
22	10
12	8
43	11
28	12
29	9
28	10
39	11
36	12
18	10
30	10
58	14
20	8
43	11
22	10
19	7
22	10
44	12
20	8
20	8
30	10
30	10
22	10
8	8
36	12
8	8
18	10
8	8
28	10
22	10
18	10
43	11
22	10
200	20
22	10
18	10
43	11
19	7
22	10
30	10
8	8
32	12
12	8
22	10
30	10
35	11
16	8
22	10
20	8
43	11
18	10
18	10
36	12
8	8
12	8
26	10
26	10
28	10
43	11
36	12
18	10
16	8
20	8
43	11
20	8
18	10
22	10
22	10
18	10
14	8
16	10
35	11
20	8
12	8
38	10
18	10
19	7
20	8
44	12
12	8
8	8
16	8
20	8
29	9
36	12
8	8
8	8
16	8
22	10
10	10
22	10
16	8
20	8
43	11
12	8
8	8
38	10
26	10
16	8
22	10
40	12
33	9
20	8
33	9
18	10
12	8
43	11
35	11
20	8
12	8
28	10
16	8
12	8
22	10
22	10
38	10
16	8
30	10
16	8
20	8
20	8
8	8
43	11
18	10
29	9
100	16
30	10
8	8
36	12
12	8
20	12
15	9
20	8
18	10
30	10
35	11
20	8
43	11
8	8
40	12
30	10
8	8
16	10
38	10
20	8
32	12
22	10
16	8
88	16
12	8
20	8
30	10
98	14
20	8
26	10
32	12
20	8
8	8
19	7
22	10
92	16
30	10
22	10
22	10
16	8
18	10
32	12
12	8
22	10
43	11
12	8
20	8
16	8
8	8
14	10
30	10
16	8
18	10
22	10
18	10
30	10
20	8
33	9
37	11
30	10
38	10
8	8
8	8
110	16
12	8
8	8
32	12
12	8
30	10
20	8
94	14
28	12
12	8
33	9
22	10
30	10
8	8
8	8
104	16
22	10
16	8
8	8
18	10
18	10
43	11
48	12
30	10
12	8
26	10
30	10
43	11
29	9
18	10
43	11
8	8
20	8
12	8
15	9
38	10
43	11
28	10
38	10
28	12
44	12
29	9
16	8
100	16
20	8
14	8
30	10
19	7
12	8
92	16
43	11
118	18
76	14
28	12
58	14
8	8
43	11
8	8
12	8
16	8
38	10
36	12
39	11
18	10
22	10
88	16
12	8
8	8
22	10
8	8
43	11
22	10
12	8
16	8
18	10
22	10
22	10
40	12
30	10
16	8
16	8
8	8
22	10
43	11
40	12
12	8
43	11
15	9
30	10
16	8
20	8
43	11
12	8
14	8
16	8
18	10
22	10
18	10
22	10
10	10
12	8
8	8
22	10
8	8
8	8
38	10
16	8
16	8
22	10
16	8
22	10
16	8
35	11
18	10
30	10
22	10
22	10
76	14
50	14
18	10
22	10
43	11
20	8
20	8
22	10
48	12
30	10
22	10
22	10
38	10
8	8
12	8
22	10
43	11
8	8
10	10
8	8
94	16
18	10
12	8
29	9
22	10
12	8
94	14
12	8
35	11
16	8
22	10
16	8
12	8
14	10
116	18
8	8
12	8
19	7
16	8
20	8
30	10
20	8
22	10
12	8
18	10
20	8
12	8
28	10
38	10
24	12
12	8
43	11
12	8
43	11
42	14
35	11
18	10
19	7
38	10
20	8
16	8
18	10
12	8
19	7
16	8
8	8
40	12
16	8
8	8
18	10
16	8
43	11
48	14
12	8
102	18
8	8
8	8
20	8
32	12
16	8
40	12
110	14
15	9
18	10
22	10
38	10
20	8
20	8
8	8
22	10
30	10
16	8
20	8
18	10
12	8
19	7
20	8
20	12
18	10
12	8
20	8
28	10
8	8
8	8
18	10
12	8
30	10
18	10
38	10
16	8
24	12
12	8
22	10
18	10
12	8
30	10
12	8
20	12
28	12
18	10
20	8
8	8
116	18
28	10
8	8
28	10
16	8
36	12
26	10
24	12
16	8
18	10
18	10
12	8
30	10
18	10
38	10
26	10
10	10
43	11
8	8
20	8
18	10
22	10
20	8
12	8
30	10
20	8
20	8
38	10
12	8
12	8
20	8
18	10
35	11
22	10
38	10
18	10
29	9
12	8
19	7
18	10
20	8
33	9
152	20
22	10
20	8
22	10
28	10
30	10
30	10
38	10
18	10
30	10
12	8
8	8
30	10
20	8
8	8
22	10
12	8
26	10
16	8
8	8
38	10
20	8
12	8
30	10
18	10
8	8
8	8
30	10
36	12
18	10
8	8
16	8
18	10
35	11
12	8
88	16
15	9
12	8
20	8
18	10
16	8
22	10
52	14
22	10
43	11
20	8
35	11
30	10
18	10
29	9
30	10
16	8
43	11
18	10
35	11
22	10
22	10
12	8
44	12
54	14
19	7
16	8
12	8
28	10
12	8
30	10
33	9
18	10
78	14
18	10
12	8
35	11
20	8
12	8
38	10
16	8
12	8
28	10
30	10
43	11
30	10
30	10
30	10
40	12
29	9
8	8
16	8
30	10
43	11
18	10
18	10
28	12
10	10
22	10
30	10
20	8
33	9
12	8
12	8
12	8
22	10
20	8
20	8
22	10
20	8
18	10
44	12
18	10
16	8
14	8
38	10
33	9
48	12
8	8
8	8
40	12
36	12
12	8
76	14
16	8
12	8
30	10
12	8
24	12
43	11
18	10
43	11
8	8
16	8
22	10
43	11
26	10
16	8
24	12
18	10
8	8
20	8
22	10
15	9
168	20
106	14
20	8
30	10
20	8
20	8
22	10
20	8
30	10
74	14
20	8
43	11
26	10
38	10
38	10
36	12
28	10
29	9
28	10
12	8
36	12
22	10
18	10
8	8
8	8
20	8
22	10
33	9
14	10
8	8
28	10
22	10
35	11
20	8
38	10
40	12
16	8
8	8
8	8
38	10
8	8
16	8
42	14
20	8
30	10
43	11
18	10
30	10
28	10
12	8
16	8
26	10
22	10
8	8
22	10
22	10
8	8
12	8
18	10
12	8
38	10
26	10
35	11
18	10
18	10
16	8
30	10
24	12
16	8
8	8
30	10
8	8
30	10
18	10
22	10
48	12
12	8
8	8
22	10
36	12
16	8
30	10
18	10
20	8
14	8
28	10
43	11
8	8
22	10
28	10
43	11
8	8
16	8
19	7
20	8
22	10
43	11
43	11
19	7
33	9
22	10
12	8
43	11
43	11
8	8
32	12
28	10
8	8
37	11
35	11
22	10
24	12
80	16
33	9
18	10
30	10
116	16
18	10
48	12
22	10
12	8
43	11
8	8
8	8
43	11
43	11
22	10
84	16
8	8
74	14
38	10
20	8
18	10
36	12
44	12
116	16
12	8
22	10
19	7
14	10
8	8
12	8
38	10
40	12
92	16
35	11
16	8
16	8
16	8
19	7
16	8
10	10
8	8
8	8
36	12
100	16
16	8
18	10
20	8
38	10
8	8
30	10
8	8
29	9
16	8
30	10
16	8
22	10
16	8
22	10
22	10
43	11
16	8
22	10
26	10
30	10
22	10
12	8
38	10
28	10
44	12
8	8
8	8
18	10
16	8
16	8
18	10
30	10
29	9
12	8
112	16
22	10
12	8
152	20
22	10
16	8
36	12
12	8
44	12
8	8
16	8
12	8
16	8
22	10
12	8
20	8
30	10
12	8
16	8
22	10
18	10
35	11
130	18
35	11
38	10
18	10
177	21
20	8
38	10
18	10
22	10
8	8
8	8
22	10
20	8
38	10
18	10
18	10
10	10
12	8
30	10
38	10
30	10
12	8
32	12
20	8
20	8
16	8
20	8
38	10
20	8
8	8
125	17
22	10
16	8
14	10
8	8
19	7
22	10
16	8
18	10
16	8
22	10
29	9
10	10
28	10
12	8
35	11
16	8
19	7
38	10
35	11
16	8
43	11
8	8
38	10
40	12
16	8
20	8
14	8
20	8
36	12
12	8
20	8
18	10
8	8
12	8
18	10
18	10
16	8
30	10
20	8
8	8
12	8
50	14
19	7
26	10
43	11
26	10
36	12
22	10
38	10
18	10
19	7
30	10
16	8
22	10
37	11
30	10
22	10
18	10
20	8
18	10
20	8
28	10
38	10
80	14
18	10
12	8
18	10
106	14
58	14
20	8
50	14
34	12
76	14
16	8
16	8
16	8
33	9
18	10
43	11
38	10
18	10
20	8
8	8
36	12
15	9
44	12
38	10
8	8
22	10
8	8
33	9
8	8
36	12
22	10
38	10
43	11
22	10
18	10
12	8
30	10
30	10
16	10
44	14
20	12
20	8
38	10
20	12
43	11
12	8
16	8
22	10
20	8
130	18
125	17
16	8
8	8
28	12
19	7
20	8
30	10
38	10
12	8
28	10
22	10
19	7
22	10
43	11
130	18
156	20
10	10
48	12
22	10
8	8
16	8
24	12
16	8
10	10
76	14
8	8
18	10
20	8
30	10
36	12
30	10
18	10
10	10
36	12
50	14
35	11
19	7
30	10
16	8
88	16
30	10
40	12
8	8
35	11
22	10
29	9
12	8
8	8
12	8
20	12
18	10
28	10
20	8
29	9
12	8
30	10
8	8
16	8
84	16
8	8
22	10
12	8
30	10
26	10
35	11
22	10
18	10
22	10
12	8
16	8
22	10
16	8
8	8
30	10
20	8
28	10
10	10
30	10
20	8
18	10
30	10
8	8
8	8
35	11
8	8
52	14
12	8
22	10
38	10
8	8
12	8
10	10
30	10
20	8
18	10
43	11
28	10
12	8
16	8
16	8
16	8
44	12
46	14
38	10
35	11
38	10
22	10
12	8
43	11
22	10
16	8
18	10
20	8
8	8
43	11
20	8
22	10
16	8
12	8
8	8
8	8
10	10
92	16
20	8
38	10
16	8
14	8
14	8
20	8
16	8
40	12
16	8
20	8
20	8
30	10
80	14
20	8
12	8
12	8
20	8
18	10
12	8
40	12
28	10
12	8
35	11
22	10
35	11
20	8
16	8
8	8
18	10
12	8
12	8
18	10
32	12
12	8
22	10
22	10
22	10
29	9
20	8
16	8
20	8
16	8
36	12
14	10
20	8
18	10
28	10
8	8
33	9
8	8
36	12
19	7
32	12
18	10
22	10
19	7
36	12
18	10
22	10
18	10
12	8
22	10
116	16
43	11
100	16
24	12
16	8
30	10
19	7
18	10
12	8
38	10
19	7
22	10
38	10
20	8
18	10
88	16
22	10
32	12
12	8
18	10
22	10
16	8
36	12
19	7
38	10
8	8
16	8
18	10
33	9
8	8
18	10
20	8
12	8
20	8
18	10
30	10
28	12
20	8
28	12
20	8
29	9
8	8
16	8
16	8
18	10
28	10
12	8
28	10
12	8
32	12
30	10
43	11
30	10
8	8
22	10
38	10
36	12
44	12
43	11
20	8
39	11
12	8
30	10
8	8
20	8
16	8
40	12
36	12
12	8
44	12
22	10
86	16
16	8
12	8
36	12
12	8
44	12
18	10
20	8
12	8
20	8
18	10
33	9
22	10
18	10
20	8
12	8
12	8
8	8
19	7
24	12
22	10
8	8
12	8
20	8
20	8
28	10
22	10
20	8
20	8
20	8
30	10
18	10
40	12
20	8
20	12
38	10
20	8
43	11
10	10
18	10
12	8
38	10
18	10
12	8
22	10
88	16
8	8
38	10
18	10
50	14
18	10
28	10
18	10
29	9
16	8
32	12
18	10
12	8
20	8
36	12
22	10
78	14
10	10
35	11
30	10
30	10
29	9
8	8
20	8
20	8
22	10
22	10
16	8
19	7
22	10
12	8
12	8
33	9
20	8
100	16
18	10
22	10
28	10
38	10
20	8
43	11
8	8
8	8
38	10
8	8
20	8
12	8
20	8
20	8
12	8
20	8
88	16
30	10
16	8
20	8
14	10
8	8
38	10
12	8
12	8
8	8
29	9
14	10
16	8
18	10
37	11
22	10
22	10
43	11
22	10
20	8
8	8
12	8
22	10
22	10
22	10
8	8
36	12
26	12
43	11
16	8
19	7
12	8
12	8
16	8
36	12
12	8
8	8
16	8
26	10
18	10
12	8
30	10
8	8
43	11
20	8
30	10
12	8
22	10
8	8
22	10
20	8
16	8
16	8
8	8
18	10
28	10
42	14
22	10
38	10
76	14
30	10
10	10
15	9
43	11
22	10
35	11
22	10
12	8
20	8
16	8
16	8
18	10
38	10
38	10
12	8
50	14
38	10
20	8
38	10
16	8
8	8
8	8
18	10
22	10
35	11
16	8
29	9
36	12
22	10
8	8
18	10
22	10
24	12
29	9
19	7
16	8
43	11
20	8
116	18
30	10
18	10
22	10
46	14
112	16
43	11
22	10
12	8
35	11
38	10
40	12
22	10
22	10
16	8
18	10
22	10
36	12
16	8
18	10
12	8
8	8
16	8
12	8
38	10
28	10
12	8
16	8
36	12
19	7
19	7
33	9
18	10
8	8
20	8
18	10
106	14
30	10
8	8
8	8
16	8
22	10
12	8
18	10
28	10
16	8
12	8
22	10
12	8
8	8
18	10
28	12
22	10
26	10
44	12
38	10
18	10
26	10
30	10
8	8
8	8
20	8
14	8
8	8
38	10
8	8
16	8
16	8
40	12
12	8
26	10
12	8
36	12
12	8
22	10
15	9
12	8
8	8
8	8
20	8
22	10
38	10
24	12
20	8
19	7
18	10
38	10
19	7
36	12
22	10
16	8
16	8
20	8
20	8
38	10
8	8
22	10
20	12
12	8
12	8
58	14
20	8
33	9
38	10
12	8
16	8
22	10
8	8
38	10
43	11
28	10
8	8
18	10
16	8
30	10
43	11
16	8
22	10
18	10
38	10
22	10
12	8
18	10
29	9
38	10
30	10
26	10
43	11
92	16
16	8
8	8
38	10
18	10
22	10
22	10
12	8
18	10
44	12
43	11
12	8
16	8
18	10
14	8
38	10
32	12
18	10
18	10
20	8
10	10
20	8
44	12
33	9
22	10
8	8
22	10
18	10
30	10
22	10
8	8
38	10
28	10
35	11
18	10
110	14
20	12
20	8
16	8
22	10
35	11
33	9
22	10
19	7
134	18
43	11
20	8
16	8
26	10
22	10
100	16
30	10
8	8
43	11
33	9
22	10
12	8
19	7
43	11
43	11
28	12
19	7
30	10
112	16
16	8
22	10
16	8
20	8
35	11
20	8
16	8
29	9
12	8
12	8
94	14
28	10
36	12
28	10
16	8
30	10
30	10
38	10
38	10
12	8
36	12
8	8
18	10
12	8
50	14
94	14
38	10
35	11
22	10
38	10
