Score	Length
350	38
316	44
68	20
624	36
254	32
110	26
522	60
470	44
430	48
370	26
444	44
154	34
192	28
250	34
480	40
84	28
82	30
132	32
138	30
332	42
282	50
168	24
386	54
402	46
390	50
150	34
366	48
402	30
482	50
1024	70
64	24
722	66
270	40
260	24
1340	78
122	34
162	42
126	30
116	20
1174	66
208	40
294	42
296	38
592	76
620	64
438	46
434	54
910	70
274	34
1626	86
282	42
204	26
184	36
196	36
480	44
100	36
258	50
186	26
550	58
86	22
214	38
150	34
148	24
1144	70
1090	68
82	22
98	30
268	32
162	26
58	30
236	48
338	42
554	42
286	58
402	46
322	46
142	40
546	54
136	48
580	52
222	42
458	40
58	30
144	20
258	44
312	34
112	32
534	50
314	50
1598	82
530	54
26	26
240	32
262	38
184	40
326	38
84	36
1684	66
472	40
856	80
572	36
192	24
124	44
398	62
194	38
1224	76
356	56
678	50
870	74
68	28
994	78
354	26
258	34
130	26
352	40
70	18
112	32
304	28
676	54
228	28
104	36
66	30
464	48
146	30
206	26
682	62
722	56
592	60
94	30
440	58
120	30
644	56
50	14
474	36
194	42
256	36
198	42
164	48
340	40
278	34
88	28
1108	76
342	30
172	20
738	54
1004	62
544	72
710	58
92	28
252	38
848	66
590	50
314	30
364	36
448	34
80	28
296	48
262	38
398	42
400	56
136	32
60	28
334	42
194	34
512	48
170	38
110	34
240	36
808	62
564	48
2866	116
114	30
50	18
482	38
260	32
54	22
146	26
422	48
72	28
46	22
634	54
224	48
370	44
92	36
76	32
202	34
370	38
112	28
42	14
82	26
210	34
76	26
1288	82
266	34
198	30
254	34
338	42
1988	108
174	26
298	52
472	48
692	64
1388	78
660	56
412	40
370	42
652	48
192	32
788	52
642	50
548	48
216	32
154	30
452	56
54	22
202	38
3466	118
478	62
444	60
386	42
532	52
320	40
186	42
372	44
112	32
222	30
116	20
128	20
914	66
374	38
110	30
616	52
1014	70
222	38
208	36
952	64
130	22
234	42
280	48
202	34
116	26
226	38
146	30
84	36
206	34
200	36
512	56
182	34
126	30
418	46
320	44
840	52
254	42
172	32
714	60
816	58
738	68
378	42
114	26
78	26
300	34
322	38
1350	70
218	34
252	48
1032	68
104	24
288	48
392	52
96	32
228	36
612	64
208	44
294	34
34	26
222	34
100	36
294	44
232	36
44	20
174	30
1404	80
2716	94
160	40
140	24
122	34
262	50
176	32
108	20
42	26
106	26
750	56
796	54
174	34
1070	66
438	38
1074	50
228	36
590	74
52	24
1178	98
342	50
272	40
232	24
92	32
174	48
474	46
276	36
42	26
334	42
420	28
758	66
224	36
698	54
588	48
452	44
106	22
1232	78
964	62
364	50
214	38
19	7
364	40
64	16
320	38
382	38
248	40
178	38
1146	54
58	34
304	38
490	48
348	36
108	28
164	36
104	28
754	50
110	34
186	34
122	26
894	62
38	22
210	26
678	70
268	38
460	64
222	34
288	32
568	50
88	32
136	24
940	64
184	36
1036	74
404	44
96	24
156	24
326	58
178	28
1160	72
42	26
362	38
828	60
300	28
564	40
130	30
1310	66
516	52
258	42
1328	80
258	34
150	26
54	26
280	32
132	32
104	28
416	44
120	24
78	42
156	20
344	52
210	38
132	24
566	42
3484	130
440	48
244	32
522	50
452	56
252	32
508	38
472	54
102	30
150	34
916	80
258	36
56	28
626	70
142	30
386	40
19	7
214	30
186	34
114	30
180	28
108	28
668	46
126	38
122	34
36	20
124	28
182	30
848	58
78	26
278	40
130	22
144	36
462	62
28	28
138	38
420	48
94	26
308	44
1230	72
500	40
518	66
418	50
116	12
104	20
768	76
290	42
694	68
222	34
200	28
546	50
348	46
846	58
388	32
146	38
156	36
528	48
406	46
104	28
226	42
418	42
452	52
290	34
216	30
308	48
288	40
108	20
650	52
308	36
474	42
262	38
208	36
156	28
200	40
298	42
52	28
188	36
714	58
562	60
150	34
176	36
158	24
334	42
352	48
188	36
126	22
1206	78
256	40
608	52
196	44
558	58
1042	74
262	34
438	38
60	24
34	26
94	30
254	38
252	28
488	44
236	40
440	36
98	30
232	36
254	46
438	54
414	34
194	18
108	32
172	36
224	52
580	56
242	38
628	56
362	54
60	18
336	34
130	18
650	48
806	78
736	60
86	24
148	40
72	28
284	32
218	40
332	40
546	50
330	38
426	42
722	58
450	38
180	32
202	30
570	40
862	64
132	40
454	56
222	30
476	60
276	36
98	30
186	20
416	36
444	32
188	36
206	34
388	48
1292	92
90	26
1122	66
214	30
84	16
450	54
100	28
146	26
604	64
232	36
62	30
342	42
640	76
302	42
466	36
316	38
918	74
154	34
138	34
952	66
378	38
460	56
54	22
178	30
672	60
68	28
48	24
434	46
390	34
512	52
302	30
428	46
1278	78
378	38
424	48
174	34
726	58
206	34
236	36
106	34
186	46
1138	66
306	34
428	44
588	52
488	42
210	26
1750	98
372	52
38	34
354	50
306	36
446	46
268	40
506	42
344	52
338	38
424	44
490	58
256	32
812	40
222	42
690	62
566	62
286	42
414	38
64	24
408	34
132	24
1408	76
228	36
968	54
734	66
58	18
448	44
248	40
576	60
246	38
94	26
52	24
82	22
104	28
448	44
36	24
324	32
52	36
744	50
638	62
720	60
996	78
800	48
418	32
358	42
2014	102
244	32
320	44
284	24
242	38
676	52
708	68
224	56
710	58
126	24
136	24
28	24
192	32
406	48
230	26
134	38
758	62
190	46
184	24
52	28
194	30
712	62
497	54
64	28
352	38
266	50
758	60
170	30
770	64
866	60
1016	76
416	56
942	70
1058	50
86	26
150	30
68	32
307	26
138	26
132	28
366	38
142	32
334	34
326	50
522	44
218	26
32	24
112	24
198	26
186	34
182	50
762	58
422	42
118	42
672	60
64	28
332	48
252	40
132	32
708	56
846	46
318	38
640	44
188	28
170	34
518	50
194	26
66	30
56	44
736	56
618	46
396	48
510	62
452	40
310	54
244	44
88	32
186	30
728	74
538	46
270	28
160	36
2530	108
92	28
1112	72
294	54
484	42
648	44
254	34
436	44
200	36
540	40
526	40
172	34
218	36
228	56
200	32
84	16
144	24
136	36
228	36
368	44
110	26
518	42
32	32
768	56
46	14
606	60
110	38
464	60
206	38
22	22
516	44
298	42
98	34
146	34
174	34
264	28
1194	90
568	60
220	36
376	32
634	42
322	38
586	58
174	34
524	52
578	62
294	38
272	52
130	34
140	28
1200	54
230	34
198	34
522	50
190	26
530	50
174	42
19	7
58	18
176	24
94	26
156	28
192	32
516	44
652	68
120	26
786	56
252	40
308	36
1046	70
116	28
294	38
180	32
892	76
330	50
238	38
96	32
76	28
190	34
310	34
1000	62
19	7
222	38
120	24
250	30
146	42
78	26
324	36
112	28
120	32
194	38
38	14
144	40
626	58
416	52
586	50
268	52
116	32
348	36
762	50
256	44
352	40
636	56
258	38
60	36
1120	82
596	56
314	40
228	48
372	32
240	38
410	46
502	42
76	32
102	26
194	30
134	26
236	40
132	40
300	44
82	26
2406	106
298	34
336	46
758	56
1740	78
250	46
812	76
648	40
542	42
212	32
832	68
32	16
414	34
150	30
720	60
118	38
926	58
244	28
2008	96
544	44
166	26
900	60
94	26
244	32
1364	78
346	46
234	50
520	40
96	28
218	40
136	32
582	42
108	16
1496	100
1830	94
556	64
708	52
116	32
288	42
174	46
36	28
458	50
252	40
178	34
312	40
234	30
176	34
558	50
120	32
232	36
350	54
420	48
830	70
244	56
560	36
210	30
292	44
156	36
486	46
582	60
188	36
1008	62
146	30
58	18
360	40
190	38
198	38
308	32
412	36
394	48
144	32
116	28
56	28
68	24
54	26
312	40
112	30
344	44
806	54
178	38
212	32
520	48
66	22
256	40
758	66
248	40
340	28
406	42
56	32
358	38
210	34
304	44
214	46
40	24
126	30
214	38
94	30
388	50
2092	88
1670	94
396	60
82	30
180	40
292	28
900	70
194	30
328	50
222	42
724	48
50	30
308	44
448	42
68	24
542	58
804	84
396	52
192	40
114	30
532	46
304	52
994	80
326	24
464	34
430	38
216	42
1070	44
274	34
52	20
122	32
588	56
352	44
256	28
214	38
264	40
108	16
688	52
1106	62
284	24
78	32
42	14
770	66
212	32
166	30
500	56
208	40
252	32
88	28
406	46
148	28
206	34
38	24
724	52
180	28
1044	92
276	44
1126	64
238	30
470	50
358	26
334	28
122	30
732	70
1294	74
210	34
188	28
482	48
502	46
260	40
324	40
108	24
1728	90
56	20
168	28
286	46
208	30
242	42
132	36
300	28
404	48
488	32
128	28
298	28
220	48
202	38
174	26
994	78
432	52
362	46
38	26
400	48
26	22
78	22
790	66
412	52
366	42
158	22
132	32
342	42
184	36
188	32
754	50
218	46
140	32
262	38
1024	66
312	32
252	30
42	26
292	48
966	72
82	26
550	54
92	32
872	52
154	26
146	34
158	46
432	48
614	58
208	32
220	40
658	50
308	44
292	32
360	48
126	30
178	30
160	20
186	38
174	42
54	30
1528	72
236	32
566	78
1210	90
120	36
206	46
110	26
338	34
1802	96
40	24
550	54
204	38
230	30
414	46
46	14
536	48
188	40
1148	78
1378	76
1166	72
60	20
240	44
362	38
88	24
56	14
196	48
550	46
440	44
380	44
118	38
434	38
86	30
186	34
222	30
496	56
140	32
112	24
582	46
250	54
252	48
348	44
758	54
450	46
342	42
24	24
222	22
114	42
668	64
312	32
786	66
50	26
436	58
102	36
1670	84
240	44
660	54
86	20
2076	84
1116	66
440	56
400	32
840	58
210	34
492	44
566	50
232	36
316	36
244	30
232	32
774	70
274	26
446	42
244	32
662	62
286	38
1540	100
276	44
164	32
108	28
316	44
234	30
158	20
506	62
136	50
586	68
156	20
212	40
24	24
24	16
108	28
350	34
496	60
160	40
666	54
104	24
142	22
282	30
340	44
112	28
136	38
216	36
674	48
214	38
72	24
866	66
266	34
148	24
640	58
262	28
724	50
1016	58
216	34
528	60
148	34
344	48
246	42
872	68
150	34
222	32
582	58
22	22
194	26
464	40
160	28
496	48
426	54
118	34
662	62
346	48
2570	118
222	38
1894	88
80	24
476	44
50	30
668	54
474	50
90	22
664	42
450	50
162	30
680	60
844	62
616	48
536	52
154	34
464	52
882	66
146	26
1490	76
548	44
258	38
348	44
348	44
424	44
132	40
458	46
32	24
196	36
136	32
146	30
176	36
260	36
344	44
46	30
194	26
884	64
482	50
440	36
544	40
316	44
770	66
126	30
296	32
224	36
196	40
114	26
640	54
234	34
380	52
1212	66
62	22
112	20
260	52
296	40
56	24
652	42
204	32
162	34
472	48
342	32
168	28
78	22
810	66
312	40
358	46
378	38
294	46
144	20
228	40
370	58
38	30
536	48
276	32
996	84
540	60
258	30
832	64
188	36
1180	64
132	36
126	30
188	32
94	34
444	52
126	26
242	42
322	46
54	14
204	28
152	32
172	34
620	40
288	52
270	42
918	60
120	36
372	44
240	48
104	24
250	38
184	36
88	24
214	40
350	54
462	54
370	46
932	54
336	44
282	38
704	60
310	30
760	72
182	38
146	22
112	20
374	54
148	32
840	52
126	14
76	36
194	26
342	42
764	52
232	32
236	30
452	48
432	44
280	28
774	58
340	32
1030	80
86	30
452	44
72	24
180	24
400	52
220	36
668	56
226	38
814	50
258	34
332	38
452	36
264	44
414	54
534	54
380	36
166	34
178	32
460	40
158	30
406	42
372	44
258	42
760	72
366	38
744	54
150	30
440	44
50	30
532	52
208	38
524	48
108	32
110	26
1094	74
200	32
468	52
84	22
178	36
78	30
450	34
418	42
134	36
222	38
218	38
184	28
254	38
312	26
518	70
58	14
74	26
584	58
186	30
224	40
190	30
128	20
246	38
586	46
114	28
80	36
282	48
116	24
136	24
148	36
488	52
182	34
298	38
204	28
186	30
986	56
580	46
118	34
182	26
240	28
728	40
400	48
566	54
330	36
812	58
210	34
142	26
622	62
46	18
688	60
2728	96
524	56
110	18
356	46
544	48
362	46
236	36
94	30
398	34
494	32
586	44
568	60
528	56
762	64
36	12
98	26
62	30
1824	84
64	32
314	34
116	28
1178	62
122	26
130	30
622	54
160	40
58	22
300	40
636	52
402	54
406	46
962	74
306	38
164	40
44	20
492	56
190	30
88	24
696	52
338	42
342	46
1060	72
1122	80
246	42
54	20
1152	98
294	44
408	44
410	42
272	44
446	46
396	56
114	26
136	32
781	54
162	28
604	44
266	42
152	36
54	38
156	36
40	20
242	38
126	42
1256	88
372	36
576	56
342	42
1686	74
394	42
272	32
170	36
146	30
630	70
64	20
646	58
366	42
178	38
462	40
282	26
478	62
1044	60
880	62
462	40
254	38
266	42
242	38
266	46
102	26
534	42
192	28
64	20
1016	60
312	48
330	34
72	32
352	44
212	32
298	34
2296	106
88	24
134	30
36	20
2418	102
96	32
394	50
380	40
94	18
98	34
52	20
118	28
176	28
98	26
300	32
80	24
370	44
846	62
448	48
632	62
1102	62
84	36
202	32
426	46
214	26
794	70
270	42
120	32
228	40
304	48
484	50
496	44
322	22
24	24
164	36
448	48
1126	74
66	26
292	34
36	16
36	16
476	48
418	38
114	30
306	34
302	38
134	30
110	30
126	30
502	42
360	40
186	34
526	58
478	46
244	42
358	34
1452	84
202	26
252	52
142	22
538	50
390	46
170	30
132	20
250	38
800	70
120	36
802	64
288	40
188	40
154	30
156	24
68	32
86	26
514	50
68	34
154	30
308	28
290	36
116	28
124	32
422	48
82	30
540	56
412	40
428	44
120	32
762	56
546	56
322	50
754	54
100	28
392	40
122	38
202	34
266	40
128	36
2066	104
212	32
306	46
264	40
550	62
178	30
226	46
220	36
204	48
336	30
456	40
142	22
156	28
166	22
158	26
188	36
508	72
344	40
19	7
474	54
218	36
172	36
156	28
34	18
220	32
334	56
220	28
218	42
348	60
196	48
376	36
168	40
78	30
644	60
290	26
290	50
102	26
458	42
356	32
148	36
112	20
522	54
302	38
26	14
198	26
40	28
312	44
274	42
162	26
144	28
272	48
186	34
38	30
210	30
382	46
528	52
560	58
94	34
636	64
270	26
1386	70
802	42
508	44
230	34
19	7
498	62
158	26
352	48
488	40
170	30
278	50
126	42
352	34
312	40
752	54
266	34
982	50
416	60
286	30
406	44
40	24
166	34
312	40
898	58
156	32
212	36
232	36
118	18
250	42
202	30
330	34
826	50
326	38
238	42
146	26
130	26
146	34
252	50
218	30
268	32
208	24
956	66
174	30
498	62
192	40
148	32
256	44
352	40
818	56
624	52
1750	92
508	58
306	42
204	36
302	38
70	30
98	30
980	72
94	32
652	48
374	46
370	34
328	32
228	32
318	42
114	34
40	16
686	56
150	22
166	38
586	62
1848	96
508	44
162	30
552	56
876	62
542	42
642	42
56	24
362	46
1010	70
80	18
218	30
1464	88
466	44
64	24
378	46
218	38
512	60
368	40
372	40
572	52
60	16
354	38
382	38
132	24
320	24
178	38
346	46
454	54
144	54
90	30
174	30
336	32
260	32
240	44
390	42
294	30
1198	66
756	56
60	20
94	30
182	26
74	26
470	40
462	58
384	64
1048	48
164	32
388	40
516	38
72	24
190	30
102	22
200	28
1060	62
484	48
162	26
88	24
386	44
112	20
662	62
208	26
254	46
348	56
19	7
164	32
300	36
418	54
1414	86
162	30
362	42
136	24
216	28
208	26
384	32
272	36
154	38
888	70
196	24
462	50
842	58
492	64
84	20
280	36
538	46
648	38
384	44
858	70
306	42
180	40
262	52
350	50
1080	74
58	18
280	56
338	46
960	78
392	36
194	26
960	70
648	56
190	26
672	56
152	36
312	44
488	44
126	38
182	32
1502	82
116	28
336	42
184	28
394	38
586	38
2270	90
154	30
626	58
106	30
442	58
458	48
604	58
114	38
98	34
142	30
200	32
96	28
182	34
620	48
252	40
36	28
216	36
356	34
132	24
534	46
378	38
420	40
238	28
370	48
132	28
484	52
598	58
82	34
272	24
154	32
130	26
260	40
286	42
378	38
1500	74
566	42
1002	54
716	48
168	32
1290	78
1846	76
450	42
282	46
142	26
130	38
360	48
34	26
512	42
48	20
554	66
316	44
602	56
316	36
160	40
19	7
230	34
496	56
386	28
156	28
130	18
174	34
148	36
276	48
194	46
84	28
312	48
238	38
456	46
216	36
110	38
142	30
330	44
562	42
450	50
680	58
260	52
530	50
426	38
1090	54
124	28
1142	82
136	36
312	44
248	36
632	58
670	60
1202	78
202	30
322	38
124	32
124	28
380	48
128	36
182	34
462	58
150	26
980	64
534	60
26	26
232	32
1066	72
172	36
350	48
350	50
206	30
138	26
1376	74
170	26
270	42
530	62
270	34
602	52
138	34
172	26
542	46
210	34
152	28
378	50
222	28
19	7
416	36
156	28
148	42
274	42
224	36
60	20
438	30
108	36
512	48
220	34
176	48
828	64
52	28
526	50
212	44
178	34
32	16
374	50
158	34
388	44
672	56
304	36
374	34
346	50
232	32
956	68
116	28
242	42
542	46
262	30
44	24
426	48
152	36
280	36
74	34
1338	76
446	62
238	46
310	30
1392	62
66	18
442	42
456	56
498	52
202	46
388	46
268	32
1078	60
366	32
504	56
192	36
420	44
608	52
22	10
264	36
1674	90
530	60
530	42
106	26
220	44
478	38
688	50
46	30
286	38
1644	80
608	44
204	36
352	40
594	50
226	46
304	28
156	20
806	64
536	64
498	46
416	40
128	36
486	42
270	38
166	42
318	54
960	72
488	42
666	62
776	48
258	38
592	60
134	30
22	22
392	42
590	58
108	24
150	34
436	44
808	56
118	34
476	42
132	20
138	34
206	40
402	34
336	40
84	36
378	50
444	52
128	24
148	32
264	44
314	52
240	28
486	34
576	52
540	40
342	50
1024	70
736	58
154	30
102	30
166	30
32	16
102	30
466	54
362	38
492	48
354	36
988	76
134	30
442	58
100	28
86	26
172	24
368	44
502	38
768	64
210	34
136	40
218	26
444	44
794	60
200	46
574	38
1108	70
378	46
19	7
144	32
150	34
106	30
80	28
50	22
138	24
38	14
256	38
570	52
214	36
1238	80
378	38
670	56
104	28
96	24
498	54
292	36
292	24
300	44
128	34
352	44
318	26
72	28
246	38
92	24
510	50
476	52
1136	84
874	62
576	58
182	38
794	68
86	34
344	40
708	64
198	46
152	32
408	30
312	36
98	30
1736	74
598	64
560	64
72	24
348	52
310	30
232	40
92	24
56	28
1018	66
322	42
186	38
1058	66
1066	70
1488	104
156	32
264	36
302	38
184	42
548	44
134	34
144	32
130	26
1350	72
306	38
168	44
178	34
126	34
136	28
350	42
172	34
1152	60
696	72
400	48
128	32
306	40
334	34
94	26
630	50
390	46
64	16
72	20
184	42
308	56
112	40
302	38
148	24
136	28
140	36
412	36
534	58
318	42
460	46
44	28
316	32
854	58
482	50
472	40
308	36
238	46
44	26
204	40
224	44
114	34
562	50
202	30
94	26
490	44
198	22
358	38
270	38
1064	76
618	40
536	64
224	28
248	40
458	48
324	36
410	38
108	16
196	32
114	30
392	52
142	32
186	30
344	56
404	40
152	28
228	30
456	52
144	28
106	26
2454	104
122	30
392	48
132	36
60	16
40	16
108	16
316	44
170	42
108	16
470	54
76	18
42	26
40	24
144	28
34	26
758	58
124	32
52	24
134	26
510	48
54	34
380	60
498	54
424	56
520	64
294	46
466	42
138	26
506	42
24	24
1894	86
1006	70
472	40
40	32
578	38
594	38
142	18
332	36
186	30
194	32
590	66
890	64
428	44
914	70
108	28
278	36
128	36
430	50
232	40
382	50
292	34
200	44
178	30
186	38
196	36
870	70
296	32
226	38
62	30
96	28
210	44
236	36
214	42
608	72
388	56
230	34
566	54
730	58
128	40
120	28
164	28
1082	54
92	24
610	44
1008	76
484	44
436	44
422	56
264	38
40	32
118	34
446	50
68	28
820	68
494	62
224	48
502	46
180	28
226	42
250	50
154	38
348	36
624	44
70	22
132	20
164	32
368	40
228	32
374	42
1000	54
106	50
560	48
336	48
220	40
19	7
148	26
354	46
118	26
256	28
1176	72
228	44
128	38
138	30
100	28
36	24
182	30
404	40
148	24
278	28
166	42
324	36
1978	96
490	38
768	60
218	38
124	32
38	30
2016	100
174	42
466	46
160	36
36	28
626	72
176	40
116	36
272	36
736	56
216	48
684	48
108	16
426	50
444	36
1288	78
1196	70
302	46
1050	86
420	46
484	50
788	60
952	66
210	30
394	38
4732	116
398	38
296	28
614	46
430	50
300	40
366	54
254	38
234	34
48	26
148	32
428	30
306	46
154	46
556	44
232	30
118	30
490	46
374	38
732	58
326	54
664	52
296	52
892	72
136	32
530	46
174	26
488	40
128	38
234	30
64	16
160	40
338	44
162	34
76	24
470	50
222	34
630	52
262	30
454	50
214	38
172	28
116	28
376	36
134	30
408	52
140	36
502	38
1554	70
442	60
226	32
156	32
220	36
92	36
386	46
588	52
162	42
408	48
22	22
204	40
748	60
1838	74
836	60
444	40
38	14
416	48
1018	70
19	7
828	56
440	44
126	30
28	24
228	24
370	50
622	70
804	60
584	56
234	42
134	30
204	36
504	44
138	30
1104	70
568	72
182	30
384	52
642	58
214	42
212	42
168	44
222	34
330	26
226	42
42	14
1194	70
182	28
226	34
140	28
348	36
180	32
340	50
382	50
242	38
356	56
322	46
256	36
120	36
208	36
136	32
254	50
276	40
180	32
380	26
690	62
464	48
264	44
450	50
1120	72
136	16
830	62
332	40
486	52
108	36
354	46
104	24
100	30
436	56
238	34
1206	62
350	38
226	38
600	48
232	44
576	56
102	30
264	48
88	24
348	40
190	42
744	56
700	52
250	38
166	26
186	44
218	34
288	40
164	24
128	26
268	40
400	32
138	42
178	40
286	42
346	26
126	30
366	52
1500	76
1296	70
200	32
24	24
478	36
176	32
262	42
314	50
550	38
112	32
222	30
164	40
40	20
550	54
392	38
166	34
676	64
588	60
144	32
278	38
248	40
388	36
200	24
586	62
168	24
526	56
124	24
902	70
406	42
742	50
572	64
780	66
286	38
258	44
274	42
492	36
198	50
302	36
58	18
64	32
326	30
248	46
682	62
674	50
178	38
298	30
148	34
88	32
224	36
94	34
1650	90
94	30
622	58
564	56
724	52
492	52
220	52
624	60
520	44
138	28
156	48
828	68
34	26
322	46
358	22
898	66
1024	68
578	38
172	36
850	56
1362	76
170	46
926	62
992	68
310	42
22	22
1170	58
1452	82
1240	80
430	38
322	46
224	48
392	44
1256	62
190	34
64	32
112	36
200	32
556	52
390	42
582	54
80	32
1092	76
272	32
712	52
396	52
256	40
762	54
826	54
122	30
788	54
400	36
118	22
172	20
362	46
254	38
72	24
454	54
170	26
324	28
652	64
306	38
360	36
392	40
154	30
392	34
672	60
148	32
134	18
256	28
230	42
216	32
132	32
3004	118
162	30
586	64
756	60
60	28
782	58
346	38
774	70
800	52
40	28
296	40
46	26
494	40
128	36
776	62
72	20
182	30
472	56
312	48
922	68
378	54
350	44
416	40
22	22
462	46
432	44
166	34
324	44
216	32
890	68
1008	76
100	36
280	28
234	42
260	40
480	40
748	56
1146	70
382	34
176	28
40	28
498	38
634	54
94	26
448	48
260	48
66	18
538	56
626	46
646	46
414	46
774	46
78	30
670	62
212	40
536	48
88	24
298	40
668	64
168	36
2162	92
462	50
252	40
166	34
116	32
176	36
258	46
350	46
2506	94
76	24
1086	70
140	34
222	34
412	50
298	38
198	38
276	42
538	58
458	50
110	26
352	40
632	52
824	64
30	24
368	44
1008	64
108	32
298	46
168	20
644	52
180	32
48	16
400	48
58	18
270	38
774	50
108	32
1912	98
86	18
406	48
628	64
252	36
352	32
78	30
348	44
392	52
312	44
116	28
1078	74
246	26
256	44
154	18
1190	72
302	42
204	32
228	32
690	66
808	62
272	24
1056	68
86	30
186	34
112	26
344	36
154	44
132	32
298	46
858	58
580	52
226	38
436	56
690	54
392	52
472	52
178	22
784	72
82	22
202	38
170	38
178	32
418	34
106	30
182	38
774	78
802	62
82	28
210	46
36	24
222	38
234	30
480	56
58	22
550	60
436	44
368	48
916	74
46	30
218	42
352	28
622	40
628	44
70	34
490	48
762	58
246	42
400	48
378	28
570	50
456	40
272	24
946	64
810	78
148	28
316	40
574	58
146	22
174	38
514	58
172	24
402	46
604	54
506	48
154	34
104	26
254	38
484	36
714	62
386	58
80	24
230	38
132	32
276	48
1014	72
50	22
132	28
824	56
664	64
706	66
252	40
154	38
94	38
336	44
736	64
168	32
442	38
220	40
234	30
80	32
462	46
338	40
172	40
444	48
536	54
166	42
456	36
84	16
196	44
662	46
362	30
190	42
942	54
570	46
844	60
556	52
98	34
196	40
434	54
470	46
208	44
240	60
384	40
220	30
212	28
1658	90
382	50
306	34
276	32
518	52
38	14
40	32
112	32
160	28
168	44
384	48
192	38
156	20
213	28
238	34
232	36
314	54
88	22
158	38
428	40
1108	80
204	36
118	34
280	40
900	60
148	24
172	40
318	54
122	38
1508	72
486	44
308	34
114	22
184	36
78	38
592	56
372	34
566	32
112	32
114	58
310	48
832	64
406	54
84	30
1640	88
260	44
370	42
166	26
838	62
420	48
864	64
250	30
78	18
192	44
334	38
374	46
50	14
396	48
60	28
152	36
98	34
214	44
130	30
250	42
60	24
268	28
846	52
572	52
348	36
472	44
260	32
128	28
164	40
536	40
460	56
392	44
1570	68
404	48
294	52
134	30
1326	70
484	44
680	40
832	72
340	40
306	42
134	26
1520	64
158	34
426	50
502	70
118	26
206	26
256	48
566	54
1080	60
184	32
240	36
588	48
498	46
244	36
58	26
282	26
356	40
122	34
394	38
146	30
144	28
410	48
98	30
158	34
452	32
566	48
354	38
210	32
426	46
668	56
212	40
222	26
122	28
56	24
1064	70
396	40
232	28
386	42
632	56
64	24
346	38
302	38
76	16
418	38
156	36
1350	74
62	30
410	46
150	34
174	50
76	32
752	56
106	30
734	58
352	40
134	18
516	48
96	32
176	36
68	20
526	38
548	66
224	28
394	76
648	48
330	42
410	52
92	28
76	28
454	38
62	30
740	60
238	30
552	52
228	48
156	28
366	36
198	30
750	60
280	32
648	66
74	26
542	50
226	42
440	60
40	24
412	44
324	48
260	36
228	48
180	44
270	36
100	36
160	44
198	50
558	62
152	24
404	32
146	30
300	40
318	46
426	34
268	44
54	18
560	48
438	48
1108	76
606	56
212	30
246	50
142	26
718	52
234	38
90	34
650	50
1104	80
326	28
1592	88
766	56
136	20
170	38
618	68
308	40
238	30
666	42
116	28
486	32
142	34
826	70
224	32
46	14
182	30
368	48
80	28
178	38
716	52
224	40
26	22
238	46
470	50
66	26
350	34
382	34
56	24
192	32
58	26
278	42
116	32
244	34
552	40
340	44
484	52
102	36
568	44
718	66
308	44
144	32
404	40
192	44
262	38
794	56
276	44
330	50
362	50
19	7
198	34
746	66
62	30
122	42
44	12
394	46
70	30
34	22
188	42
346	42
558	42
364	36
886	54
394	38
196	44
822	60
96	24
294	38
230	30
252	32
160	36
686	40
24	16
374	46
434	38
222	30
650	48
260	28
102	30
428	44
324	28
100	20
274	34
124	36
696	48
370	46
178	26
272	36
924	58
890	62
366	50
276	40
378	34
666	58
132	32
456	40
460	52
898	54
722	80
1016	64
398	34
214	26
288	32
334	44
254	34
174	26
276	28
418	46
120	32
104	28
62	22
266	54
40	24
660	44
438	50
394	38
432	48
1114	78
898	74
180	36
218	34
388	48
440	64
392	40
302	30
240	28
226	38
140	36
88	24
72	24
50	14
218	38
230	46
400	44
1228	90
468	60
122	42
174	38
154	38
106	22
232	36
260	48
280	32
198	30
262	42
420	60
834	46
292	40
274	38
100	24
330	30
168	24
260	28
84	24
206	30
260	48
530	48
672	56
342	46
144	32
688	48
154	30
320	40
154	42
1120	72
374	38
90	34
162	26
748	56
516	56
636	68
266	34
1004	54
304	36
226	34
208	28
328	46
324	56
246	32
722	62
68	28
46	22
140	44
286	34
710	54
118	38
288	24
156	28
106	34
142	38
102	26
676	48
674	62
598	52
254	34
432	44
314	38
302	36
78	26
138	38
326	38
584	66
294	44
364	44
732	62
224	36
2638	100
344	52
296	44
134	30
174	34
176	28
284	36
1092	70
242	38
204	32
240	36
282	32
664	48
342	38
292	20
252	36
254	30
848	60
446	48
342	50
40	32
562	58
19	7
176	32
50	22
482	38
846	62
426	54
212	24
464	60
356	48
238	30
708	56
340	44
214	38
148	36
19	7
1220	72
334	40
284	40
686	66
528	52
148	28
72	24
326	34
296	32
126	22
488	54
106	26
140	40
108	32
314	42
466	46
510	48
366	34
2124	84
310	42
988	58
106	30
50	22
110	26
190	38
436	48
340	44
134	22
440	48
220	42
28	16
414	42
48	16
106	22
180	44
130	34
198	38
364	48
198	30
638	42
762	58
1196	66
658	54
306	30
490	38
368	48
132	28
42	14
86	38
236	36
260	28
162	30
90	34
470	56
138	28
168	32
305	38
586	60
868	48
64	16
684	56
372	32
742	52
124	32
548	52
524	60
328	36
438	52
64	24
458	56
142	30
216	36
240	24
384	40
410	42
214	38
410	34
138	30
276	44
102	30
370	54
216	24
108	32
212	40
802	66
282	30
128	28
76	36
120	28
252	32
378	54
134	34
210	34
136	28
680	46
342	46
344	44
218	42
38	26
298	30
1730	86
128	36
40	16
1192	64
36	28
238	50
340	48
220	44
1386	62
236	44
104	28
244	32
362	30
74	34
854	62
334	38
312	32
440	36
184	32
82	30
772	60
130	26
358	48
454	46
550	40
52	28
118	34
336	32
518	32
318	38
554	44
182	30
306	52
316	32
136	28
214	30
242	34
168	28
324	48
810	58
900	48
188	24
632	54
118	22
740	60
228	40
116	28
406	50
108	36
726	58
196	36
1576	88
1428	72
248	48
248	40
496	44
394	38
734	62
912	58
62	14
516	44
694	62
72	28
404	44
800	56
340	28
1038	62
180	32
108	24
222	48
1560	84
636	48
346	46
50	26
194	38
616	56
128	36
450	42
226	42
86	26
532	48
396	52
586	50
434	46
250	30
694	50
258	26
632	56
360	52
452	48
180	28
474	38
300	36
360	46
903	54
222	28
174	42
132	36
616	56
278	22
100	24
216	40
506	50
208	26
338	38
160	36
394	42
380	36
26	26
424	46
366	50
418	30
440	60
110	38
934	74
572	56
188	40
744	54
74	22
66	30
584	44
1084	80
152	36
548	32
68	24
274	42
80	24
284	32
222	46
282	50
156	28
678	52
118	26
184	28
190	30
840	66
136	36
888	70
312	40
672	56
336	36
246	40
346	42
262	46
138	26
476	44
138	26
346	54
376	48
150	26
466	38
430	50
200	32
482	58
552	52
756	52
318	54
288	40
450	38
1298	66
236	24
72	24
280	36
336	60
430	36
432	40
220	38
832	72
482	42
544	46
126	46
342	38
582	70
342	38
546	62
94	24
76	24
668	68
566	50
1070	62
331	52
190	34
248	44
452	44
230	54
432	32
1308	76
1610	76
248	36
484	60
130	26
202	42
60	28
86	38
334	42
636	54
646	50
344	32
260	28
140	36
188	36
306	42
108	32
174	26
44	32
728	56
1278	84
172	44
356	40
612	56
184	40
136	24
122	38
1350	76
698	78
156	32
750	64
700	52
308	52
228	44
920	76
394	34
182	34
332	52
254	42
152	28
190	50
858	70
72	20
50	18
272	44
1658	78
146	22
368	40
418	36
86	28
196	40
122	36
838	62
110	18
430	54
348	38
90	26
345	28
98	34
402	42
238	52
374	50
222	46
348	44
908	60
140	28
102	34
102	30
136	32
754	64
190	34
66	34
152	28
386	42
132	32
822	68
44	26
124	36
124	24
162	38
220	44
1332	88
284	46
392	36
958	54
622	50
218	30
592	56
22	22
396	52
346	38
1152	72
150	46
398	42
152	36
76	28
38	22
392	42
220	36
328	44
1090	60
72	24
358	50
100	44
402	34
40	16
1856	108
950	62
732	56
244	32
218	38
19	7
68	24
494	48
410	44
358	42
294	54
424	36
296	48
272	40
44	36
942	86
1582	66
378	52
352	50
752	80
22	10
188	28
154	42
58	26
192	24
56	28
950	68
832	64
584	54
862	74
390	54
116	36
552	52
780	50
408	52
946	70
344	44
92	24
290	22
160	38
276	28
138	34
130	26
122	22
452	52
912	68
314	36
384	40
128	28
310	38
58	18
236	28
500	40
438	44
318	30
194	22
420	40
476	50
468	44
136	32
238	26
236	28
204	32
1496	104
234	30
312	40
210	34
352	36
230	34
546	46
100	28
268	42
320	36
86	26
136	16
226	38
584	48
728	64
628	44
234	38
298	34
426	46
284	42
234	50
240	40
106	26
184	24
74	26
240	28
1234	76
386	46
582	62
476	36
508	68
276	60
274	38
280	48
314	34
156	28
200	28
312	44
368	40
110	34
888	70
236	32
60	28
422	30
172	24
218	38
454	48
228	40
364	44
164	36
324	24
386	56
346	42
546	46
548	60
284	48
824	44
450	42
444	48
238	38
254	28
426	50
794	62
264	48
682	74
1068	72
352	40
1680	76
478	44
54	26
408	44
382	46
114	34
364	40
228	40
1114	52
210	46
916	48
332	50
38	26
260	40
504	50
278	38
292	28
330	38
1016	80
908	58
654	54
284	40
524	56
280	36
258	42
424	52
276	34
1160	64
520	40
1302	74
1420	72
598	50
1506	84
486	42
220	36
242	42
24	24
92	28
92	28
202	30
528	56
560	50
332	40
54	14
566	58
356	44
122	18
370	42
558	48
254	32
802	50
322	34
118	22
598	50
462	42
186	30
532	56
43	11
84	20
610	56
80	22
368	36
426	46
178	38
470	58
532	36
334	46
88	24
138	40
446	50
1080	76
348	44
424	48
482	46
748	62
280	32
766	58
98	30
418	50
276	48
386	42
220	32
666	46
128	20
76	24
98	22
106	34
356	32
198	46
290	38
550	46
360	32
194	34
178	22
752	56
254	34
704	62
272	56
172	40
110	26
154	40
78	26
1670	88
146	26
528	48
486	38
184	36
122	30
366	42
104	20
286	26
374	48
351	48
220	36
34	34
442	48
144	40
196	36
120	28
220	32
524	60
796	70
530	62
1174	66
82	26
94	26
238	34
482	56
68	24
1068	68
738	46
238	46
402	34
260	36
110	22
376	48
56	32
108	12
82	30
226	30
112	28
702	62
336	48
652	62
1278	62
132	32
108	20
188	32
298	26
354	42
590	54
76	20
154	42
1392	84
394	42
172	32
74	22
358	42
352	44
488	38
52	32
54	22
700	56
44	22
234	42
278	46
80	28
156	36
346	34
316	34
542	64
380	48
204	32
754	50
354	50
150	34
106	32
208	48
102	30
572	68
320	40
92	28
200	36
520	50
268	40
216	32
422	42
514	58
418	56
530	42
222	38
400	38
236	36
1628	72
344	40
304	40
380	50
54	22
280	36
84	28
370	46
878	62
222	30
330	42
462	54
248	44
740	68
240	44
250	26
526	48
416	32
212	32
138	30
434	46
1452	78
70	22
286	26
102	26
604	56
118	18
64	28
102	34
174	30
228	30
42	14
384	44
162	34
360	48
54	30
296	44
158	34
518	46
848	48
104	28
128	36
196	24
156	28
194	38
60	28
66	34
378	38
240	36
388	40
154	22
284	36
62	26
162	42
878	62
84	28
472	50
564	48
308	50
316	44
222	26
802	62
114	30
152	32
778	62
284	38
220	24
258	46
302	38
144	36
446	38
1366	66
456	62
288	44
270	34
278	46
588	68
136	32
346	34
304	60
100	28
222	34
50	18
250	34
196	36
160	32
424	46
136	36
372	48
462	46
82	34
56	26
276	40
122	18
26	26
304	48
40	20
280	32
584	52
480	56
426	34
186	30
298	58
66	34
92	24
712	48
134	42
780	60
756	60
356	42
250	46
590	62
998	70
144	28
208	28
162	34
192	44
138	30
210	34
70	26
168	36
196	32
60	28
768	68
830	70
322	46
70	30
526	56
496	44
396	44
120	36
162	30
260	36
50	18
268	40
646	46
448	54
38	32
96	24
932	62
1048	60
592	56
1266	56
840	50
1146	62
304	24
212	32
124	40
344	56
144	20
104	24
120	28
326	46
162	26
418	42
1074	76
344	44
622	60
408	36
64	24
148	36
194	30
534	54
2470	94
618	48
246	38
262	34
156	44
162	30
154	30
270	30
266	42
808	60
272	32
66	18
218	38
262	34
378	62
42	14
346	42
210	34
522	40
678	58
234	50
124	28
318	38
756	48
154	30
680	60
218	30
434	54
340	40
132	28
98	30
104	28
538	54
88	24
722	58
276	32
314	22
450	42
388	56
552	48
90	30
760	54
660	40
814	46
806	60
134	40
148	28
144	32
260	48
630	60
324	52
134	38
138	22
866	62
368	48
332	42
432	54
176	32
1840	100
856	68
264	28
88	16
172	34
212	36
60	28
424	36
176	40
76	24
616	64
116	34
190	30
150	26
169	26
300	40
64	20
1048	76
1260	74
250	30
1676	88
276	32
688	48
476	36
284	40
200	36
140	24
54	30
348	36
518	54
474	58
174	26
68	36
1314	86
168	32
350	38
116	22
94	26
344	32
36	16
42	26
188	32
230	32
134	30
214	42
772	58
460	52
158	26
96	32
302	34
720	60
388	34
346	38
78	26
502	44
190	46
78	22
166	26
106	34
226	38
170	38
74	22
328	44
660	52
1112	76
2640	96
544	44
508	48
138	26
108	28
1506	78
632	52
304	44
260	56
196	28
838	62
298	34
182	30
102	38
116	40
340	40
464	52
146	30
180	28
522	50
158	42
728	64
58	34
386	34
262	40
476	46
272	36
84	30
512	52
130	22
290	40
36	12
38	22
190	42
1388	70
534	62
152	52
502	54
122	18
92	28
164	32
258	38
118	26
212	24
326	42
416	40
2732	116
340	44
148	40
116	28
316	36
366	38
364	40
346	48
298	26
486	50
548	60
52	28
194	38
68	28
196	36
316	32
152	32
172	32
46	14
172	36
558	54
52	16
588	40
108	32
178	34
124	36
234	26
98	46
130	42
518	34
328	44
298	30
482	46
54	30
146	26
226	42
184	36
226	38
640	68
1028	54
424	38
416	48
480	48
72	32
224	32
150	28
1008	76
78	26
126	38
192	32
322	46
96	32
250	26
846	58
348	40
216	40
188	28
728	68
1210	76
770	62
574	58
890	60
90	30
424	40
210	34
1140	80
272	32
1786	84
94	26
464	40
126	18
382	42
156	36
140	32
152	32
274	42
52	28
234	38
524	52
569	58
442	50
200	40
326	46
40	28
440	60
512	44
140	36
1778	90
434	58
240	40
64	32
772	68
600	50
62	26
50	26
162	26
82	26
258	38
82	30
376	40
110	18
524	36
58	14
304	32
40	24
224	44
568	56
188	32
80	28
244	44
360	46
220	36
120	32
1228	86
88	28
190	38
598	66
398	48
76	28
334	42
130	34
128	24
176	36
476	48
212	32
1364	84
34	14
94	34
722	66
112	32
328	50
210	42
138	30
1728	80
102	22
800	72
1118	58
110	30
428	44
138	38
58	30
368	40
1586	70
736	72
344	40
142	30
732	54
454	48
46	30
456	56
234	46
186	34
96	24
456	46
338	42
334	46
180	44
400	60
140	44
404	40
348	48
320	40
348	48
618	54
252	40
144	28
116	28
180	36
528	56
490	38
202	34
286	30
60	28
212	36
128	28
48	28
336	34
282	38
616	62
40	16
1048	76
144	20
482	48
194	28
304	32
1464	88
962	76
204	32
262	28
486	50
130	26
116	24
472	52
340	44
78	26
78	18
134	26
148	24
182	40
174	26
114	42
200	32
86	30
186	38
2510	90
120	28
388	48
86	34
72	20
124	30
104	28
112	28
328	48
542	46
1390	82
272	40
488	44
390	42
432	60
28	28
364	44
396	40
242	42
326	42
166	34
518	62
190	38
19	7
160	28
104	28
46	22
822	54
650	72
78	34
162	30
336	38
78	34
708	54
146	26
252	32
330	42
410	46
384	60
462	42
794	54
122	30
636	56
206	38
306	52
286	30
1178	78
756	52
164	30
270	34
960	68
1164	70
426	46
544	48
342	46
286	38
432	34
592	48
204	26
592	52
38	22
160	36
184	32
144	32
600	52
230	50
434	50
406	30
194	34
686	46
86	22
536	52
652	56
504	44
80	40
358	34
386	46
592	68
1304	68
364	28
408	40
92	32
258	38
432	46
328	40
484	56
330	38
582	50
258	30
346	50
586	58
338	50
134	30
162	30
166	30
284	32
306	34
146	34
460	56
118	18
984	54
740	60
312	52
448	44
276	46
244	32
106	38
228	32
570	54
72	28
208	36
294	42
170	38
114	26
126	30
68	20
316	56
268	34
72	28
726	50
488	52
240	34
358	46
386	42
348	44
136	36
430	46
98	26
74	30
36	16
652	60
260	32
829	74
2222	102
306	50
408	36
512	52
180	44
480	60
102	22
172	32
174	30
116	32
132	32
310	30
274	46
394	38
644	66
508	56
434	46
538	50
456	54
76	24
266	54
74	34
70	26
240	48
286	34
674	52
78	26
430	38
652	58
116	24
330	38
170	34
846	60
276	36
704	44
650	50
148	28
260	44
320	44
792	64
242	50
378	46
342	42
1030	74
152	40
122	36
116	32
180	28
132	44
156	32
38	14
118	26
1900	100
1140	52
388	52
78	26
294	32
850	74
188	28
92	32
104	28
216	32
398	50
172	28
38	26
386	58
364	44
776	68
322	38
316	40
136	28
228	32
486	42
342	46
1950	94
60	16
92	32
114	14
206	38
222	34
120	16
212	36
542	52
330	50
586	58
324	36
516	44
394	50
704	56
312	28
724	62
148	24
264	40
298	42
522	50
226	34
526	52
76	24
636	60
1174	74
258	38
30	14
94	30
130	34
38	22
208	32
154	30
48	20
94	22
40	32
228	40
46	22
106	38
372	32
122	42
472	56
142	26
114	22
1416	74
144	40
240	28
192	28
52	24
442	38
2906	110
1174	90
210	28
70	26
696	64
302	34
286	34
114	14
522	58
44	20
578	46
706	58
412	44
96	32
802	62
378	42
350	46
96	32
148	16
366	34
200	28
372	50
42	14
114	22
242	30
324	36
284	36
324	52
134	22
1148	72
1790	94
338	38
408	46
66	26
1016	70
542	58
196	40
146	34
118	22
762	70
212	48
268	44
282	46
844	60
118	26
538	48
370	34
462	54
2294	90
476	66
94	34
136	24
130	26
1232	76
248	36
368	40
642	54
162	30
174	34
364	56
376	48
356	44
58	22
522	38
1156	84
658	58
322	34
70	30
76	28
440	52
136	44
230	34
744	66
600	48
284	38
76	28
204	32
182	34
344	44
130	30
334	40
706	56
274	38
404	46
500	46
136	36
420	48
134	22
396	52
124	32
1168	78
200	32
326	38
262	38
274	44
362	42
264	40
240	48
410	50
282	38
390	50
54	22
80	24
294	38
906	66
96	24
180	38
1016	68
242	26
556	48
628	48
204	28
430	42
1306	78
388	48
186	38
284	48
1722	88
176	32
286	34
250	44
508	52
152	32
106	30
544	64
36	28
152	48
136	28
1638	106
720	62
490	56
494	60
48	24
200	40
250	46
256	44
220	40
346	50
1160	82
332	40
526	46
368	32
94	40
276	40
214	24
390	42
162	34
478	50
266	38
2236	96
1232	88
180	28
250	48
154	38
326	46
110	30
314	34
34	26
152	20
160	50
596	68
410	50
1080	80
90	30
502	46
152	18
346	46
42	14
606	54
386	48
110	18
168	36
356	40
238	38
346	38
102	26
1130	66
216	32
564	60
1526	78
248	32
228	32
136	24
106	26
402	38
106	22
238	32
108	20
362	50
104	36
572	32
346	48
42	26
108	32
372	58
298	34
98	22
372	32
400	40
588	48
176	32
492	36
190	34
212	36
1122	70
64	20
748	54
444	48
176	28
280	32
156	36
992	72
356	38
112	36
378	42
420	60
344	64
174	30
126	22
782	66
262	34
58	18
566	38
678	58
468	52
880	70
378	34
220	32
74	22
546	46
454	34
220	32
186	42
134	30
460	52
220	32
1176	62
142	30
146	30
19	7
294	38
150	26
598	66
550	46
268	52
674	54
294	42
88	28
402	38
558	40
316	28
108	24
180	28
74	26
290	38
130	22
380	48
176	32
172	32
876	60
804	52
102	26
176	24
136	32
276	42
76	28
92	30
104	28
594	42
180	44
530	46
378	34
132	36
738	66
362	38
512	52
672	40
96	24
304	40
300	44
432	48
314	30
88	20
602	50
586	58
100	24
98	34
424	44
670	40
128	16
60	20
1408	58
144	30
1724	74
120	24
394	42
484	48
124	30
536	60
400	48
54	22
528	40
1258	88
64	24
76	24
562	54
406	62
176	40
754	62
108	28
316	44
738	54
388	36
76	26
156	24
192	36
224	32
198	22
470	42
102	30
108	36
134	22
492	40
430	46
464	40
462	50
138	34
248	36
252	42
570	54
288	32
180	36
460	68
850	58
260	32
210	38
492	40
186	42
84	16
266	34
178	30
256	48
138	30
68	28
236	36
514	42
122	18
80	28
450	58
326	26
42	14
204	36
236	28
19	7
330	58
78	26
528	64
62	30
1072	68
1139	66
426	46
878	66
340	40
212	32
2110	112
236	36
22	14
502	46
222	34
454	42
222	34
112	28
964	56
350	50
232	44
154	30
82	38
292	30
220	32
354	38
198	38
258	34
678	54
144	28
78	26
294	54
378	38
254	46
584	56
74	26
200	36
90	26
170	30
192	28
866	60
94	26
1018	62
338	42
74	26
38	14
240	36
204	40
1142	78
522	58
472	44
446	62
790	52
440	48
98	22
140	32
350	50
596	52
600	44
102	30
1458	86
294	46
244	28
436	48
452	36
772	56
134	42
434	32
122	34
500	40
198	30
476	44
184	32
966	68
554	46
126	32
210	34
504	52
58	16
214	38
292	42
190	34
452	52
52	36
486	50
1962	88
140	28
220	24
258	38
926	70
232	36
88	28
2678	116
340	48
242	42
644	44
278	36
806	52
50	22
278	38
154	26
118	26
254	40
400	44
108	24
312	40
156	36
266	30
398	38
506	46
190	34
260	44
504	56
312	64
396	44
272	38
154	34
19	7
426	38
344	40
548	56
402	30
102	26
46	26
170	34
136	32
156	36
510	42
286	54
130	30
822	64
814	46
372	40
384	52
402	38
698	60
86	30
38	18
76	24
64	24
362	46
328	28
266	42
328	44
1264	74
108	16
130	34
396	40
496	48
118	26
586	50
48	32
340	40
292	44
282	30
442	34
122	30
344	48
664	46
434	32
252	32
220	30
188	32
88	24
264	28
220	32
470	54
920	72
142	22
144	36
52	24
44	36
888	70
818	62
194	42
148	40
182	26
280	36
104	32
242	42
850	62
412	44
234	38
486	54
322	34
298	44
580	44
394	42
546	54
572	54
234	44
156	24
526	52
242	26
58	30
128	28
174	32
64	28
414	30
256	36
134	30
126	38
92	20
166	22
364	28
718	64
206	38
188	28
312	40
262	40
936	56
190	30
180	20
392	46
586	54
284	32
160	44
506	58
130	22
860	60
162	34
526	46
194	42
680	60
236	40
666	50
1040	72
358	42
308	32
332	36
464	40
342	38
1352	74
154	42
1336	68
300	42
358	50
346	42
316	44
398	44
266	30
196	28
464	44
118	30
174	38
324	48
850	62
480	48
296	24
142	42
1392	108
1026	48
94	26
160	32
264	44
1036	84
78	22
642	56
256	34
206	30
576	50
190	34
430	52
108	16
80	24
286	38
326	46
70	26
358	50
3506	120
60	28
360	40
80	24
1778	66
384	40
114	14
278	46
342	38
384	52
436	40
402	46
28	20
1310	50
702	42
480	48
300	52
1250	74
130	22
166	26
238	34
354	30
124	28
60	24
464	56
510	54
196	26
154	34
110	26
226	46
186	30
280	22
198	38
332	44
254	38
444	52
734	64
180	36
168	24
728	46
1128	68
132	28
242	50
258	42
604	36
326	42
642	60
52	24
186	38
240	32
158	30
140	32
114	26
570	42
206	32
242	38
698	44
94	22
310	30
1476	82
22	14
236	40
194	32
352	56
546	54
360	38
286	46
622	60
338	46
402	56
728	58
432	44
406	30
544	64
1466	88
512	34
266	40
190	30
618	48
304	32
570	58
110	28
398	50
700	42
572	40
168	36
170	34
254	30
580	40
58	30
188	28
184	30
312	48
320	48
238	34
56	28
242	42
286	26
210	36
1228	66
1100	64
230	42
308	44
80	24
796	64
82	30
474	38
828	56
92	28
616	48
904	54
164	32
126	26
286	40
280	40
210	28
64	24
98	22
76	24
602	70
96	24
278	38
100	36
390	36
56	26
282	38
470	34
212	34
152	28
358	34
384	40
254	28
120	48
510	44
112	36
474	54
108	28
366	38
218	38
158	28
96	28
66	26
76	28
1878	84
46	18
264	24
208	44
536	56
1014	70
442	66
188	36
236	40
290	50
86	26
246	30
180	36
1326	80
814	58
132	28
58	34
1012	68
200	28
126	38
290	36
750	56
224	24
338	42
198	26
174	34
328	32
62	22
348	40
768	60
144	32
738	62
558	44
384	44
290	50
834	70
700	68
316	44
278	34
416	52
634	50
478	50
302	52
234	30
866	76
152	42
292	48
246	34
240	36
438	42
1232	60
1246	80
300	34
282	28
150	22
428	44
72	24
68	28
182	42
174	46
438	46
132	32
92	36
268	48
72	24
152	32
530	48
204	44
164	32
100	20
492	48
244	36
348	28
466	42
526	54
178	34
50	18
228	34
1142	64
228	28
170	38
312	56
88	28
530	62
34	26
742	46
478	42
600	44
230	42
346	38
248	28
456	60
542	42
692	44
680	58
740	56
538	62
152	32
42	14
476	42
24	24
112	24
296	40
334	38
234	32
334	38
612	44
322	34
248	24
154	26
216	36
296	42
636	56
1398	90
270	46
700	60
316	42
410	50
578	46
200	40
162	30
422	42
56	20
456	60
104	28
178	34
1130	72
452	48
32	16
194	42
86	30
216	36
40	28
92	28
284	52
1204	84
504	60
616	64
632	68
640	56
532	44
194	32
242	42
198	44
168	28
2216	96
586	54
482	52
662	52
68	18
390	34
72	28
746	58
276	24
110	26
434	38
1184	64
52	28
174	26
116	32
112	32
256	32
440	44
112	24
254	46
144	24
340	46
194	42
84	28
1742	100
72	28
590	50
444	40
510	58
72	28
208	24
94	26
60	24
338	46
220	48
424	48
288	40
202	42
328	40
562	58
42	14
344	40
210	38
210	34
1034	54
626	52
604	44
176	28
656	60
278	34
242	38
198	46
286	46
1076	56
880	72
276	40
280	32
920	64
894	66
410	50
290	38
22	22
1540	86
180	32
354	40
160	28
346	62
174	34
132	28
68	32
412	48
446	50
386	58
150	34
200	28
382	30
346	38
618	46
522	62
316	48
766	54
152	28
216	32
714	62
96	36
146	34
36	16
272	32
598	54
506	42
364	28
552	60
306	50
514	54
402	38
204	38
298	42
254	46
418	38
178	38
896	62
126	30
242	46
188	36
610	54
350	54
202	32
460	52
86	18
302	40
262	34
116	32
238	26
1636	90
136	32
390	30
204	52
726	50
456	60
150	22
660	54
560	38
556	64
266	50
118	22
754	58
256	32
240	36
446	48
48	24
330	54
154	38
728	60
714	66
66	22
92	24
686	42
102	30
350	42
140	40
302	50
318	38
120	32
202	38
292	40
296	32
44	28
92	24
246	44
114	30
1068	80
110	26
1436	84
166	30
358	46
472	48
278	46
150	26
9084	186
206	30
620	52
42	22
438	54
396	60
252	26
126	30
524	46
174	32
342	38
172	24
462	46
176	24
468	48
122	26
306	34
1320	88
758	54
374	32
546	54
444	36
212	32
2210	110
156	32
258	34
950	62
364	28
386	38
238	42
374	38
1058	66
424	40
270	46
276	40
166	26
110	26
190	30
348	28
150	30
402	36
62	22
308	40
70	26
88	36
144	36
740	62
490	38
118	26
86	22
54	22
270	38
382	60
500	44
276	28
82	34
648	68
474	52
242	34
354	40
194	38
434	62
110	30
464	48
972	64
80	20
430	48
172	36
244	36
128	20
784	64
418	50
110	30
238	50
846	68
204	40
568	48
88	36
198	22
644	56
130	26
306	46
458	38
142	30
472	60
546	58
284	32
538	48
580	44
216	32
216	32
140	20
314	54
124	32
446	30
358	42
532	60
282	50
160	32
426	50
218	38
764	52
228	36
150	22
844	68
356	56
112	32
298	38
152	28
322	42
274	40
776	68
338	42
416	48
152	36
306	30
688	68
202	34
162	30
100	24
466	34
540	50
434	46
236	32
736	52
116	40
636	52
398	40
64	24
184	32
386	46
100	32
222	34
380	56
72	28
224	40
250	46
404	54
326	42
228	28
70	28
96	28
228	32
124	24
648	64
518	42
190	34
66	26
178	22
172	28
166	30
312	44
628	56
86	38
942	76
190	36
296	40
122	30
764	64
82	26
160	36
132	28
94	26
190	38
232	44
364	52
30	30
274	54
226	46
132	28
526	42
808	64
460	48
154	30
264	40
300	52
98	22
268	28
372	44
282	26
268	36
160	28
440	48
278	38
150	40
208	32
1374	98
650	50
150	30
646	54
380	44
148	36
94	34
724	56
928	56
156	28
242	46
346	52
576	48
228	56
1708	64
480	44
378	56
146	26
162	34
786	78
584	64
76	20
550	58
80	24
150	34
212	28
544	48
282	42
202	34
204	40
232	28
230	34
632	54
314	50
586	60
224	40
660	62
22	22
298	38
810	80
19	7
212	40
304	44
124	36
52	20
460	44
460	56
550	54
662	50
1170	52
228	28
530	50
226	50
200	36
370	54
818	66
542	50
90	30
194	34
790	58
466	38
450	62
222	38
570	42
1924	84
554	48
460	48
196	24
268	32
46	22
534	52
892	56
596	52
214	50
498	66
142	30
270	38
326	46
130	26
346	42
222	42
302	38
228	38
328	36
252	42
70	30
428	38
242	34
136	24
796	40
280	36
180	28
408	38
220	36
156	32
204	28
138	32
94	30
372	48
54	26
74	34
266	38
696	60
92	24
80	28
406	46
504	54
526	46
212	36
420	52
252	48
266	34
98	26
316	34
436	48
304	28
1144	84
326	40
282	38
250	26
314	34
582	58
106	34
104	32
382	30
440	40
342	34
424	40
124	36
220	24
828	84
1092	64
576	56
136	20
282	34
994	66
262	42
106	22
132	28
182	26
872	64
158	34
68	28
530	50
288	44
322	42
278	42
108	32
298	42
414	56
150	30
326	50
84	28
164	36
372	44
480	48
768	56
196	40
54	26
128	30
102	34
328	30
206	30
100	32
564	44
154	42
460	56
686	56
250	38
292	36
338	34
557	40
176	42
136	24
380	44
284	30
522	54
426	54
580	68
380	44
202	40
594	66
280	44
140	32
266	34
144	24
218	34
758	66
580	64
430	50
88	24
318	30
164	28
368	44
408	52
212	36
190	42
260	42
72	24
158	42
404	48
256	32
474	38
19	7
152	40
252	34
588	52
94	30
236	40
60	24
372	40
522	46
102	26
166	30
308	32
530	50
542	52
62	20
228	48
294	34
464	52
80	32
328	44
156	24
218	38
718	66
272	44
108	16
76	24
182	34
614	54
1044	76
410	38
432	46
94	30
370	46
150	38
46	38
452	42
154	22
176	24
232	36
906	74
790	68
76	28
238	42
102	24
836	64
118	34
512	44
428	36
454	54
648	48
120	40
100	32
126	34
470	54
198	30
234	34
198	38
408	64
502	54
148	40
676	44
424	40
46	18
432	40
388	40
66	18
440	56
1012	60
2264	90
144	28
352	44
148	32
332	44
172	36
290	44
320	32
296	36
414	50
878	62
214	50
138	24
62	30
24	24
122	22
244	36
304	36
50	14
410	54
526	50
496	32
108	28
632	58
128	28
124	24
94	30
350	42
234	40
378	34
78	26
66	30
104	28
46	18
138	38
164	40
370	34
254	34
168	28
286	36
78	16
430	38
90	22
500	44
1526	74
554	50
400	40
300	42
248	36
812	60
204	36
288	28
122	26
188	32
154	26
316	48
668	54
174	30
320	44
136	28
90	30
380	52
52	32
126	32
594	46
490	58
226	50
64	28
344	36
114	30
104	28
648	60
146	30
428	44
264	48
168	28
104	24
568	60
130	34
106	26
24	24
232	36
130	26
168	32
150	36
158	30
280	44
296	56
84	20
110	38
826	64
362	54
484	44
246	34
32	24
322	32
128	36
240	46
240	44
100	20
1302	74
202	30
414	38
374	46
1090	70
78	34
608	48
764	60
58	34
300	28
290	22
306	54
886	62
280	34
426	42
464	48
210	26
468	42
504	56
316	58
176	36
184	32
172	44
408	48
238	38
378	52
482	54
188	36
806	72
332	44
568	64
1258	86
724	56
442	42
940	64
404	40
158	26
308	40
424	42
258	42
19	7
298	40
198	32
94	30
134	34
216	32
124	24
252	28
530	62
166	26
358	54
114	30
294	30
172	32
444	36
530	50
794	62
122	38
440	56
292	36
184	36
534	58
120	40
426	42
434	50
84	24
104	28
210	38
84	24
668	60
482	36
72	20
120	32
592	52
282	46
634	66
226	34
56	28
344	36
32	28
320	32
96	40
896	46
350	46
858	54
88	32
1214	66
134	30
160	32
232	40
350	50
494	50
2176	90
352	36
586	62
266	34
258	36
536	54
354	50
472	28
436	48
250	54
600	48
340	38
184	36
120	32
168	32
80	16
148	44
256	34
444	36
122	34
964	60
352	48
134	34
368	40
622	54
160	28
872	56
428	32
202	34
286	42
652	52
184	32
182	30
1524	72
740	64
182	38
520	56
152	48
1074	66
262	38
762	54
290	42
576	48
354	46
414	42
70	34
412	40
174	30
456	44
166	34
198	30
70	30
168	40
102	22
404	40
376	32
382	54
250	30
590	52
68	24
326	46
396	40
316	44
404	50
590	50
114	22
406	40
290	38
22	14
656	60
538	50
224	32
274	34
204	22
178	40
1352	84
74	26
220	40
338	44
408	44
314	30
944	58
722	58
1758	58
284	36
166	34
406	42
116	32
498	50
216	40
264	42
690	58
110	30
56	36
208	28
270	30
38	14
786	66
44	12
64	28
68	24
138	30
436	56
622	54
272	44
76	24
50	34
250	34
126	22
452	52
230	34
408	46
378	44
626	60
108	28
614	46
296	48
136	32
52	28
80	32
322	44
1068	96
82	30
854	70
134	22
432	48
500	36
96	28
92	36
134	30
146	42
78	26
338	46
62	22
218	30
814	74
792	60
168	32
692	52
514	46
1462	90
252	44
124	32
42	14
364	34
58	26
408	52
86	26
172	40
284	36
80	28
360	52
1606	82
686	58
300	40
690	38
264	36
604	40
224	48
1120	70
170	26
338	32
544	48
300	34
90	30
320	48
710	62
302	34
78	30
276	24
242	50
442	34
638	58
424	42
54	18
752	50
112	28
312	54
256	40
220	44
412	44
220	32
662	50
84	24
536	44
210	34
74	26
146	22
22	22
212	24
398	38
196	32
112	24
212	52
1152	76
19	7
756	56
158	28
296	32
404	44
292	40
148	32
564	72
356	56
268	48
202	40
250	28
1996	90
546	46
284	40
1870	104
678	62
190	42
38	30
1565	72
618	46
54	30
1494	82
82	26
994	70
582	48
496	56
2012	80
98	22
442	54
19	7
2410	98
120	32
130	34
232	40
436	48
488	40
72	32
178	38
116	32
242	42
218	34
808	72
300	36
70	26
80	24
92	28
94	26
234	34
276	24
1222	84
188	28
82	38
656	64
506	42
508	44
398	38
296	36
152	32
170	34
48	24
204	28
206	38
346	46
148	36
178	26
454	50
344	48
2202	86
150	38
160	28
88	28
154	30
152	36
156	40
192	32
484	44
208	40
166	42
720	56
336	56
128	24
318	30
394	38
690	66
52	24
324	48
72	24
792	44
262	34
186	34
236	36
668	56
66	38
194	38
19	7
380	52
188	28
92	24
568	50
122	30
310	50
722	54
252	40
452	44
102	38
180	36
286	38
96	22
1336	84
136	44
1012	74
142	26
246	44
272	40
1194	74
1086	68
750	70
212	36
1272	72
42	26
492	44
544	46
128	32
82	30
438	48
234	30
250	34
330	42
58	22
308	32
236	36
534	46
116	32
312	36
308	32
602	46
500	56
62	34
472	54
320	36
604	72
520	54
370	62
210	34
186	30
236	36
108	28
812	68
246	42
56	24
894	76
770	66
484	52
364	48
210	34
32	32
330	34
186	42
214	38
476	52
504	52
158	34
220	32
268	28
372	40
406	54
1530	74
412	44
264	36
240	28
132	20
462	50
2476	104
306	42
188	36
186	34
84	28
364	48
510	42
194	36
496	46
1022	58
64	28
1010	70
410	58
696	60
376	48
206	20
734	82
588	56
1378	90
322	30
214	30
84	20
374	30
64	32
152	22
242	46
100	28
524	44
346	42
532	46
72	28
454	30
126	34
210	40
44	28
106	22
270	46
354	54
932	66
158	30
224	40
294	50
264	40
384	44
1550	84
224	44
68	20
452	32
1132	64
326	42
248	28
80	16
304	40
96	28
34	18
98	22
42	26
94	30
158	38
736	60
166	34
232	32
174	34
580	68
460	48
150	28
252	30
410	46
1172	84
204	56
358	38
482	46
220	56
734	46
980	66
150	38
248	24
198	34
404	44
470	66
178	30
108	36
162	26
346	54
120	20
762	60
348	52
118	34
58	16
238	46
136	28
306	38
1412	88
302	38
142	26
598	60
408	60
236	32
250	34
168	28
256	36
522	50
64	28
224	36
144	28
162	26
482	48
278	30
766	52
360	38
162	38
206	46
444	32
172	36
1500	86
22	22
302	42
32	16
370	54
542	46
19	7
720	60
416	48
2362	84
1444	84
854	46
40	32
234	34
344	36
2008	106
532	44
296	36
764	44
438	54
364	44
506	34
556	48
68	16
40	28
114	38
106	22
660	52
196	32
58	30
1506	82
820	60
250	28
298	54
218	38
156	36
114	34
802	62
86	22
234	46
348	36
90	34
186	34
126	34
522	42
328	34
76	32
300	44
232	32
80	24
222	34
274	30
114	18
72	16
164	32
366	50
136	44
314	30
84	28
114	34
230	46
152	28
166	38
240	36
72	24
1390	90
170	50
86	26
1266	76
220	44
154	50
244	32
90	26
212	48
114	34
348	44
172	32
742	44
943	60
92	24
336	44
360	46
176	24
266	40
332	24
604	64
350	50
522	46
532	40
102	26
896	60
608	50
102	34
234	40
182	30
258	42
392	36
174	34
490	52
104	30
818	46
368	56
332	40
226	38
846	72
246	34
68	20
134	18
938	70
128	20
112	24
412	46
492	48
222	32
34	26
352	38
216	48
188	28
326	50
482	54
1004	80
108	28
258	50
562	54
314	38
19	7
842	70
974	70
308	48
272	40
360	36
710	46
562	42
94	22
404	44
118	26
1008	64
294	42
244	36
218	30
318	42
48	16
228	36
391	28
730	66
154	30
372	42
116	36
138	26
470	58
274	38
64	28
494	44
216	24
410	50
462	42
68	36
626	56
554	54
530	44
148	36
282	30
134	18
564	42
130	30
658	46
328	32
150	26
696	52
136	28
370	50
242	42
208	44
560	68
292	26
76	36
60	28
194	30
19	7
442	66
92	28
502	50
538	50
488	48
466	46
82	26
126	30
512	44
46	14
68	20
88	28
232	38
604	64
972	60
378	46
174	30
330	42
112	16
116	32
190	38
66	26
138	34
366	42
422	46
1748	84
396	44
72	28
138	38
92	24
392	52
636	58
124	32
308	36
379	34
996	64
448	48
182	42
158	34
324	46
130	22
228	36
266	42
1370	78
184	36
106	38
180	32
156	44
108	28
446	62
248	44
136	32
286	38
1196	72
196	52
98	26
56	24
798	62
114	30
156	30
182	30
638	42
368	36
22	14
420	44
540	44
350	56
144	34
118	38
100	28
1128	76
430	56
1062	56
284	32
184	24
300	48
246	38
148	20
2354	106
442	62
170	26
564	52
630	58
292	36
244	36
138	26
170	42
384	56
426	50
50	14
72	28
596	46
56	20
296	48
260	30
342	48
462	42
238	26
334	44
498	58
464	48
482	54
596	60
378	48
190	34
234	38
312	40
62	22
356	36
252	36
126	30
48	16
138	34
280	42
798	54
532	50
274	42
214	34
750	72
520	46
158	32
220	32
330	26
910	50
290	40
190	28
40	24
168	32
124	32
82	34
218	30
632	40
850	60
128	40
94	34
174	30
1072	66
256	24
510	54
136	24
880	52
654	64
314	50
242	38
478	44
822	60
392	48
522	42
1058	72
310	46
76	16
92	36
412	36
638	40
920	56
304	32
778	66
454	50
120	36
54	26
104	28
42	18
108	24
146	38
38	22
110	26
112	24
360	36
538	68
372	36
52	24
510	38
114	26
82	22
136	36
124	32
392	44
86	26
2158	108
1238	78
1520	68
60	24
446	46
220	38
222	26
1252	66
388	48
762	50
1514	82
19	7
514	34
118	26
542	58
386	42
1538	90
120	32
54	34
88	22
120	30
190	34
370	46
266	46
150	30
410	34
94	22
606	56
692	72
338	38
414	46
498	48
244	36
118	30
150	26
30	14
538	46
932	72
64	32
292	36
340	66
274	46
138	30
178	40
128	40
866	70
342	38
186	34
68	28
240	36
372	48
742	66
550	46
168	36
456	46
130	30
244	44
176	36
172	32
556	64
552	56
134	26
268	44
536	58
180	46
248	36
772	64
94	22
172	40
552	56
190	38
134	26
244	24
598	40
294	26
866	52
342	44
194	42
194	42
336	44
654	54
200	36
396	60
606	58
140	32
496	44
212	52
344	48
120	32
306	46
568	48
872	70
780	56
1076	88
288	28
330	50
124	24
150	42
662	66
708	72
80	32
416	52
120	36
650	62
62	18
496	58
178	50
558	58
122	34
350	34
924	64
48	32
112	32
382	42
200	38
376	36
536	56
88	32
74	26
504	52
376	40
592	60
116	32
1256	84
532	50
1112	80
424	48
100	32
378	58
538	54
96	32
552	48
88	24
180	32
606	62
392	36
402	54
328	52
908	68
68	16
134	14
772	68
1248	76
232	32
954	66
156	40
452	44
1498	82
300	40
560	62
642	58
202	34
1016	78
260	36
576	62
198	34
238	28
76	36
134	34
884	44
88	36
344	28
372	28
822	62
382	50
220	36
238	34
46	30
60	28
78	26
226	38
310	42
114	34
350	46
1156	56
198	46
956	54
256	44
1116	76
620	52
276	54
450	52
188	32
780	52
312	50
198	38
114	42
368	40
2012	80
114	14
440	46
430	50
172	40
946	54
3558	120
52	28
232	28
124	28
208	20
54	30
1002	74
142	38
254	50
188	40
520	58
22	22
204	32
308	48
432	52
152	26
138	34
456	56
118	38
572	60
56	24
556	58
96	32
48	24
168	18
326	54
238	42
78	30
150	26
668	60
466	54
1166	72
1685	82
268	40
602	62
326	48
988	72
232	40
256	36
44	24
136	16
460	52
270	34
568	40
438	48
166	22
998	66
138	22
346	38
1508	96
1376	76
110	30
230	38
474	58
204	36
410	38
330	30
340	52
230	34
414	36
404	40
268	44
1484	78
884	52
968	68
236	32
380	40
476	36
700	48
1360	68
202	34
394	42
158	18
640	60
312	52
332	56
890	54
162	28
1060	62
570	54
150	26
174	38
174	30
248	40
86	26
122	18
386	54
58	30
194	38
310	22
172	24
224	48
52	28
68	20
238	26
574	46
200	24
88	28
232	44
292	44
306	30
178	46
330	46
108	28
336	36
308	40
146	30
484	56
60	24
1754	104
284	42
226	50
68	28
266	42
196	38
428	64
186	34
1112	72
372	40
362	50
90	26
138	54
128	32
138	30
190	30
306	30
158	18
352	36
212	44
284	46
380	32
194	36
226	22
84	40
152	24
212	24
804	72
426	54
186	42
572	44
182	42
464	52
708	72
206	30
196	40
266	38
172	32
190	22
180	36
38	26
530	40
642	58
124	28
146	34
208	32
64	16
432	46
188	38
194	28
164	36
1012	68
426	42
164	36
144	36
24	24
96	28
402	46
596	46
382	50
720	60
254	44
612	64
344	44
274	50
204	32
124	28
370	48
344	40
562	46
176	40
186	40
726	62
202	38
338	42
336	48
200	44
212	28
202	34
132	28
170	30
352	44
460	64
94	30
208	40
130	40
288	32
110	18
342	54
360	36
586	68
464	52
678	54
486	44
134	20
124	36
970	58
138	28
244	36
308	44
600	54
446	40
248	32
226	34
52	20
432	60
614	50
220	44
878	68
76	20
64	30
72	28
252	42
154	34
362	50
584	56
214	40
810	66
212	32
766	62
114	22
184	36
64	24
232	36
450	44
92	28
438	50
292	36
262	38
210	34
92	28
78	22
120	28
528	36
650	54
170	28
312	36
626	40
240	32
154	28
108	36
158	34
3962	124
282	50
192	40
726	56
278	32
178	26
58	26
270	30
198	30
186	34
90	22
466	52
334	46
176	44
394	38
952	64
266	30
1364	102
1278	72
500	48
260	28
124	24
312	40
560	54
204	28
60	20
262	44
296	30
188	28
140	24
104	32
312	44
338	38
172	32
264	40
232	36
156	40
116	24
292	38
320	48
152	32
362	48
256	32
128	32
524	52
488	36
256	30
378	30
204	28
116	24
108	44
326	46
212	32
90	28
518	46
362	54
268	32
418	50
112	32
336	36
246	30
90	30
372	40
790	54
372	52
258	48
240	36
444	38
26	26
222	38
324	48
342	42
102	30
582	62
2050	80
168	36
404	52
74	26
456	44
436	46
160	24
170	30
314	34
42	18
276	40
832	70
162	26
188	28
142	30
298	30
64	20
428	48
850	68
336	36
242	42
302	38
396	48
226	30
2352	110
326	46
94	26
324	30
1324	80
408	30
258	42
378	50
296	44
778	58
286	42
380	56
532	50
86	26
736	66
272	36
444	32
798	74
56	26
586	54
186	38
86	30
128	20
202	44
348	52
424	56
500	54
60	14
914	78
586	64
636	52
236	28
710	48
202	34
834	62
26	26
252	32
140	28
34	30
208	30
1490	74
822	62
232	32
398	42
128	32
882	56
656	54
156	36
654	48
408	52
66	22
122	32
354	42
168	28
520	40
162	26
368	40
216	28
38	30
72	32
506	42
92	24
222	36
228	32
580	60
196	48
292	32
192	28
442	50
352	42
370	46
1480	76
434	38
594	50
148	32
150	30
1951	80
676	38
2504	98
521	46
652	68
142	34
96	28
554	54
570	58
618	54
538	62
216	32
572	60
96	28
52	28
518	50
424	40
212	48
164	24
476	32
210	30
144	44
264	38
84	28
204	40
140	40
556	60
828	50
300	36
254	38
494	50
364	36
248	36
1138	46
338	34
304	52
458	38
80	20
184	38
342	46
168	32
288	40
126	22
370	42
506	46
450	42
526	58
188	44
458	58
186	34
358	30
376	48
178	34
390	50
204	36
372	40
272	48
62	26
86	22
232	36
616	54
72	20
726	74
188	40
596	54
132	32
714	70
210	34
330	46
516	44
332	44
68	24
92	28
912	90
256	56
3110	90
242	38
300	40
374	26
284	44
434	50
786	54
154	34
1250	72
478	40
96	28
1586	86
514	56
468	32
382	32
324	40
468	44
434	38
152	32
162	34
978	66
556	36
408	44
282	42
130	26
124	36
982	70
2390	90
234	42
484	48
680	42
290	50
466	42
136	30
226	28
438	50
232	38
280	28
68	28
154	30
246	34
212	36
896	66
1150	72
306	46
638	60
76	28
484	38
92	22
226	38
300	40
72	24
420	40
30	22
272	32
582	50
768	68
738	56
134	34
344	44
226	26
158	22
394	62
758	80
134	14
34	26
286	34
188	36
842	62
222	50
174	34
320	48
260	32
160	24
152	36
396	32
204	32
414	38
500	40
530	42
296	36
802	62
440	42
232	36
430	40
482	38
256	28
528	58
74	26
138	18
1156	74
812	52
324	40
614	54
374	48
686	58
978	86
466	40
200	44
182	34
666	44
566	46
2850	104
338	30
2078	104
88	28
578	38
386	46
1620	82
140	32
280	40
512	64
56	28
80	28
278	42
1381	74
466	42
120	20
232	32
870	76
750	62
430	42
170	26
211	42
104	36
292	40
162	26
220	40
332	44
76	16
100	34
19	7
152	24
138	26
262	34
30	22
412	48
952	64
552	54
682	44
1246	64
46	22
358	34
910	80
72	24
924	64
504	56
60	16
190	42
180	32
472	32
414	54
48	32
458	68
104	40
144	20
1070	62
316	40
474	50
88	32
526	46
98	22
548	56
714	70
158	46
310	34
212	36
596	64
1546	84
114	30
246	44
706	70
502	58
238	38
144	32
180	36
148	32
210	30
1236	76
156	36
242	32
146	34
150	34
364	48
458	62
1054	60
856	60
132	32
94	30
524	60
92	24
258	30
19	7
370	46
258	26
90	34
19	7
168	24
106	26
54	26
122	34
436	60
498	42
516	56
368	60
186	30
141	30
144	20
344	44
178	30
582	62
294	50
90	38
706	54
456	52
238	26
406	46
210	42
206	34
194	50
660	56
710	62
64	20
364	48
384	44
1414	78
490	48
204	32
220	44
452	38
232	32
244	32
1180	84
192	40
250	30
106	34
306	46
396	32
254	34
602	62
468	50
530	50
50	18
690	58
254	42
136	28
164	20
288	40
74	26
194	38
86	30
452	52
38	18
210	38
112	32
194	26
64	24
262	38
124	24
880	56
864	56
118	26
432	40
418	46
728	44
156	36
1462	86
262	38
532	46
32	24
80	32
108	36
202	34
172	44
72	28
554	42
289	46
152	40
390	50
32	32
416	32
650	56
196	28
122	38
116	32
1202	76
114	34
20	16
452	40
478	50
100	32
154	38
122	34
372	32
268	44
780	64
510	48
142	18
68	24
354	46
170	38
164	36
22	22
124	32
544	56
90	30
688	38
272	32
326	42
58	26
792	56
214	42
624	36
340	52
126	30
244	24
1414	82
314	46
120	28
296	40
548	58
428	44
108	16
628	52
182	32
482	46
274	34
1466	98
222	34
172	28
238	38
94	34
156	40
394	42
220	36
166	34
38	22
316	46
50	26
402	50
370	32
148	36
278	38
168	28
162	34
248	40
252	42
410	34
102	30
146	30
264	38
502	58
924	56
334	42
160	36
298	46
210	38
134	30
170	22
72	28
316	44
108	24
166	42
254	42
682	58
1000	64
148	28
80	20
774	56
618	66
738	66
726	40
1054	70
1324	80
676	44
94	30
380	38
404	34
204	28
170	34
416	32
268	40
613	58
236	32
1876	84
232	40
188	28
336	44
586	44
1364	76
430	42
154	34
418	30
600	52
104	28
444	48
460	44
378	50
62	22
58	28
338	50
236	28
188	40
850	54
84	30
212	32
108	24
178	34
608	40
402	42
198	30
226	46
114	14
82	42
242	32
184	32
284	40
822	66
154	34
384	32
556	52
454	54
466	50
442	50
132	36
220	28
280	36
726	68
238	40
1278	72
1084	92
480	36
210	34
298	42
416	44
484	36
772	58
570	42
262	42
116	32
284	40
19	7
126	26
210	34
484	44
674	52
780	40
698	54
536	52
552	68
466	50
704	56
186	38
348	40
196	36
486	58
306	46
182	34
214	38
440	42
124	40
72	28
328	56
296	40
680	64
246	46
286	34
386	50
232	44
166	38
608	48
731	52
234	30
108	28
86	30
432	38
144	20
448	46
102	30
198	46
212	46
762	54
234	46
306	38
514	58
22	10
272	44
172	30
134	28
286	42
268	44
404	44
78	30
336	36
674	60
374	38
700	50
376	54
148	24
268	32
196	36
338	42
412	24
168	36
174	46
490	48
962	82
672	68
166	38
146	30
404	44
536	36
444	52
336	36
246	34
162	42
524	60
266	54
412	42
172	32
456	52
486	34
214	30
82	22
54	26
150	38
700	40
190	34
220	46
560	42
382	50
160	32
304	42
240	32
536	44
158	34
132	36
356	56
534	58
446	54
234	34
78	26
124	36
100	28
246	42
310	30
92	24
524	48
242	30
202	38
372	50
1002	66
122	26
2016	92
494	40
206	34
480	56
278	50
120	32
282	40
282	26
244	28
216	38
148	40
802	56
200	32
554	46
194	42
690	62
164	24
812	52
1114	58
360	32
158	26
510	46
364	44
126	30
46	22
180	44
454	42
250	38
96	28
386	44
416	56
394	42
890	62
120	36
490	62
130	34
56	24
400	40
192	40
244	40
140	32
132	28
1174	86
176	44
532	52
160	32
19	7
544	48
604	60
258	38
252	44
362	38
596	44
244	46
176	26
928	60
304	52
88	28
224	40
60	28
58	30
252	32
450	70
156	28
216	40
132	20
412	50
44	28
130	30
342	42
166	42
272	32
218	30
86	30
330	38
286	46
126	42
626	66
312	30
1000	52
778	62
184	40
340	32
570	58
130	34
358	42
658	62
224	52
120	36
182	38
180	32
1012	58
768	56
112	32
1340	72
378	48
496	56
292	44
806	52
1174	82
1540	84
536	40
514	66
644	56
450	54
216	36
56	16
404	52
60	20
404	42
254	34
530	44
124	32
278	38
126	34
236	36
164	36
88	32
322	40
186	26
1332	78
108	16
538	34
482	46
62	26
244	44
594	44
676	54
1212	68
966	88
236	36
188	48
134	34
78	26
564	64
182	26
314	58
300	48
476	42
156	36
446	58
228	38
54	18
76	32
44	12
364	44
168	36
632	60
422	38
1014	64
154	26
859	56
102	34
316	32
418	58
270	42
468	52
344	56
98	18
136	28
40	24
68	32
112	24
112	20
132	40
88	32
194	42
100	28
280	40
456	44
98	34
194	30
488	46
190	38
210	50
218	38
68	28
418	42
430	42
102	26
232	24
332	44
102	38
354	44
486	54
236	36
36	20
22	22
334	46
212	40
646	54
314	32
520	52
2918	102
112	36
178	38
588	58
146	34
638	50
398	30
112	20
226	34
500	60
740	56
80	24
290	34
282	38
102	30
420	56
338	54
112	32
110	26
238	46
996	68
64	28
50	26
78	26
500	44
156	20
246	30
782	54
82	26
116	20
132	32
362	46
19	7
596	44
878	68
288	28
514	46
512	52
148	24
966	66
846	62
857	58
1046	74
210	26
28	28
480	40
1208	76
200	40
442	54
744	60
230	38
286	30
376	36
1112	68
194	50
19	7
216	36
342	38
194	42
212	44
212	32
186	42
230	34
248	28
148	24
124	24
170	34
204	48
116	28
274	42
784	48
502	46
1254	78
210	30
72	20
848	60
98	30
160	36
550	42
168	32
522	62
188	28
334	42
626	56
28	28
344	38
118	22
830	60
896	64
330	46
158	50
694	50
292	32
88	24
920	76
1118	56
890	72
428	38
742	54
154	30
648	56
52	16
638	58
66	26
320	40
462	30
76	24
134	38
420	44
154	32
272	44
286	62
278	26
1302	66
1210	58
820	56
540	48
422	50
294	44
202	46
354	38
386	38
56	24
130	34
166	34
208	36
58	34
352	44
328	36
390	50
220	32
114	14
204	40
178	34
482	36
194	42
354	46
340	36
654	70
146	30
66	22
344	44
208	44
244	24
632	68
94	18
558	52
108	32
412	36
682	52
170	38
54	26
1096	68
154	26
422	54
388	40
194	34
296	46
204	44
608	46
194	42
338	46
286	34
72	24
238	42
122	38
150	30
122	30
104	36
50	22
676	52
690	62
288	40
554	58
520	36
150	18
400	32
226	42
86	22
152	20
284	32
214	38
382	58
308	40
1640	98
408	48
548	52
172	32
352	52
100	24
648	52
118	30
392	48
352	44
330	54
110	22
152	36
706	50
144	40
900	64
218	22
600	60
438	36
210	26
250	38
194	42
888	54
356	28
1066	58
136	32
96	32
514	42
46	22
360	44
22	14
268	32
234	42
406	34
166	30
468	50
926	64
300	32
112	28
604	52
324	44
128	28
572	60
210	34
404	46
104	28
156	32
58	14
182	26
194	22
214	38
378	34
218	50
216	42
274	50
534	58
302	42
206	42
116	32
874	62
320	38
24	24
140	28
416	46
266	50
184	28
1316	84
128	24
370	46
92	28
120	36
496	48
546	46
1330	90
68	36
1694	74
664	64
60	36
134	38
186	22
312	42
394	56
942	70
106	34
114	34
280	32
228	34
674	66
262	38
544	52
204	36
402	52
118	34
1114	66
170	36
518	46
104	32
342	30
264	32
982	64
172	32
72	24
524	56
370	50
1324	84
82	28
552	48
232	40
460	56
160	32
224	36
312	44
94	30
486	42
162	30
430	44
92	28
1034	78
114	14
512	52
432	40
522	50
190	34
124	20
138	34
412	36
164	36
1316	76
712	48
212	44
150	30
1104	92
82	30
290	42
390	42
400	64
814	62
266	28
424	40
536	44
144	40
152	20
68	32
440	40
210	46
276	40
1184	74
146	32
412	52
116	20
122	30
244	28
76	36
600	58
100	44
660	60
470	62
380	42
38	22
68	36
19	7
144	32
814	58
670	50
302	34
332	32
208	28
142	34
516	56
584	44
336	36
458	44
348	44
1460	64
376	40
378	54
428	48
566	70
270	50
72	28
470	42
526	58
506	52
626	60
824	64
886	74
310	34
900	66
382	38
43	11
406	46
632	44
366	58
70	30
390	38
418	50
430	50
410	46
96	24
330	34
324	44
304	40
2062	90
58	26
372	40
150	26
160	32
878	62
424	44
76	36
760	64
504	54
48	20
156	24
162	30
238	22
336	40
760	64
180	36
116	28
616	40
214	40
184	28
236	40
510	38
1052	62
1256	72
136	32
242	42
284	54
96	28
254	34
130	30
498	54
330	38
54	22
90	38
360	56
520	48
780	60
1110	70
626	66
472	32
48	24
190	30
318	46
308	60
40	28
316	40
43	11
366	46
124	32
238	44
314	46
364	52
154	26
174	36
256	32
176	24
358	38
210	32
164	20
136	24
220	40
118	38
292	28
86	30
464	48
156	36
646	66
172	28
264	36
410	38
1340	92
178	22
248	34
278	46
98	34
64	32
756	46
138	18
748	60
290	42
228	36
1112	68
56	24
210	44
254	54
212	34
44	20
284	46
438	50
308	32
94	30
1112	76
1550	82
108	24
56	28
348	48
174	42
154	22
240	48
620	60
534	38
116	24
122	22
690	58
264	24
182	30
466	58
262	36
664	52
152	30
240	36
1102	66
596	52
146	30
270	30
756	52
662	66
242	38
597	60
352	40
118	26
64	24
230	50
376	40
414	38
734	70
648	48
134	30
34	14
228	40
596	52
308	36
218	30
1620	74
536	52
1488	78
910	70
218	42
724	68
1614	82
328	36
578	54
324	36
574	50
236	24
800	62
408	52
214	36
326	46
618	54
2030	78
56	24
634	46
184	32
132	28
476	56
96	28
246	54
178	34
78	26
202	42
558	60
92	24
860	54
450	46
142	30
198	38
1206	76
146	30
508	42
168	32
140	32
162	26
52	20
348	48
240	28
270	38
182	28
318	26
124	28
372	46
476	48
280	48
192	30
526	58
164	28
924	72
212	36
148	40
286	30
1486	86
330	46
292	48
744	60
348	36
82	26
462	42
98	26
286	42
1434	70
416	56
398	50
518	50
358	42
202	40
40	16
482	54
498	42
132	40
140	24
282	34
78	18
86	36
664	48
708	56
426	38
204	40
522	58
636	56
404	44
658	58
506	46
756	72
850	74
108	16
2388	106
914	66
78	30
450	30
534	48
624	52
260	28
120	28
180	36
138	30
506	50
276	36
70	26
50	14
308	44
150	28
314	30
206	26
206	38
184	36
286	42
142	38
288	48
212	40
222	38
1226	72
292	48
352	32
276	40
646	64
138	26
206	42
148	40
886	62
356	32
318	38
148	36
280	28
236	32
114	34
706	50
134	26
416	52
64	24
1158	58
1136	80
1544	84
594	56
332	40
262	54
80	48
174	30
586	68
196	32
292	36
106	26
442	54
960	68
406	44
52	24
38	18
316	44
262	46
170	38
118	22
298	30
82	30
854	66
230	38
180	28
338	46
274	42
526	58
56	32
714	58
118	34
144	20
754	66
492	48
54	26
118	30
130	38
544	48
302	38
124	28
390	38
560	48
36	28
36	24
672	54
490	46
298	26
848	60
550	54
600	58
772	56
854	54
582	62
322	42
246	46
66	26
160	32
296	34
308	30
612	66
78	34
310	38
186	42
234	30
544	56
284	44
162	38
58	26
166	38
98	34
156	32
1120	92
218	46
326	40
302	54
19	7
922	58
220	44
72	32
278	36
116	32
118	38
114	30
46	30
1702	78
736	70
60	20
308	30
204	40
204	44
128	32
200	28
682	46
52	28
1028	60
478	54
282	50
52	24
252	38
586	42
56	24
944	64
338	46
442	50
242	34
358	60
416	48
82	26
118	40
60	20
70	26
1224	80
296	32
486	62
292	32
322	34
820	76
430	42
274	32
514	54
182	34
30	30
446	50
260	56
2150	118
160	40
296	28
110	30
200	24
468	44
456	56
426	54
370	38
168	28
130	30
146	34
440	48
1630	86
276	32
224	32
158	30
222	24
40	28
336	32
178	38
322	46
370	46
456	52
647	44
116	28
348	48
336	48
1468	80
544	54
1952	100
90	30
308	32
398	38
90	22
210	22
126	34
82	34
1824	110
200	36
1000	70
688	64
688	48
1476	82
1088	56
1032	72
402	50
380	42
132	20
98	26
296	40
778	42
218	46
88	28
328	42
82	30
290	38
562	58
374	38
574	56
160	32
232	48
706	66
614	46
2092	92
208	32
196	24
356	44
252	40
338	50
196	36
740	54
346	38
592	52
238	26
154	26
632	52
578	46
194	30
378	36
54	26
1558	88
166	38
694	60
30	26
19	7
26	26
482	30
244	40
214	42
192	42
124	20
224	20
142	42
94	26
92	28
194	30
378	30
746	54
78	18
68	28
650	58
88	24
838	50
84	28
918	58
550	54
328	42
310	44
154	42
624	48
686	66
92	44
74	26
334	42
312	48
240	46
280	40
300	36
142	34
426	34
52	24
234	30
262	32
608	60
528	68
178	30
58	26
242	44
746	58
888	52
314	42
324	32
374	56
374	42
432	44
106	26
72	28
110	18
366	38
760	66
110	30
208	36
356	48
174	30
92	20
712	58
404	36
348	44
1204	84
328	36
162	30
70	30
428	36
246	30
132	32
440	48
234	38
324	52
266	22
478	50
234	42
322	40
332	38
94	30
456	48
412	48
762	46
402	54
1952	80
300	36
384	40
96	20
344	52
222	40
304	48
1252	60
208	40
148	32
404	32
168	36
2260	96
1212	80
2274	78
196	28
756	66
186	34
838	42
272	32
868	56
80	24
706	52
444	36
600	60
366	42
84	28
210	38
118	26
488	50
486	38
384	48
64	24
96	28
118	22
62	18
184	34
302	50
428	44
174	26
540	40
174	32
182	34
190	34
72	36
94	30
82	26
210	46
438	42
190	42
364	56
360	40
56	24
472	42
374	54
320	40
478	52
336	40
1052	58
88	32
486	38
468	44
382	38
314	42
412	56
140	36
186	38
688	64
316	22
902	68
526	50
304	46
316	28
724	56
220	40
380	60
358	50
272	44
712	52
312	38
122	34
164	36
384	46
1330	76
212	36
1532	76
166	26
962	78
354	46
104	28
158	38
140	24
388	40
378	50
478	54
180	36
150	32
784	54
224	32
320	38
230	34
328	40
120	32
492	56
186	34
542	46
912	82
136	32
1450	96
422	46
668	52
416	52
66	26
586	44
306	46
148	28
176	36
198	34
236	32
262	42
1028	62
564	64
608	56
172	32
1350	80
282	34
292	44
206	34
1268	96
298	42
210	38
246	42
642	46
392	52
818	62
1432	84
1004	78
54	24
536	44
158	36
580	52
452	46
314	34
828	52
204	24
112	28
362	26
132	24
19	7
300	36
184	40
344	40
554	58
722	60
360	28
378	34
78	30
164	28
526	54
110	18
504	28
422	34
172	44
558	46
302	42
66	30
188	28
70	30
122	34
350	30
840	68
276	48
148	32
258	38
312	40
978	58
230	34
170	22
672	56
162	30
412	40
2158	98
842	66
246	30
250	36
192	32
138	30
442	34
480	58
488	40
200	40
794	76
470	58
364	40
348	56
108	16
356	48
342	34
52	28
1686	78
124	40
274	42
200	40
144	30
78	30
444	48
564	58
186	34
112	32
544	32
198	30
398	42
458	46
24	24
190	38
2700	92
416	38
228	44
334	38
96	20
342	40
116	20
212	36
100	36
574	46
368	32
502	48
150	34
162	34
942	62
272	28
872	62
22	22
32	24
50	22
176	40
846	60
418	42
660	60
156	32
352	48
392	44
688	64
132	36
422	40
198	42
1036	60
198	30
714	54
274	38
36	20
644	56
350	54
352	36
388	44
344	52
220	28
326	38
190	34
218	42
44	32
316	48
136	24
558	44
134	34
162	36
300	40
410	30
250	42
836	52
82	34
422	38
448	52
512	52
144	28
678	46
286	44
926	74
572	52
986	78
104	24
1368	92
1108	72
468	56
66	22
136	36
100	24
90	26
912	64
232	36
160	28
40	24
1082	66
974	58
92	24
112	24
828	66
104	28
622	54
1187	76
944	66
252	32
204	44
200	32
204	40
214	30
232	36
60	24
522	42
156	36
50	18
248	36
320	56
242	36
418	50
330	42
242	50
1120	62
186	30
242	34
488	32
160	36
62	18
46	26
162	42
652	64
598	42
122	30
380	48
162	38
276	36
1782	92
516	40
56	28
658	66
426	50
576	40
1150	68
198	46
372	42
250	34
184	44
376	42
86	34
216	32
160	24
136	28
455	30
536	52
224	36
598	58
140	28
304	32
136	36
116	28
408	40
426	50
578	54
356	56
48	20
854	70
438	62
258	34
128	28
758	46
76	28
1226	60
312	40
538	50
284	48
704	60
282	26
534	50
240	44
258	40
364	32
72	32
224	52
436	44
874	64
490	46
160	24
424	60
574	48
696	68
208	40
174	32
242	42
60	20
150	34
1502	80
410	42
356	32
58	22
470	42
334	44
368	44
204	40
630	66
420	50
146	22
192	36
250	58
330	30
996	54
162	34
540	32
306	42
802	50
366	38
510	46
1000	72
460	52
174	30
1980	78
108	24
296	32
444	40
568	44
992	60
112	24
606	50
86	34
156	36
398	54
374	42
462	42
19	7
306	38
688	72
1200	74
226	38
1106	82
274	46
298	38
150	34
174	26
1278	70
368	44
464	48
326	34
116	24
376	34
308	40
162	38
284	36
40	32
484	48
508	32
104	30
554	54
700	56
696	64
220	32
500	40
966	60
730	62
166	38
342	42
104	32
294	36
86	30
520	60
154	36
432	34
580	46
148	32
106	42
398	42
70	26
340	36
90	34
398	58
1334	82
142	26
1154	66
78	28
84	24
176	34
456	36
262	50
420	40
316	40
310	42
138	32
290	26
292	46
454	34
330	30
1148	64
240	30
742	42
214	30
544	52
906	64
276	32
158	36
266	34
234	34
216	32
276	44
114	30
126	30
126	26
304	28
260	44
100	28
300	48
328	28
282	30
176	40
594	56
82	34
2148	96
524	44
44	28
224	32
394	62
308	40
220	32
118	34
76	28
100	32
96	32
146	42
136	32
146	30
516	40
1824	86
248	32
318	38
104	32
660	56
466	46
468	56
136	36
206	54
130	38
96	28
224	28
366	28
88	24
808	50
272	40
364	26
462	54
132	24
290	38
740	60
42	14
974	74
114	34
258	26
292	36
138	34
90	30
102	30
634	56
128	40
264	36
496	54
534	54
622	48
264	32
100	32
220	36
406	52
366	58
260	36
176	28
62	18
778	50
130	30
614	54
412	50
146	18
46	18
506	46
196	28
92	28
330	36
292	56
396	44
358	50
210	42
200	24
222	42
90	30
348	40
116	24
146	26
1016	58
842	62
436	48
716	60
26	14
416	52
24	24
198	30
666	58
398	48
118	26
42	14
228	28
350	34
586	70
3194	112
128	40
882	62
88	24
430	50
516	48
742	50
78	30
246	30
464	56
478	48
196	36
254	30
282	22
380	48
638	58
226	34
258	46
116	28
178	32
48	16
50	26
434	38
128	20
1094	68
266	46
394	48
254	34
614	54
748	48
106	26
316	44
372	44
422	30
1044	84
400	52
766	64
274	34
156	44
368	46
188	32
426	44
162	26
276	40
328	28
420	48
154	18
212	40
34	22
296	32
132	28
316	44
400	52
170	38
310	46
730	44
100	28
320	48
1132	62
284	40
268	36
414	54
1028	68
194	42
954	62
208	42
268	36
138	38
698	58
156	32
210	38
548	68
356	36
484	56
542	42
1096	80
312	52
340	36
152	44
202	34
98	22
348	48
786	62
270	50
84	20
189	30
306	30
474	50
422	42
19	7
452	54
540	46
1216	60
142	38
178	30
196	40
210	30
1014	66
258	34
606	34
152	32
286	36
22	22
1232	70
176	36
624	56
334	42
42	22
592	64
120	24
266	42
244	36
108	28
222	34
248	32
1552	84
116	28
402	50
240	32
764	52
24	24
476	40
116	32
230	38
274	38
134	46
504	44
472	56
148	32
636	52
346	22
50	22
344	48
162	24
306	34
122	42
514	56
300	52
152	40
84	20
204	36
152	32
164	36
236	36
126	42
332	48
1194	68
1222	62
130	22
184	32
162	34
96	28
242	42
19	7
158	34
368	60
60	28
116	28
490	58
1396	78
532	48
230	40
348	36
304	28
276	44
758	62
532	62
880	70
24	24
104	20
488	40
420	40
348	56
182	30
286	30
342	38
702	58
208	44
172	32
374	36
204	28
366	42
294	32
538	54
476	48
490	36
52	24
308	44
224	40
602	52
204	40
578	58
520	68
126	30
248	44
814	66
152	28
740	80
342	30
318	50
518	46
256	28
572	44
228	36
256	36
240	36
408	62
1196	82
440	40
582	54
246	36
318	38
258	30
158	34
146	34
1430	70
62	30
856	54
164	28
766	46
548	56
122	26
988	68
98	26
484	60
376	52
126	22
492	56
212	36
594	54
162	50
344	48
442	46
262	34
122	34
380	40
328	38
294	50
232	26
262	30
428	58
950	74
348	44
298	40
356	40
252	28
218	46
68	20
540	44
304	56
588	56
182	30
630	58
222	34
136	16
142	28
332	32
128	20
70	34
260	36
540	44
502	54
340	64
766	62
108	28
674	66
1802	68
58	34
204	44
64	24
462	60
298	26
24	24
388	56
4652	150
72	30
292	40
196	32
178	30
526	42
56	14
180	40
180	28
466	42
1336	92
804	60
482	50
106	30
344	32
314	44
578	46
118	34
164	36
318	34
108	40
386	34
184	30
206	34
166	26
314	42
198	34
280	36
920	64
274	54
512	44
388	32
114	26
616	48
298	26
258	50
318	30
400	56
200	36
80	20
134	30
282	30
284	34
266	42
198	42
302	48
436	26
186	50
56	24
98	34
84	24
58	30
302	32
380	52
94	30
402	44
374	46
58	26
198	26
972	64
494	50
762	62
240	40
198	22
746	54
394	48
340	28
660	64
108	24
494	46
204	36
88	36
720	56
706	58
160	36
484	40
180	24
246	34
102	26
232	32
312	36
88	32
54	14
1374	82
296	48
318	40
236	36
552	48
102	26
370	34
592	40
354	42
300	40
258	38
148	16
212	44
388	58
695	56
80	26
398	54
66	26
362	42
394	48
314	38
194	18
342	26
172	26
228	28
244	40
178	38
106	22
130	34
266	36
484	40
392	50
338	42
60	28
894	66
324	38
156	28
352	44
136	36
422	50
164	28
882	60
146	38
314	38
36	28
40	28
447	42
150	42
96	28
802	46
148	24
278	42
834	56
102	26
480	42
206	34
176	40
240	48
396	40
828	52
690	58
274	54
124	44
214	36
344	46
352	52
120	36
330	42
608	70
288	22
388	58
292	40
728	60
124	32
1758	98
376	56
99	28
240	28
96	32
130	38
208	36
210	42
190	42
300	36
332	44
236	30
822	62
372	34
116	28
98	38
406	30
384	32
356	40
374	54
322	54
226	46
80	32
356	52
774	64
316	44
70	26
74	26
844	72
1224	78
108	28
148	28
756	64
60	16
78	22
366	46
470	42
2154	102
228	34
442	58
228	48
134	34
316	28
198	30
68	24
316	26
348	48
302	42
378	46
504	44
864	48
192	40
1124	72
1274	70
54	26
402	58
360	44
86	30
462	58
194	30
214	32
286	38
94	26
250	38
1030	72
348	42
36	28
54	18
378	44
52	20
384	26
446	50
88	32
266	42
188	28
80	20
188	36
364	52
284	32
40	16
208	32
144	44
244	24
272	32
850	74
596	40
78	30
128	28
218	34
814	52
912	64
208	24
260	36
358	38
1248	72
88	30
334	30
46	14
130	50
552	44
150	26
218	38
660	56
530	38
194	30
418	42
290	38
942	58
118	38
304	56
410	56
346	42
100	28
370	30
396	32
688	52
396	44
492	48
52	16
208	30
338	44
506	46
172	32
640	56
116	32
82	38
574	50
682	58
242	38
60	28
480	48
534	40
110	26
32	24
246	28
252	36
138	42
330	46
348	32
240	36
50	34
792	60
368	48
122	30
108	28
138	38
360	52
266	42
26	22
296	40
52	20
194	26
280	32
416	40
170	46
330	44
476	56
1276	82
810	58
220	40
116	28
542	54
92	28
178	30
1700	90
378	30
380	44
104	28
316	40
1056	82
1852	94
474	46
142	26
226	34
78	22
310	42
234	38
82	26
640	56
118	30
56	24
182	38
182	30
130	38
158	34
260	40
278	38
66	18
386	34
392	32
126	30
44	20
94	30
760	52
116	32
720	56
140	32
146	38
158	30
118	38
156	44
1106	74
816	60
436	38
444	36
162	34
234	34
100	28
50	26
466	42
150	36
316	48
444	62
1164	68
72	24
418	52
58	32
224	36
206	38
132	28
174	38
424	44
130	46
128	32
408	44
230	42
628	60
282	42
470	42
356	40
484	32
192	24
328	42
562	56
60	28
506	40
980	68
766	64
238	34
246	30
152	32
1200	86
150	34
918	62
208	28
226	20
304	60
448	32
386	48
328	44
24	16
356	48
158	34
384	40
88	28
102	30
1092	64
1194	66
416	40
56	28
302	60
98	26
496	50
60	28
386	38
188	40
378	46
486	50
454	46
440	48
926	50
170	30
728	56
342	36
804	64
150	38
550	34
242	34
646	54
144	36
148	32
196	36
730	70
1388	84
258	44
204	36
150	30
806	54
684	64
394	54
1486	84
76	24
76	20
382	50
160	28
568	52
144	28
112	36
272	36
400	38
270	42
28	28
160	24
180	42
240	40
398	46
230	38
780	60
56	24
402	42
500	48
202	36
100	28
60	28
498	46
538	46
128	24
346	34
242	38
82	30
19	7
138	30
130	34
1406	70
470	32
76	32
502	62
218	38
948	66
404	36
954	52
278	26
392	40
64	32
1896	92
486	64
180	36
898	82
130	30
212	32
290	22
376	40
62	26
56	32
30	22
302	42
128	40
456	40
228	32
184	32
486	46
794	64
158	38
344	42
264	28
244	44
48	24
126	26
210	50
194	34
240	24
202	34
284	40
210	26
62	22
198	34
172	32
698	62
676	50
160	36
140	34
194	46
308	56
62	18
160	36
210	26
176	36
456	36
318	54
24	24
208	40
976	54
98	22
306	46
440	50
82	28
250	30
254	42
684	60
552	54
590	38
160	32
252	28
312	48
198	34
120	32
360	36
462	30
58	26
578	66
1042	74
472	36
846	62
100	28
816	48
304	36
136	20
136	36
194	30
118	30
210	42
230	34
208	38
192	34
180	32
388	46
398	42
19	7
150	24
90	26
292	44
590	46
234	34
686	66
380	48
54	22
1396	86
60	18
104	36
174	42
246	44
282	42
250	42
542	42
398	58
780	70
272	36
560	60
162	30
484	52
620	40
764	66
106	26
96	24
338	38
568	44
644	52
232	36
242	38
438	42
28	28
128	40
480	48
146	30
848	70
94	34
50	18
368	32
294	56
334	40
934	74
332	44
584	48
654	70
442	70
580	58
212	24
42	26
96	32
160	28
80	20
990	54
90	30
120	24
434	48
148	36
432	60
68	26
208	40
368	48
238	46
380	36
144	36
1052	76
178	28
178	38
116	24
1076	64
142	38
378	40
212	28
462	50
472	44
54	30
280	28
488	64
890	62
280	44
170	34
296	32
298	34
790	74
660	60
160	32
52	22
122	30
178	26
202	30
204	28
302	38
238	34
514	70
56	24
174	26
364	50
256	50
686	38
280	30
494	46
100	32
22	22
176	32
152	28
142	30
306	30
532	52
268	48
206	26
60	28
390	46
494	58
242	34
138	46
1090	62
62	34
70	26
226	30
302	38
338	50
528	48
174	38
220	40
212	40
60	20
274	42
324	46
1736	76
308	48
98	38
132	24
520	42
378	36
546	54
392	40
120	32
726	70
220	42
30	30
196	32
586	46
358	50
212	28
1494	68
478	58
326	30
390	54
128	28
1320	64
490	56
284	52
72	32
128	32
74	18
446	42
392	60
2890	100
44	20
312	48
392	44
160	24
158	28
412	36
60	24
326	38
232	38
618	62
136	20
50	18
2566	116
30	14
226	34
768	48
184	40
618	50
596	48
432	52
572	56
542	62
166	26
290	50
54	30
358	58
222	34
184	36
1228	64
56	28
112	40
738	46
250	38
192	36
766	68
304	42
268	52
744	58
176	40
322	50
680	54
68	24
720	60
880	64
188	36
246	30
172	32
562	58
1060	80
302	42
1704	86
34	26
218	38
498	38
828	72
352	44
78	30
512	46
194	34
676	54
518	46
242	38
108	32
120	24
206	30
66	30
480	48
56	16
4634	126
240	52
898	62
370	38
94	26
510	50
90	26
146	42
108	16
754	56
766	54
172	40
288	40
110	26
164	36
72	40
624	56
314	46
396	50
114	34
154	38
612	52
262	30
526	50
110	26
826	70
108	16
174	30
322	30
438	46
72	28
356	44
318	34
514	42
562	62
730	58
164	32
984	72
344	40
112	28
250	34
184	40
428	60
82	26
208	28
468	48
374	46
628	68
608	52
414	46
152	36
106	30
324	34
262	54
546	50
152	28
226	30
858	54
826	66
240	32
188	24
354	34
360	48
42	18
24	24
378	46
244	44
232	40
468	56
198	30
518	58
28	24
134	34
58	26
350	48
478	46
334	28
254	36
82	26
254	38
96	28
660	44
628	52
330	42
40	32
404	52
572	46
46	38
56	32
666	42
292	40
1236	84
92	28
424	46
242	32
662	54
286	42
1336	70
134	34
714	50
40	24
252	32
470	58
212	44
1464	86
254	36
82	30
1450	88
354	42
126	26
490	54
1116	72
540	52
106	22
44	28
40	32
316	44
122	18
750	68
308	44
108	16
410	42
574	54
340	40
120	28
178	22
30	22
84	32
308	52
704	64
264	40
112	24
594	42
538	46
144	30
440	44
118	26
578	66
264	40
132	28
294	42
66	34
138	34
814	58
74	34
590	54
180	36
796	46
426	44
174	26
214	34
204	36
154	22
352	36
1094	52
78	26
134	38
120	20
236	34
332	28
172	34
702	60
276	40
388	40
136	32
250	34
332	36
282	34
218	48
378	46
136	28
678	46
392	44
446	46
616	52
1058	84
66	26
78	18
730	66
360	48
276	48
132	32
360	46
386	38
88	28
604	40
430	46
52	20
734	54
416	44
160	40
84	24
740	68
444	56
90	26
156	30
128	36
624	52
422	50
350	42
226	38
255	42
228	36
558	54
146	22
458	50
640	44
412	36
254	34
206	34
172	32
848	76
258	38
1032	64
146	34
510	50
384	44
334	26
894	70
202	26
510	60
390	42
1266	74
60	28
240	48
114	38
976	66
330	38
82	18
468	40
278	30
262	30
308	42
80	26
774	58
888	60
52	20
214	34
22	22
968	56
216	32
416	44
96	32
164	40
436	44
726	42
186	38
40	24
854	56
362	50
614	54
124	16
2706	102
358	46
398	42
798	54
230	34
546	54
390	34
244	44
866	44
444	54
334	54
448	46
430	34
1536	68
74	22
498	46
390	42
190	20
256	40
132	36
612	60
268	36
128	28
190	30
82	30
402	54
200	32
128	24
422	34
158	28
122	34
210	30
526	42
504	52
216	32
334	50
108	24
256	56
740	58
190	34
428	34
342	42
584	52
62	22
78	38
570	50
98	26
168	34
134	26
42	18
140	24
704	44
174	34
800	56
280	32
60	28
230	42
230	34
172	36
544	52
2222	98
244	36
236	44
724	52
198	46
124	26
816	68
224	56
808	58
132	40
158	36
98	34
392	52
446	54
278	34
474	50
76	28
102	30
318	38
382	50
258	38
170	34
832	68
350	42
380	36
36	24
226	46
324	28
620	48
830	66
28	24
102	22
382	46
272	32
230	42
628	56
82	26
286	42
106	34
142	28
42	26
274	38
84	28
496	52
278	38
726	58
298	28
110	22
256	36
210	30
380	52
1346	64
364	44
408	52
536	44
242	34
376	48
380	52
214	26
264	24
180	28
192	32
402	38
210	38
82	18
36	24
314	30
146	26
332	40
666	50
482	58
262	38
162	34
120	36
372	54
414	42
1668	92
312	36
316	28
174	26
140	32
496	48
192	40
78	30
1354	86
154	30
374	30
676	64
1178	72
62	22
240	36
536	44
362	24
260	40
336	36
42	18
240	32
382	50
230	42
408	48
246	34
434	46
40	20
170	38
388	32
814	64
616	52
106	42
552	60
184	32
184	40
168	16
170	30
120	32
700	60
826	54
102	34
226	38
188	32
1336	78
498	50
366	30
196	36
388	52
88	32
660	44
274	62
606	58
1202	58
328	48
346	34
898	86
124	28
122	30
318	26
1838	88
102	24
436	46
240	32
414	34
196	32
2036	72
152	40
322	26
70	26
284	32
162	34
610	62
232	36
362	38
236	44
158	34
404	48
170	34
588	44
270	46
296	40
170	40
680	56
698	66
904	50
418	48
168	24
148	48
112	32
194	48
76	36
446	54
204	32
116	32
150	30
440	46
84	28
272	38
388	44
468	40
62	30
250	46
390	46
308	32
204	40
160	32
426	62
232	40
88	28
356	32
282	42
274	38
164	28
114	26
452	40
216	40
490	52
128	32
382	46
210	26
768	52
1482	90
478	54
274	34
814	60
598	60
148	32
1108	66
120	36
294	22
70	30
152	24
208	38
236	40
338	30
734	62
222	30
182	34
490	42
44	28
538	46
486	50
288	44
324	48
202	36
608	68
558	58
294	46
118	30
166	38
5572	168
480	44
366	50
96	32
