Score	Length
668	64
212	32
1988	96
284	36
232	32
2540	90
280	32
324	48
268	32
800	66
496	44
142	30
118	18
620	56
326	30
198	38
146	22
28	28
48	24
936	70
226	34
160	36
248	32
670	68
220	36
98	22
156	32
142	34
604	64
332	40
362	38
472	40
288	32
588	52
186	44
706	54
602	54
414	46
278	32
150	34
150	38
764	58
106	30
300	28
676	64
192	36
342	42
182	38
242	46
206	34
300	40
1598	98
382	42
396	56
42	14
198	42
338	38
382	48
396	44
176	26
108	24
416	48
680	60
66	30
332	48
76	28
226	46
48	24
56	32
238	46
124	28
188	32
208	40
138	34
290	42
122	30
78	26
118	26
282	46
456	52
266	38
862	74
906	66
328	40
134	22
236	48
216	32
272	44
1188	78
438	56
72	32
234	42
88	28
58	22
258	42
506	38
272	40
740	72
162	46
270	34
410	46
296	34
302	34
408	28
298	30
456	48
804	60
238	34
128	44
356	40
664	52
536	52
684	44
58	34
370	40
74	34
302	50
310	62
214	26
970	78
174	22
176	32
272	44
268	32
1118	78
624	44
652	68
136	30
1444	74
98	34
230	22
730	66
186	34
484	44
728	44
270	38
410	30
446	38
516	52
1190	82
84	24
170	38
158	34
294	34
1092	60
444	44
610	54
60	20
252	36
392	54
120	36
164	40
476	48
768	60
336	40
518	58
212	40
76	28
430	54
274	38
222	34
162	26
76	20
322	44
352	46
198	30
68	24
396	60
1404	66
38	30
218	44
404	42
266	42
30	14
108	16
160	44
158	34
72	28
892	68
164	28
64	28
174	42
416	52
44	24
504	56
490	44
130	38
466	54
50	18
92	26
232	42
614	30
332	36
322	40
344	48
300	38
50	26
42	26
798	68
528	52
152	24
380	34
118	34
324	36
270	34
986	62
288	28
214	34
542	58
766	56
214	34
126	26
784	76
310	42
152	32
978	62
226	38
222	38
204	44
26	26
362	50
646	54
184	40
542	50
986	58
194	26
168	28
288	36
238	30
972	68
134	26
690	42
60	28
424	32
152	32
92	24
150	34
72	16
270	50
124	30
340	30
120	32
350	46
592	64
302	46
36	24
230	34
568	48
122	30
332	36
376	38
250	38
160	24
924	60
386	26
214	38
570	60
226	38
140	40
232	40
472	48
220	34
816	52
476	52
378	54
272	42
236	40
864	72
582	46
19	7
72	32
176	32
374	54
244	32
138	30
276	36
184	36
350	42
848	64
954	70
246	30
236	44
110	26
472	40
498	50
280	40
138	30
348	40
392	40
888	60
320	44
19	7
368	36
482	50
284	28
74	26
156	32
312	40
96	20
240	32
354	50
1354	86
116	32
460	48
80	24
438	46
354	38
150	26
96	28
98	30
370	46
404	44
124	28
54	22
262	38
400	36
318	46
378	54
464	42
254	42
454	44
96	28
76	36
274	34
82	26
110	26
380	40
43	11
160	40
176	32
246	42
186	38
168	32
288	44
538	48
56	32
412	44
174	30
972	62
924	66
788	60
98	30
402	50
686	42
196	22
200	44
864	64
246	36
90	30
296	32
318	30
184	26
138	34
164	32
48	24
488	52
218	46
146	26
560	48
828	64
466	44
312	42
1378	82
246	42
2192	78
432	46
478	48
224	40
222	38
158	34
1368	68
1636	86
448	52
896	64
218	34
514	42
506	42
294	38
634	46
342	26
112	36
38	22
58	18
476	44
302	46
1332	76
170	34
410	42
154	34
632	60
70	14
116	32
124	28
306	46
86	38
424	36
310	28
62	30
498	54
80	32
262	34
372	48
300	36
928	60
74	38
426	40
130	30
166	38
64	32
202	38
208	40
306	54
326	50
386	60
438	54
506	54
1478	82
948	60
1126	80
342	42
466	38
1314	78
200	36
300	40
1012	56
344	40
176	28
166	22
648	52
590	50
50	22
356	44
258	34
942	74
142	38
24	24
198	26
370	34
50	26
82	26
908	56
204	36
850	60
184	34
324	32
158	30
296	48
380	48
114	30
19	7
122	30
142	28
176	32
508	50
220	30
186	30
972	72
268	44
190	34
662	68
164	44
184	28
698	40
1378	72
100	28
560	52
692	56
56	28
222	34
220	28
542	60
226	34
184	32
106	30
50	26
770	66
334	40
88	32
292	48
346	46
182	26
402	38
428	36
314	42
158	42
138	42
1134	76
188	32
288	40
166	32
1032	72
838	58
148	28
658	72
256	36
558	70
204	36
200	28
440	28
342	46
136	32
488	50
946	54
22	22
132	28
416	44
104	36
402	54
972	72
174	38
224	32
952	62
374	42
252	24
132	24
42	34
102	30
514	54
110	22
384	32
112	32
728	48
272	40
454	46
1326	74
70	22
528	48
376	54
52	26
208	42
234	38
596	44
312	48
310	42
34	26
358	38
168	44
248	40
128	36
594	42
320	28
254	34
406	50
274	46
450	34
260	28
238	46
116	36
146	34
428	44
424	36
72	24
260	36
294	34
562	50
270	34
612	52
86	30
40	28
488	48
150	26
142	30
450	54
1298	66
140	36
162	30
202	34
602	58
170	34
274	46
118	46
256	56
334	32
174	46
286	46
544	60
76	24
124	28
212	44
1228	64
654	60
1728	92
170	26
342	46
270	42
534	54
270	46
784	68
366	46
628	64
374	46
646	50
626	50
230	42
436	44
190	26
250	54
306	52
126	34
174	38
228	44
318	46
92	28
836	54
152	28
1552	86
3698	136
168	26
92	36
168	28
522	46
178	42
656	56
172	40
366	34
278	32
250	26
536	76
244	40
796	56
144	26
752	52
170	50
264	44
148	48
382	34
448	48
112	20
440	52
430	42
134	34
372	44
924	74
224	32
240	32
170	38
62	26
270	26
454	42
300	36
126	26
108	28
252	32
178	38
272	52
680	48
122	30
272	28
282	46
216	32
150	42
490	56
298	46
388	44
228	34
260	42
282	42
994	66
260	44
120	36
950	72
246	34
1844	108
56	16
118	30
22	14
368	40
288	40
774	70
456	56
214	38
158	24
194	38
366	38
122	42
310	42
50	22
342	56
134	18
292	40
1166	82
248	44
274	38
196	44
330	38
160	28
322	42
450	50
1296	86
160	32
296	48
640	56
256	24
456	40
192	32
150	30
74	30
84	32
386	42
310	46
106	26
19	7
1770	92
312	48
742	58
348	50
70	30
248	32
436	44
104	32
560	56
242	38
222	30
296	32
590	50
88	22
460	48
276	44
502	42
424	52
766	62
594	52
140	32
204	28
144	40
600	56
420	42
264	40
458	50
224	36
332	56
440	42
362	44
164	30
62	18
140	32
248	40
232	30
274	54
56	28
816	68
156	32
552	38
128	32
142	26
208	36
308	44
98	36
38	18
104	24
856	54
538	38
774	46
144	28
80	28
258	34
412	44
88	20
92	28
512	52
504	44
964	66
232	28
466	70
316	44
74	26
778	70
334	38
388	50
308	36
594	58
324	40
94	22
54	22
628	60
194	28
448	52
320	52
466	50
734	58
88	22
222	48
428	50
462	50
240	36
418	46
808	50
352	58
184	36
450	58
444	46
514	60
218	34
186	42
374	42
108	20
156	34
120	28
256	32
640	58
550	58
172	44
320	44
514	58
452	40
346	42
306	38
310	46
50	26
96	36
230	42
324	34
374	54
166	34
358	42
496	56
84	28
158	30
94	26
292	40
86	34
24	12
750	66
138	42
110	30
362	46
468	52
1738	78
68	24
530	58
964	64
42	26
86	26
134	26
316	36
102	30
376	46
254	46
152	32
92	28
216	40
248	24
246	38
240	36
130	34
344	44
1058	50
238	30
1010	70
324	36
172	32
402	36
328	40
526	40
1826	82
858	62
336	44
44	24
352	44
408	46
554	46
1278	76
158	26
168	32
776	60
524	40
596	52
414	42
58	26
474	46
450	50
324	28
1428	78
170	26
302	34
188	36
98	38
610	66
384	36
48	24
92	24
2036	90
404	52
510	48
300	36
464	42
56	16
128	32
88	20
98	42
200	28
302	38
910	68
188	40
332	40
162	40
336	36
360	56
348	48
338	30
622	62
230	34
244	32
568	52
436	40
726	42
76	28
82	34
296	48
198	38
942	70
418	30
176	28
188	32
46	14
86	30
58	30
114	18
54	26
1022	74
162	34
154	42
52	20
46	22
196	36
560	44
102	30
128	28
480	56
158	30
172	32
72	20
1352	76
116	28
26	22
264	36
154	22
414	50
262	38
536	58
204	40
204	40
460	52
470	50
308	48
266	38
312	32
156	38
166	22
110	38
770	58
362	42
116	32
304	36
300	36
384	32
272	62
164	24
276	36
368	52
294	42
19	7
78	18
176	24
304	32
70	22
840	62
60	28
230	34
84	28
76	36
50	20
628	44
288	32
176	44
132	28
178	24
208	32
464	44
431	34
212	44
800	62
222	22
332	40
814	64
640	56
456	32
282	34
338	26
266	42
764	66
286	38
118	26
336	44
416	40
464	52
200	28
1100	82
208	32
182	30
206	42
730	74
546	46
330	42
156	36
414	42
264	44
456	50
1790	94
504	42
398	46
794	70
404	44
100	24
414	54
276	32
348	52
4224	136
378	34
136	24
710	58
230	30
170	46
576	68
1528	86
202	38
46	26
932	56
144	28
86	30
386	34
278	26
426	54
236	52
254	22
140	24
100	24
472	48
64	32
110	30
472	44
468	64
116	32
142	30
120	28
244	26
58	26
342	46
244	36
660	64
134	30
260	40
258	26
200	30
70	22
404	36
60	28
396	46
88	28
436	60
96	28
206	38
72	24
174	44
116	36
402	50
266	30
198	30
396	40
236	28
224	40
218	38
432	28
112	36
168	28
204	30
252	36
80	32
1026	66
136	28
70	30
434	50
966	64
126	26
352	40
112	32
114	34
232	36
254	38
112	24
256	44
458	46
308	36
106	26
1538	78
330	54
992	68
466	50
68	24
336	40
436	56
56	24
562	50
200	40
972	58
700	64
634	58
544	52
396	40
114	30
236	28
226	30
328	42
746	62
306	34
146	26
144	40
96	20
194	46
398	50
570	54
172	48
314	60
258	34
136	28
928	70
56	20
330	54
378	46
320	40
260	36
1164	64
54	22
94	30
62	26
156	24
382	48
320	36
118	26
200	40
326	30
168	32
292	28
454	42
788	70
282	46
176	32
296	40
128	44
2728	110
200	40
496	56
214	38
68	20
234	34
206	26
294	36
382	38
1124	72
274	50
228	28
568	52
110	30
84	28
308	28
272	38
536	48
144	40
34	26
110	18
162	30
210	34
124	36
598	64
150	30
178	22
196	44
482	54
408	48
62	26
590	64
766	78
434	42
54	14
550	54
314	58
82	26
220	26
164	36
322	46
108	48
48	24
604	50
258	34
234	42
122	30
382	46
242	42
596	38
288	36
678	66
402	62
362	54
108	36
268	40
546	50
144	24
218	26
622	54
208	40
158	26
216	28
274	34
444	40
174	26
176	30
314	34
806	58
116	28
104	28
348	36
278	38
140	22
120	30
56	20
430	46
64	28
382	46
230	42
36	16
808	52
444	48
434	48
354	46
154	30
158	22
328	40
770	58
448	44
216	36
408	52
70	14
312	40
136	36
210	38
334	38
356	56
462	46
104	40
116	28
96	20
350	30
306	42
254	38
142	26
346	46
100	32
92	36
76	28
1100	64
344	32
2350	108
206	44
100	36
252	36
296	44
90	30
324	40
912	64
1286	62
352	42
102	34
572	64
170	38
158	30
54	22
302	26
322	46
1888	84
762	76
436	38
1626	88
930	76
246	34
814	58
740	60
398	50
126	30
742	50
568	40
58	18
48	22
134	22
310	42
360	52
164	32
62	18
582	62
110	26
146	30
148	40
410	40
70	26
228	44
342	46
234	26
474	38
124	40
68	16
246	30
72	28
610	58
2052	78
260	44
154	34
240	52
316	44
28	24
166	34
170	40
138	18
256	40
370	50
924	48
518	54
22	22
230	34
88	28
364	34
172	32
398	50
476	50
204	28
182	28
50	26
446	50
156	28
988	48
122	26
350	56
596	48
158	30
78	26
844	58
478	56
398	46
56	20
728	56
1622	86
454	50
126	34
370	50
136	22
220	32
134	40
396	48
64	16
224	20
138	30
262	46
1164	64
486	60
158	26
160	36
756	64
712	64
776	72
332	40
416	48
154	34
50	18
98	26
1100	72
100	32
234	34
246	42
308	58
290	36
702	68
58	34
38	14
276	40
478	46
672	54
156	32
1168	88
222	46
324	56
252	44
112	42
624	54
642	52
782	62
160	32
806	58
308	42
42	22
162	30
19	7
140	28
110	22
422	54
170	30
120	16
268	32
530	50
496	52
112	26
590	50
338	50
182	46
182	32
974	62
222	22
128	28
362	34
468	52
800	64
942	70
118	26
202	34
112	32
232	44
444	50
396	38
216	44
164	40
184	36
358	40
276	40
314	38
360	44
268	48
148	36
618	66
256	32
366	38
286	50
112	32
890	76
156	24
604	44
92	20
832	62
264	48
144	36
402	32
412	38
416	40
296	28
686	54
190	30
744	60
74	18
230	50
196	36
192	32
190	42
130	22
48	28
620	56
644	48
1138	70
480	40
54	26
48	32
728	66
224	36
68	16
176	32
176	28
96	32
394	44
94	34
494	42
330	42
312	34
606	54
572	40
248	32
518	40
270	36
224	36
706	52
448	44
440	48
150	38
404	36
368	28
38	14
534	54
116	32
64	20
472	36
368	48
262	34
108	28
236	40
382	42
828	64
376	40
264	56
292	44
416	48
1182	68
548	60
328	40
356	52
186	34
304	38
24	24
474	62
812	56
450	54
360	42
136	28
212	36
100	24
240	32
164	40
586	58
114	26
932	68
222	38
508	48
90	30
1396	66
248	48
66	26
98	34
308	46
830	46
242	30
280	32
292	38
266	38
32	16
498	50
320	36
138	30
250	38
76	24
654	54
302	34
182	42
1214	78
104	24
164	32
378	42
52	16
428	48
84	32
812	68
248	44
870	58
222	26
216	38
194	34
492	50
228	32
304	44
442	54
82	30
144	32
98	26
598	46
768	68
86	30
948	56
68	24
84	28
340	32
540	52
78	26
250	34
240	40
74	26
450	38
82	30
78	26
572	56
156	36
496	44
1554	86
464	52
94	34
98	38
565	50
142	30
112	24
98	26
2082	90
142	18
666	62
422	38
376	44
76	24
142	30
552	36
134	30
292	38
276	32
522	48
146	22
136	26
268	40
472	50
130	22
328	32
524	52
790	52
514	62
1382	74
372	28
172	28
422	30
1558	66
576	48
344	44
98	30
514	50
162	30
112	36
526	50
50	14
264	40
128	20
886	68
92	24
206	30
174	50
412	48
112	32
272	36
412	44
558	46
420	52
186	34
306	38
118	34
114	26
522	46
224	36
1302	74
244	32
512	44
450	46
226	26
894	76
208	44
432	32
516	44
726	46
184	44
508	48
446	42
30	22
254	40
74	22
266	46
342	34
356	44
168	40
594	48
328	36
300	44
484	48
1564	92
350	42
1162	84
674	62
584	48
550	56
112	28
308	40
222	22
396	52
92	22
96	24
54	26
162	30
416	60
64	24
274	30
120	44
72	24
198	34
54	30
702	48
152	38
574	60
728	64
260	32
488	56
260	36
844	72
308	44
188	32
60	36
604	52
206	30
432	42
454	58
186	38
692	60
152	24
104	28
102	34
96	32
604	60
622	62
116	28
188	40
236	32
440	36
140	32
732	60
234	34
152	28
88	24
1342	94
326	50
458	54
674	58
752	68
222	34
1022	86
19	7
374	48
82	22
308	46
340	28
338	34
224	42
344	32
118	30
278	38
264	48
196	32
790	68
230	42
122	34
340	46
306	42
438	38
28	20
362	26
62	22
154	38
144	32
164	28
422	50
262	38
290	38
842	66
164	44
196	36
268	44
144	24
160	30
262	26
410	38
186	30
60	28
66	26
352	32
1318	60
114	30
404	40
252	24
332	36
1240	88
158	30
196	30
282	58
260	44
102	26
310	32
914	70
74	22
158	34
288	56
50	18
1020	66
762	54
112	28
186	30
632	56
1346	98
124	32
128	28
878	74
426	50
246	42
168	28
448	56
496	60
94	30
42	18
480	52
140	36
254	34
50	26
182	46
384	52
796	56
142	34
34	22
346	44
320	40
54	30
384	50
24	12
308	40
776	52
144	36
596	52
616	36
392	48
608	48
288	28
248	24
280	34
242	36
194	32
116	40
202	42
256	52
694	50
362	48
1140	68
64	40
148	24
56	24
22	22
186	38
430	38
322	34
170	42
352	28
266	50
370	54
98	30
540	66
132	32
408	44
512	56
602	70
330	46
274	30
666	70
100	30
1156	72
176	40
270	26
78	34
270	52
492	44
156	32
560	60
134	46
266	38
434	48
62	18
216	24
216	40
120	28
184	48
354	42
168	36
372	40
590	54
340	32
170	30
90	26
492	44
210	42
920	68
118	18
302	38
368	32
98	26
124	32
310	50
328	28
110	30
410	46
510	62
170	46
1724	104
202	34
354	46
975	62
304	40
378	34
664	56
240	36
750	50
232	40
58	26
412	44
124	28
484	48
654	46
54	18
134	22
60	36
310	34
282	34
242	30
366	38
90	30
262	36
168	28
354	42
174	38
189	22
188	32
370	46
524	48
160	48
88	24
1536	78
544	52
198	26
266	30
622	52
52	24
256	52
174	42
452	48
142	26
268	28
454	34
298	42
988	72
22	22
92	28
496	56
110	18
346	42
350	46
280	40
386	46
140	44
420	44
78	22
984	48
276	40
266	30
154	32
672	62
716	44
86	26
138	30
198	26
38	30
290	38
318	34
56	32
242	42
444	44
332	42
208	32
452	46
198	34
518	54
476	60
538	42
36	28
244	32
466	58
494	38
194	42
236	36
994	70
362	32
276	40
632	48
310	34
58	22
212	24
474	54
318	38
320	32
278	38
266	42
512	54
96	24
352	40
248	40
440	48
190	38
278	38
302	42
388	44
292	36
806	60
200	32
118	26
1522	82
440	42
816	60
148	20
260	36
156	32
164	32
776	54
250	44
138	26
30	30
98	22
864	56
300	52
330	38
544	56
176	38
76	24
290	34
166	34
484	48
780	64
264	38
120	24
376	52
160	20
396	48
254	26
606	40
746	74
578	52
102	34
230	58
188	40
524	44
446	66
172	32
642	62
660	56
236	32
408	44
552	48
1522	70
236	40
260	40
454	50
324	36
178	34
190	26
162	30
254	46
146	20
252	54
138	26
302	54
70	26
302	42
302	34
182	30
228	36
116	28
260	38
92	24
424	44
594	46
32	24
116	40
688	40
178	38
190	26
42	34
148	20
114	34
90	22
522	48
388	44
406	42
180	36
71	15
286	34
222	38
272	48
156	36
88	32
306	34
240	36
396	40
324	44
194	34
660	48
150	18
198	34
24	24
412	56
106	34
532	44
216	32
340	32
382	46
266	38
122	26
22	22
250	30
466	64
250	34
392	44
252	32
304	32
182	46
132	30
80	24
768	60
116	24
602	54
370	34
524	48
398	38
348	40
278	42
188	36
198	34
48	24
440	30
122	34
416	54
336	44
268	44
274	42
158	22
628	44
220	48
194	30
1982	118
600	52
1012	56
218	34
510	54
364	32
180	40
498	54
260	32
64	20
194	32
312	48
130	18
222	34
350	42
164	32
54	30
106	26
228	36
446	46
120	24
334	38
626	44
540	56
74	22
152	28
154	34
196	36
82	28
322	38
902	66
254	30
120	24
940	68
716	58
778	64
134	34
290	36
1002	52
50	26
1920	78
98	30
136	20
94	34
242	50
202	34
1324	70
654	42
152	20
408	40
642	58
462	46
204	28
592	46
118	26
180	20
696	52
60	40
374	58
94	26
400	44
68	20
156	44
204	28
74	34
122	30
498	32
192	32
1252	70
54	30
126	18
424	60
302	42
540	52
636	56
300	44
282	42
124	36
114	26
240	48
450	50
812	48
106	38
136	32
566	54
422	50
78	26
78	38
444	44
230	42
360	44
470	50
358	42
872	60
384	40
366	42
338	46
264	40
82	30
38	14
110	22
114	18
2042	90
134	34
410	34
254	46
332	36
118	30
306	30
150	30
150	34
3500	122
270	54
470	52
224	32
200	24
804	52
694	66
146	34
296	40
164	32
250	34
58	26
422	46
354	46
74	26
162	34
170	26
948	62
416	44
308	36
290	50
212	26
222	46
682	58
54	30
212	38
160	32
616	44
388	38
452	52
78	22
528	50
132	28
2156	90
252	48
308	36
364	52
1068	60
64	20
240	42
364	44
264	50
132	32
560	64
130	26
264	24
1160	62
1762	76
254	34
316	52
152	32
624	54
346	46
680	52
268	28
320	40
340	48
114	38
166	34
162	22
674	66
322	26
230	26
248	36
268	32
208	28
1092	76
368	44
664	52
138	26
218	42
228	36
268	32
660	56
236	32
138	34
1074	74
406	38
42	22
420	48
162	18
82	24
96	36
86	22
694	50
52	20
732	72
1000	64
444	64
332	32
372	44
320	40
114	22
556	48
740	44
178	34
1006	70
302	50
374	38
308	48
1896	116
124	28
450	54
422	42
570	50
184	32
364	32
32	24
124	36
450	50
44	16
200	32
106	30
506	58
290	40
268	40
292	48
104	40
48	28
196	32
378	44
100	28
230	38
68	28
46	14
428	40
512	46
170	26
152	24
372	42
268	24
72	28
164	32
270	46
986	74
1056	80
84	28
258	46
184	32
316	28
266	38
84	28
200	40
210	38
110	26
120	28
364	42
94	34
384	40
66	22
262	50
966	58
164	32
190	34
88	32
938	76
264	40
84	24
296	48
136	36
96	36
214	34
166	40
662	66
494	50
120	16
3112	92
474	60
148	20
592	52
38	26
82	26
290	34
842	54
234	54
654	38
404	54
332	40
108	16
1056	66
672	58
1194	78
102	40
140	32
374	36
72	32
672	60
314	42
200	24
62	14
840	60
460	40
150	38
636	56
2146	86
56	40
466	38
228	32
456	56
300	40
274	38
388	44
528	38
156	40
330	38
420	44
352	44
286	50
664	66
62	22
300	32
220	32
246	38
380	42
136	28
418	50
116	28
126	36
132	36
116	28
1236	76
494	54
168	36
712	64
202	22
274	38
924	62
620	72
590	50
64	18
1852	90
144	36
168	30
1318	86
408	48
772	60
80	24
720	48
496	54
144	36
857	60
362	34
156	32
294	36
330	54
240	42
238	30
142	30
230	34
324	30
150	30
88	28
418	50
1066	72
150	18
54	14
46	30
72	24
154	30
356	48
190	38
420	56
556	52
1256	84
578	54
204	36
2090	76
122	34
448	40
278	38
68	20
22	22
964	64
2744	124
332	38
770	44
62	26
338	46
242	42
338	26
404	36
388	44
72	28
172	36
202	34
1026	58
302	30
586	54
206	30
250	30
310	32
64	28
336	48
38	26
268	28
112	32
94	42
202	30
500	60
174	18
430	30
104	32
1118	76
252	40
456	44
662	50
134	26
164	44
108	28
218	26
778	58
476	36
168	36
72	24
468	60
470	46
328	32
790	58
130	22
278	28
576	68
568	56
258	38
346	42
216	24
196	48
60	28
30	30
948	84
19	7
138	26
176	44
256	32
840	64
452	52
574	44
200	36
368	40
472	46
264	42
98	28
1774	100
92	24
748	68
368	28
286	46
472	44
342	46
504	28
252	38
394	30
198	32
686	64
156	36
626	42
280	44
390	38
182	34
562	48
96	28
230	30
62	26
66	26
578	54
330	38
266	42
166	30
480	48
354	42
634	62
320	56
582	46
168	28
628	56
202	50
526	42
404	34
68	28
712	56
166	38
436	44
376	48
456	60
60	20
670	54
250	38
492	44
420	50
338	38
278	22
254	42
374	54
96	32
200	28
400	48
264	40
232	48
782	62
170	30
604	48
242	30
298	30
900	66
186	38
290	30
252	36
86	26
666	62
160	28
440	48
516	52
364	52
218	38
136	24
132	36
306	52
564	56
286	34
120	32
678	52
362	52
90	24
268	42
48	28
314	38
94	30
178	40
402	54
254	42
772	68
658	48
542	42
132	36
280	48
226	26
130	38
276	32
126	34
106	30
1034	86
616	64
372	42
694	54
540	60
222	34
354	42
328	32
126	34
158	42
412	40
458	58
70	26
288	40
196	32
166	34
446	46
42	14
274	36
266	46
610	46
1150	80
170	30
68	32
170	38
144	28
1180	74
292	40
106	34
68	24
140	26
282	38
200	28
46	22
352	52
142	22
366	38
186	26
494	54
78	26
118	34
432	48
458	50
170	34
610	48
212	32
92	32
268	40
160	40
426	46
112	24
196	32
220	36
66	26
342	50
802	56
536	48
444	44
160	40
384	46
606	50
138	30
158	38
208	40
774	58
360	52
136	20
616	48
304	52
1114	62
208	40
378	46
164	32
352	40
300	44
522	62
328	46
512	54
148	32
102	26
250	38
94	26
644	52
308	24
1876	68
258	46
170	34
402	54
74	30
84	28
284	40
240	32
272	36
56	24
868	80
94	30
518	58
434	46
68	28
526	60
76	28
448	44
82	22
320	36
56	28
704	44
466	38
170	30
34	14
96	32
1234	76
202	26
176	32
120	40
842	66
306	46
252	36
552	52
204	24
298	46
206	42
74	34
90	26
708	52
246	36
172	28
540	36
78	34
992	64
256	40
152	28
392	44
296	40
290	42
338	40
276	40
116	32
312	28
358	38
146	30
270	38
466	38
246	30
252	24
370	42
384	48
78	30
360	32
386	38
576	40
172	28
518	58
778	70
86	18
392	40
806	50
120	32
900	76
326	26
100	20
110	26
726	60
26	26
92	28
1014	78
332	48
388	40
228	32
266	42
562	42
342	46
528	50
70	22
306	32
268	40
278	48
724	62
1294	76
1992	88
206	38
186	38
338	36
420	48
328	56
326	46
160	32
112	24
280	48
380	48
110	26
402	34
156	44
174	26
898	60
350	50
54	22
200	44
620	52
42	14
268	32
614	58
118	26
198	34
19	7
328	40
60	28
230	42
60	32
428	40
622	50
636	48
182	38
38	22
358	54
558	58
120	28
158	22
316	46
292	32
256	44
430	46
2224	102
146	30
360	40
394	48
192	40
340	28
692	44
356	52
210	22
110	34
56	24
316	44
288	32
674	70
216	36
132	32
434	42
158	38
338	50
152	28
78	18
260	40
250	42
222	32
334	42
344	52
232	44
780	56
468	64
210	38
1028	60
358	30
928	60
68	24
232	30
760	64
300	40
84	16
408	40
1382	68
504	52
546	54
136	28
798	70
220	32
832	52
104	24
540	52
468	48
312	42
208	34
150	42
320	40
336	52
372	32
62	30
1034	78
264	36
160	20
502	62
968	68
206	42
1028	68
102	26
190	34
644	68
112	24
278	36
568	48
830	66
382	50
236	36
150	26
352	52
668	48
412	56
154	38
760	62
146	28
1068	52
194	42
84	40
112	16
186	42
304	44
370	50
118	18
58	22
340	48
572	60
640	54
468	36
112	36
92	24
312	40
114	26
1424	80
256	40
30	14
650	52
94	22
466	46
282	42
742	64
464	40
140	42
624	50
156	36
19	7
818	58
746	62
54	26
208	32
462	54
222	42
362	46
632	60
812	60
112	20
540	56
274	38
180	40
154	46
1038	58
301	21
266	26
566	62
232	36
206	38
416	48
138	30
606	48
294	42
324	36
132	24
636	62
390	46
970	68
228	36
38	30
636	52
198	48
202	24
100	28
588	48
204	40
1075	66
1006	64
682	66
454	58
2280	84
282	42
376	52
216	44
422	50
322	42
848	64
552	40
168	36
48	32
422	44
1182	50
616	60
214	42
64	40
186	30
86	34
366	50
2044	108
516	68
216	36
148	48
544	52
40	20
42	18
800	64
250	34
264	32
374	54
558	52
226	26
170	26
154	42
244	36
212	36
808	70
944	62
108	36
1926	94
110	30
1166	68
212	36
1060	70
452	48
330	44
66	18
420	40
158	38
84	36
328	44
284	28
312	40
244	36
120	20
316	38
876	60
19	7
672	64
170	30
510	50
2078	74
664	60
174	38
1348	72
36	24
1084	76
224	36
388	56
336	44
772	60
314	48
280	36
252	40
576	60
310	46
128	28
618	50
136	32
174	34
536	48
160	30
524	40
528	56
200	40
356	36
42	14
206	42
386	46
162	30
74	26
194	42
1044	62
110	26
350	50
140	20
274	38
158	32
548	64
366	50
300	28
328	44
468	52
372	52
276	46
118	30
176	34
500	40
348	52
184	28
252	32
390	38
276	32
774	60
200	36
282	42
940	62
200	44
684	54
80	20
232	40
326	54
292	44
330	50
136	24
218	34
556	48
1114	82
612	48
458	54
560	64
192	28
412	50
212	36
648	60
430	50
934	66
994	62
510	58
268	36
730	54
72	24
696	48
488	44
528	52
652	60
140	32
402	50
472	40
114	22
646	54
1350	96
168	38
288	34
438	54
542	50
46	22
326	42
390	46
986	80
30	16
292	32
318	26
902	62
484	48
656	64
216	44
106	26
196	28
864	70
436	54
220	40
286	34
486	38
146	34
372	62
460	44
224	40
404	44
278	46
654	64
426	46
370	46
752	52
428	44
248	32
128	32
146	26
140	36
1072	76
96	28
154	30
250	46
318	46
294	38
570	46
220	36
98	26
240	48
412	36
180	28
40	12
86	34
432	52
562	62
368	44
134	42
152	36
1616	88
476	48
298	42
270	52
286	34
764	64
98	22
30	14
154	26
636	56
270	40
40	16
234	34
1056	92
342	38
72	24
126	38
522	54
204	32
124	28
44	28
342	38
150	30
3146	120
212	36
24	24
246	46
76	28
366	42
514	50
644	52
224	56
92	36
672	60
302	38
78	26
1180	76
1246	72
306	28
224	36
676	64
136	48
246	34
114	26
132	28
702	54
98	30
416	34
436	48
92	28
580	52
744	44
330	46
1448	74
870	74
158	46
276	40
46	22
122	26
146	26
1700	78
374	42
272	36
442	46
356	44
312	60
186	34
232	40
418	44
182	34
362	34
1010	62
328	36
676	58
422	34
416	36
306	32
212	36
190	32
236	40
86	18
208	40
390	42
938	62
146	30
146	30
268	36
576	68
170	34
208	36
466	46
310	42
706	54
378	34
174	50
162	34
50	26
264	40
188	34
84	36
358	34
306	58
36	24
684	70
874	70
344	28
338	50
60	20
220	32
338	34
190	30
510	46
246	44
124	32
50	18
332	44
34	14
166	38
252	36
32	24
932	76
354	42
180	24
186	38
338	34
618	54
80	20
1064	84
38	18
278	34
102	30
338	30
318	36
332	36
50	18
74	30
404	48
170	32
200	36
290	50
244	32
206	34
142	18
84	28
514	50
752	68
1384	86
274	38
110	34
38	22
398	50
154	30
224	34
82	18
502	42
526	34
142	22
368	28
256	40
546	66
370	42
92	28
196	44
680	60
348	40
200	40
224	32
200	40
552	56
140	32
174	30
624	52
230	38
962	78
366	48
180	28
416	48
320	36
1316	92
204	32
228	44
52	28
270	42
474	42
72	20
1592	98
32	16
870	56
390	58
520	56
580	72
304	40
230	46
638	50
190	36
312	28
180	32
248	40
316	52
408	44
172	32
202	30
360	40
402	56
348	40
610	54
918	66
440	52
792	60
110	22
94	34
378	34
928	74
250	46
404	40
1064	68
604	56
176	40
456	48
204	44
212	32
6176	146
126	26
348	40
304	42
534	66
226	46
170	46
322	46
206	34
372	56
710	58
414	44
34	14
314	30
108	28
436	56
1050	66
280	42
292	32
216	28
22	22
184	38
340	48
88	28
104	32
1270	74
192	36
338	34
104	32
684	44
184	32
480	50
166	30
276	36
496	48
100	28
462	48
78	26
512	44
724	44
238	46
80	22
270	30
2114	98
194	34
402	46
670	50
186	30
268	36
36	20
246	38
184	36
34	26
30	30
858	54
524	56
86	38
732	48
144	24
332	28
898	60
238	34
300	48
1246	76
488	56
568	48
730	64
56	20
566	52
108	28
192	32
110	30
358	52
176	32
452	44
174	38
252	40
164	32
84	28
144	28
80	24
602	42
1014	66
228	36
1862	80
474	40
470	42
636	54
312	36
422	54
642	50
82	22
126	34
192	36
668	60
300	30
1082	62
154	30
170	38
484	52
80	28
296	42
140	40
302	38
208	24
96	40
92	20
268	32
208	32
288	34
108	32
322	46
84	24
430	42
196	40
316	40
58	18
74	26
172	40
1212	64
356	34
248	32
526	50
112	32
384	28
258	50
2214	102
218	42
184	40
782	54
198	36
564	50
66	22
254	38
440	56
74	26
216	46
582	42
160	40
692	54
484	56
314	38
234	36
192	26
512	38
132	20
186	34
40	24
156	36
612	60
144	32
346	42
196	36
350	50
380	44
608	52
312	48
458	54
132	28
74	26
182	42
174	30
318	34
186	38
68	24
452	42
134	30
708	68
492	52
166	30
326	54
768	56
528	50
318	50
260	32
380	44
406	46
380	60
528	48
128	34
322	54
340	48
182	30
622	44
252	38
1396	80
310	38
554	50
680	56
46	22
120	32
106	22
648	62
158	26
370	34
236	32
108	24
352	42
28	24
380	40
312	36
706	50
272	28
164	36
232	44
1216	86
98	30
408	44
164	36
230	38
336	40
652	48
152	32
530	56
430	38
220	32
322	38
460	40
396	44
188	24
820	80
92	28
222	42
94	38
198	34
300	52
180	28
624	52
156	40
384	52
422	42
208	24
124	40
278	42
78	22
344	52
228	32
276	44
352	44
44	24
166	34
472	48
580	72
102	30
206	30
820	68
612	62
340	36
172	44
400	52
296	42
942	62
278	38
160	32
158	18
734	58
378	34
92	20
326	54
456	48
54	14
118	30
92	20
236	38
178	32
578	58
254	34
114	34
194	34
444	48
82	26
376	48
168	36
86	26
384	56
78	26
368	56
292	36
322	42
202	38
406	42
170	38
1020	78
78	18
344	44
62	18
234	48
214	38
744	52
1008	64
382	50
232	48
798	70
128	32
634	58
304	40
172	44
342	38
408	40
346	30
324	44
832	56
314	38
282	26
146	26
1142	72
132	32
78	30
46	22
338	50
442	50
454	46
1156	84
54	14
276	40
84	20
144	44
246	58
360	40
262	42
426	46
150	34
374	36
894	64
660	60
110	28
100	32
338	22
194	26
516	52
150	26
170	38
148	32
2082	90
210	30
170	34
810	66
796	68
240	32
278	30
420	56
480	46
1356	84
52	28
56	32
188	36
114	18
298	40
130	30
318	38
114	34
550	58
166	42
158	22
134	32
502	48
698	62
136	24
568	60
124	28
416	44
728	66
360	48
38	14
216	36
234	30
216	40
112	32
916	72
42	22
96	28
196	34
448	34
590	46
134	22
106	30
224	44
586	54
348	40
216	36
162	32
210	38
310	40
132	36
98	34
1042	70
90	34
210	38
200	36
248	48
120	36
68	30
336	48
154	34
206	34
1216	84
254	44
288	42
26	22
436	44
356	52
782	70
200	52
114	22
46	22
108	28
19	7
1010	58
350	38
278	42
978	70
196	36
166	46
556	64
564	48
598	58
370	54
144	32
56	32
764	44
80	24
24	24
104	28
90	26
122	26
136	24
182	38
400	42
76	20
40	24
676	48
70	30
406	30
560	52
602	62
634	56
320	36
300	32
208	40
436	50
152	24
292	52
668	54
676	44
104	24
522	66
215	50
594	48
240	40
68	24
484	44
542	56
418	38
226	34
1420	88
414	58
330	42
138	30
642	58
324	32
402	50
830	58
174	30
46	22
242	34
1110	58
218	42
262	34
244	44
258	34
56	24
374	40
3428	120
300	44
19	7
118	18
122	30
104	32
66	20
252	44
450	54
90	30
476	28
356	36
78	30
370	58
630	66
102	38
634	60
636	48
446	50
186	38
572	66
560	44
222	42
1102	68
64	24
718	64
908	72
840	68
620	48
114	22
54	18
58	34
314	38
156	28
400	56
964	66
332	56
406	46
46	14
154	30
722	62
138	34
570	48
482	46
134	34
452	44
354	42
544	48
19	7
692	64
238	26
296	30
616	52
318	34
942	66
96	32
226	38
402	44
168	36
384	56
58	30
154	34
112	36
200	32
84	20
142	30
322	30
86	26
1848	80
568	52
642	46
454	38
568	48
176	28
92	40
828	64
582	36
770	62
450	42
1264	84
194	30
288	48
376	42
78	30
668	58
544	44
218	40
842	66
346	42
656	48
882	46
200	32
46	22
52	20
76	16
152	20
1368	88
232	26
120	32
280	40
326	40
299	32
578	64
1312	78
552	50
276	48
194	42
56	16
520	52
686	54
192	44
342	42
104	32
226	36
190	34
184	44
406	46
66	22
1210	82
168	24
138	30
256	44
372	40
332	38
634	52
756	68
358	34
1480	76
414	38
382	40
1498	90
426	42
282	30
350	38
860	60
52	28
60	28
300	48
596	44
292	50
380	50
470	38
146	26
144	24
634	58
768	72
514	50
130	34
1018	70
218	38
178	38
120	36
254	36
743	78
820	60
204	36
510	46
1688	78
536	52
412	50
324	36
76	24
1231	80
734	62
86	30
220	34
72	18
92	28
430	66
374	30
68	36
400	32
34	14
164	24
292	40
112	28
290	38
136	16
1014	78
1342	72
266	32
258	34
122	30
1312	78
106	34
242	34
850	74
294	22
72	24
384	62
794	46
276	48
512	68
1084	70
166	30
390	42
640	48
312	40
472	52
520	36
262	22
494	56
206	38
36	28
118	18
112	20
220	40
280	28
54	26
186	38
444	60
390	38
592	54
920	70
350	22
222	46
452	60
170	28
194	30
132	32
642	52
1032	44
314	30
230	30
102	34
416	36
366	34
1032	72
192	40
124	20
268	32
492	52
732	48
262	34
238	50
446	54
374	50
72	32
366	42
104	24
316	40
460	56
564	50
1410	58
420	48
204	32
96	32
300	44
252	32
444	54
210	34
466	38
934	54
134	26
80	26
374	32
19	7
66	18
620	60
54	14
920	54
184	36
284	36
830	70
166	36
366	50
98	38
310	38
134	34
200	32
380	44
1172	76
402	54
188	32
140	36
282	46
190	26
288	46
440	52
116	36
78	18
78	22
326	48
268	44
748	60
1150	72
468	56
180	24
664	50
182	32
800	60
624	40
1486	86
160	32
344	36
190	42
158	50
386	42
398	42
680	52
144	32
76	28
226	38
96	18
270	40
508	44
228	36
384	32
324	48
308	36
178	26
264	24
478	50
214	34
972	56
980	72
248	36
224	36
776	46
496	48
138	38
146	30
314	46
534	50
182	34
524	46
182	38
302	42
250	34
250	30
78	18
494	42
132	40
508	56
108	32
528	56
260	36
88	32
86	22
154	26
124	24
264	32
960	56
82	30
70	30
56	20
268	40
304	46
274	42
96	20
356	36
308	38
434	50
196	40
332	48
408	44
612	56
576	60
488	56
464	38
844	72
380	44
288	36
1222	82
122	34
64	28
430	54
24	24
560	56
350	30
560	64
522	52
554	52
318	38
128	32
172	28
394	34
370	46
126	30
216	28
332	36
134	34
288	48
278	42
482	42
666	54
180	20
388	38
104	28
104	32
300	32
468	52
118	30
19	7
532	48
240	32
64	28
188	32
262	38
166	34
316	40
462	56
72	20
628	64
130	30
2020	88
1166	78
136	32
314	38
218	42
258	38
199	26
208	30
764	64
194	26
470	50
300	44
54	30
130	26
118	30
406	38
302	38
76	24
884	56
68	32
960	74
118	38
876	52
288	36
106	26
636	58
166	34
60	20
1110	84
548	48
272	44
118	34
156	32
134	30
134	34
184	40
70	26
240	36
790	50
98	34
146	30
72	30
110	26
916	72
250	42
268	40
166	38
164	30
184	28
204	26
352	40
188	28
268	42
344	44
334	48
260	24
68	24
192	40
670	62
298	38
182	32
496	32
106	38
1992	96
36	28
1506	66
280	40
292	36
162	26
662	56
108	36
236	38
146	42
78	26
196	28
386	38
254	42
506	46
260	36
674	50
158	34
322	38
298	42
68	30
164	24
740	54
408	50
510	46
764	60
638	62
64	28
644	60
354	46
160	40
872	56
316	44
166	26
232	40
298	30
126	30
526	42
862	60
184	40
162	30
308	32
156	28
402	42
238	46
80	28
272	36
108	28
224	34
474	50
146	32
120	24
382	46
594	62
134	34
456	56
304	44
206	30
484	52
382	38
234	30
216	36
314	30
138	30
288	36
362	38
86	26
156	28
134	40
134	34
126	26
172	38
218	38
324	44
150	30
192	32
306	38
384	40
120	20
674	40
154	26
98	26
176	28
258	38
2314	106
78	26
628	54
260	40
50	22
822	66
286	26
214	30
208	32
118	30
34	26
672	60
594	50
774	54
676	58
416	48
320	56
1024	58
322	34
342	38
298	46
1246	72
478	50
248	32
1038	66
146	30
86	26
56	32
128	20
396	42
248	32
110	34
730	62
470	34
328	36
602	46
98	30
156	36
170	30
80	24
296	40
116	40
792	52
66	18
328	32
184	28
414	40
230	38
212	36
1046	70
46	30
130	34
62	18
334	50
54	18
152	28
622	56
480	38
68	28
220	32
768	60
170	38
68	28
882	62
1234	74
202	34
338	34
288	40
194	30
184	32
216	32
804	46
198	30
54	22
444	52
68	28
2158	94
686	62
676	48
330	42
148	28
38	30
1266	74
114	26
144	28
108	36
166	42
134	34
334	42
48	24
296	36
760	60
206	34
54	22
1650	86
688	56
72	24
116	44
266	34
504	62
106	30
724	56
682	58
292	32
898	54
404	36
568	48
262	38
164	28
356	56
500	38
138	38
376	48
214	46
486	66
1346	74
308	36
252	52
1132	54
452	52
244	40
88	28
86	30
278	46
402	30
194	50
448	44
154	32
36	24
242	30
902	54
42	22
426	34
62	22
176	36
172	36
958	66
102	42
316	36
698	62
40	24
90	26
370	26
172	40
110	26
152	32
266	42
248	38
196	32
334	50
180	28
152	32
632	52
674	60
120	30
164	24
98	24
60	20
70	26
112	32
214	38
382	38
342	34
414	32
508	56
56	16
350	34
288	44
680	72
306	38
678	58
642	66
216	32
778	72
480	62
174	30
350	38
408	44
222	42
366	42
42	22
264	28
532	60
308	40
134	26
378	38
158	26
308	40
314	34
138	30
138	22
214	38
462	46
462	54
354	38
144	28
184	32
366	34
274	22
194	28
46	22
604	32
56	20
170	34
136	32
152	24
922	62
234	30
68	28
48	32
128	24
450	42
180	32
92	24
770	66
1020	80
68	24
354	34
290	28
670	78
390	38
94	26
444	56
548	50
366	44
340	48
182	30
304	34
194	30
406	42
228	40
766	52
88	28
964	60
1324	76
314	30
794	62
532	60
156	48
622	46
354	46
226	38
646	54
122	22
1008	60
274	38
584	48
176	44
148	28
648	54
516	48
594	62
172	30
1778	78
348	52
188	40
784	64
252	40
222	42
302	50
438	46
26	14
84	32
334	38
840	64
398	50
332	34
136	32
280	52
386	50
258	22
734	66
642	52
238	26
364	38
1026	78
406	58
248	48
230	58
698	66
374	46
856	72
526	54
244	36
140	32
178	26
234	30
298	42
602	42
404	52
662	48
98	34
208	36
46	22
322	34
1882	90
90	30
1774	74
228	32
678	58
782	78
100	24
150	26
160	32
324	36
54	30
192	28
204	28
294	34
434	42
48	16
134	30
96	32
452	44
798	64
236	36
154	34
434	44
288	36
128	32
550	38
284	44
780	54
38	30
130	34
688	64
36	24
278	38
294	38
742	66
1920	84
1226	72
278	42
222	34
368	40
392	56
238	22
558	46
852	64
46	14
64	20
1168	90
504	52
484	64
1356	74
246	34
1248	90
246	46
350	26
384	40
306	22
264	28
176	36
234	34
420	48
128	26
240	36
240	38
70	30
854	70
608	44
420	44
314	34
140	20
508	60
578	52
1386	94
442	48
86	18
544	52
788	52
492	36
464	44
174	30
158	34
124	24
266	34
308	48
154	22
444	56
70	26
88	20
240	24
212	36
544	60
158	30
448	52
56	24
168	32
236	42
786	56
440	52
90	34
246	38
474	48
402	58
150	34
1064	66
3480	114
518	54
282	26
210	42
200	40
214	50
1168	68
124	28
150	30
280	44
52	16
328	34
444	48
426	46
120	20
136	28
1494	98
130	22
60	32
394	58
680	50
662	56
454	54
52	28
104	24
1020	48
1580	84
124	40
264	32
68	22
80	24
70	30
120	32
392	48
104	32
100	24
488	56
956	76
652	52
114	46
1228	64
60	36
120	32
290	26
46	22
300	28
352	40
446	42
330	46
304	40
268	48
190	38
1442	76
722	60
292	36
638	66
438	54
78	34
216	40
204	40
270	30
500	66
230	34
666	50
344	56
98	34
178	36
98	34
416	40
538	48
230	30
576	70
1926	110
174	26
142	30
80	28
736	52
240	40
80	30
188	40
258	38
310	38
198	38
108	28
192	34
102	30
212	40
378	54
286	46
420	50
494	42
108	16
452	36
104	28
280	28
406	54
174	38
340	36
196	28
398	28
206	34
618	34
566	58
66	26
366	46
158	38
74	18
392	44
234	26
272	36
378	40
264	32
590	62
212	40
276	48
896	60
156	28
656	56
798	58
72	24
46	18
136	44
226	38
38	16
272	52
476	40
780	64
784	58
116	32
218	38
114	32
300	44
100	24
70	26
182	30
240	44
94	22
124	20
74	26
670	74
146	38
372	28
214	34
252	32
194	24
52	28
282	54
348	40
52	24
522	58
380	48
492	52
184	36
686	56
368	36
630	56
278	38
634	66
454	46
68	24
710	60
92	28
142	26
264	40
238	34
272	32
484	40
142	34
462	46
248	36
166	38
102	26
324	30
174	42
200	40
204	36
420	44
364	52
94	26
850	60
724	64
128	28
198	34
192	32
248	40
1160	56
310	34
256	28
630	54
232	44
124	36
266	42
96	32
290	38
246	38
60	28
146	26
40	24
248	36
724	68
102	30
50	26
302	34
302	42
238	42
332	36
634	54
124	38
462	50
766	52
50	14
386	30
204	36
1044	76
112	28
372	40
356	46
440	56
1664	100
540	56
498	34
150	22
24	24
894	66
430	46
492	60
1170	74
146	30
316	44
480	50
190	26
456	48
294	54
228	34
196	40
206	30
84	28
186	30
388	40
294	50
538	62
210	38
42	18
846	72
340	42
176	44
134	32
318	46
448	42
744	60
334	42
1550	78
800	58
156	30
222	26
192	36
244	42
78	22
444	44
702	58
158	34
1322	76
118	26
258	42
190	30
38	26
792	54
716	56
1264	84
684	52
912	56
354	46
134	30
210	46
304	40
310	42
48	24
194	26
338	42
298	42
48	20
120	32
344	48
308	32
610	46
512	48
292	56
490	60
840	68
476	44
230	40
188	36
504	44
26	26
210	38
336	36
344	36
300	40
38	30
300	40
1204	84
292	40
2074	90
96	32
148	28
314	40
306	50
538	42
582	54
92	36
942	72
416	52
156	32
450	42
2044	100
336	40
214	38
332	40
100	36
714	56
196	28
282	34
396	48
136	32
340	40
264	36
96	28
290	40
742	58
84	28
134	50
442	36
1515	86
316	48
322	42
66	30
156	32
104	28
236	36
76	36
154	38
618	70
254	44
162	30
120	32
90	34
542	50
162	26
218	34
272	40
224	36
616	60
182	38
334	50
486	46
186	26
362	50
836	64
474	30
210	34
26	26
144	40
88	36
954	76
462	50
846	54
722	56
292	36
314	44
264	36
612	62
156	40
676	54
336	30
320	48
134	30
184	40
78	30
884	60
1094	70
220	36
678	62
178	38
656	56
558	58
860	52
498	54
186	38
310	42
782	46
360	44
100	28
348	40
924	68
268	44
320	28
340	48
1084	52
242	38
338	50
212	34
78	30
628	48
726	54
340	34
178	22
40	24
188	44
252	36
128	28
306	42
896	64
414	54
496	36
19	7
180	40
220	36
478	48
276	48
244	22
372	36
304	40
464	52
190	30
202	38
558	54
134	26
386	50
226	30
678	60
152	40
56	26
138	30
562	66
200	32
502	48
690	46
256	36
150	32
588	60
236	28
60	28
792	80
60	20
198	30
972	60
698	50
350	38
632	46
348	48
412	48
116	36
278	22
128	20
96	36
212	40
344	36
404	36
590	58
132	24
310	38
598	48
466	46
248	32
404	60
468	36
172	22
19	7
100	36
314	38
158	46
776	60
296	40
196	36
624	40
1112	72
102	28
206	34
808	52
942	70
88	24
298	34
66	22
228	36
196	30
116	24
638	72
168	28
1384	68
424	52
506	50
152	36
72	28
66	26
134	26
306	44
472	46
762	54
472	52
416	48
518	46
196	36
206	34
224	40
392	44
198	34
78	22
212	38
174	34
110	26
488	48
1386	72
90	34
786	62
354	50
298	54
202	46
230	34
354	46
548	50
318	42
376	32
70	22
68	24
390	46
708	56
128	28
1098	84
418	34
1166	70
290	34
166	46
564	52
146	36
76	24
174	30
182	30
580	44
192	32
672	60
320	48
472	56
358	42
208	36
274	30
140	24
68	20
384	48
46	22
966	64
218	38
358	42
66	22
318	26
1010	68
348	40
72	28
168	38
222	42
208	44
300	40
86	26
60	20
442	50
292	32
118	30
190	36
84	24
112	28
458	46
86	34
34	34
410	30
34	26
1308	68
562	52
132	32
208	36
890	60
434	46
634	58
1192	64
514	48
224	36
254	38
98	46
468	56
68	24
256	36
762	58
852	48
504	56
410	54
134	34
396	44
158	22
80	24
460	60
82	26
786	78
254	38
530	46
174	34
716	60
440	60
512	52
456	44
490	46
1954	76
252	32
764	60
272	38
368	38
1940	88
48	28
412	44
974	78
388	40
870	62
388	40
356	44
762	50
348	44
348	52
96	28
628	42
1608	78
836	68
118	34
664	64
162	26
334	42
2184	104
780	50
342	42
46	34
166	38
250	34
132	28
284	36
436	46
78	30
970	60
528	52
440	38
408	40
532	60
80	24
162	42
218	50
72	24
112	28
1100	80
78	30
118	38
176	38
332	40
968	70
538	50
328	40
334	30
428	36
182	30
1432	64
54	18
64	32
258	22
314	42
96	32
124	32
116	32
730	66
338	48
314	34
392	40
926	62
282	42
990	66
172	24
296	40
588	56
470	54
252	32
316	36
98	26
204	40
600	72
170	38
214	30
112	32
160	32
254	30
132	32
306	42
546	42
122	30
168	24
1604	74
378	42
410	50
506	54
552	52
42	14
52	28
406	50
664	52
50	26
954	86
214	42
442	54
554	66
532	36
314	46
102	30
82	34
290	38
216	36
346	54
588	44
68	16
300	40
234	34
878	54
230	38
794	78
264	52
154	34
704	62
258	32
210	34
926	66
86	18
272	28
200	32
286	42
336	48
304	44
274	30
950	52
482	48
300	40
90	26
388	56
142	34
690	70
292	40
204	24
242	34
36	28
308	38
216	32
124	20
200	26
714	58
90	38
278	34
274	42
660	64
624	52
466	38
530	60
758	58
218	34
160	32
230	34
298	34
732	56
380	44
666	52
912	58
216	36
90	22
74	18
672	68
438	46
194	34
316	36
108	16
128	24
150	26
836	56
874	48
128	32
614	54
836	58
484	66
212	44
212	32
144	32
182	30
604	36
228	52
336	38
164	24
1136	68
1904	100
366	50
258	46
506	46
408	26
334	46
358	62
152	24
148	32
432	60
512	58
256	30
194	34
246	42
194	34
1092	64
2656	106
554	60
150	38
66	26
484	54
1006	76
54	14
390	40
206	34
756	60
144	24
304	40
140	40
272	36
862	82
28	24
102	30
1046	52
1276	54
32	24
194	30
260	34
228	28
142	30
552	44
522	50
340	48
502	54
672	52
122	30
274	42
324	36
508	56
1210	78
342	34
120	28
414	42
94	30
184	40
36	24
458	54
184	32
50	34
136	28
1894	94
192	20
424	40
210	34
494	42
122	26
230	42
78	30
110	34
772	66
196	28
514	50
170	34
216	28
466	62
942	74
334	34
34	22
258	30
228	36
326	50
156	20
180	32
432	44
156	32
58	26
244	38
48	28
626	58
1022	66
30	22
100	32
634	54
260	36
354	46
502	58
40	24
126	32
340	66
48	24
450	40
1166	70
78	22
54	30
162	30
288	44
284	46
190	38
344	44
230	38
624	60
124	24
352	40
52	28
286	34
38	38
1194	68
108	36
362	42
206	34
214	22
1836	100
90	30
76	32
32	20
42	30
206	46
236	40
512	54
232	32
710	58
130	30
442	58
216	40
302	30
194	38
200	36
148	36
484	48
412	54
316	44
140	30
230	34
348	44
1330	74
390	38
212	24
394	38
50	30
74	30
48	16
148	40
552	44
200	32
132	32
340	44
126	26
2228	92
430	48
260	32
260	48
504	36
632	44
178	26
102	30
528	60
254	30
816	56
678	58
72	32
532	56
598	50
48	24
164	28
56	16
1190	72
236	52
188	32
626	54
300	48
54	14
476	48
98	34
256	36
842	58
140	36
152	32
890	54
1452	84
194	38
290	46
602	48
1234	76
150	42
140	28
142	30
284	54
614	58
174	42
308	40
272	40
170	44
668	60
408	32
228	28
126	30
292	30
342	46
196	36
538	70
612	48
692	70
342	50
434	36
104	28
226	34
526	48
344	44
1780	76
412	48
624	60
248	34
286	42
800	48
548	64
70	26
166	30
226	30
606	38
300	32
434	44
208	36
838	82
226	30
130	26
904	80
358	46
310	38
230	38
114	22
610	58
32	32
130	42
196	40
2612	102
338	38
78	26
68	18
88	32
170	30
410	50
416	44
96	24
308	52
260	28
118	30
174	22
268	44
572	42
62	18
370	54
102	30
810	52
402	50
338	34
214	42
226	34
64	32
902	56
580	68
210	38
272	32
220	32
1744	72
192	28
238	26
650	56
472	52
100	28
50	18
642	48
254	38
428	34
488	64
452	52
86	34
352	44
350	46
70	26
242	38
1038	76
562	58
208	32
170	34
296	34
268	40
110	30
224	40
212	32
52	24
574	58
270	42
74	26
1318	74
70	14
322	38
112	36
3450	114
506	38
150	54
1290	78
36	28
586	52
454	30
502	62
542	58
978	60
764	60
32	24
76	32
346	46
198	36
100	32
684	44
106	26
166	34
342	38
332	40
374	44
64	32
140	28
162	22
242	42
646	58
256	32
340	44
90	20
622	38
1020	80
1120	68
70	18
182	26
1968	82
1518	94
190	42
62	22
112	24
1084	68
802	48
144	32
30	14
406	36
396	46
276	52
306	54
54	38
260	40
156	40
86	26
88	48
156	24
548	48
132	24
142	26
220	24
146	26
244	44
472	48
492	40
540	44
34	26
1064	58
192	24
382	38
162	34
220	40
448	36
370	42
1186	74
126	34
594	46
336	40
260	40
214	42
464	50
144	32
362	42
86	18
192	32
474	50
606	54
588	48
1272	76
42	30
42	26
846	78
278	38
156	32
176	40
278	34
152	36
19	7
148	20
182	42
86	38
19	7
304	40
102	26
122	18
176	40
70	38
432	40
90	30
86	34
102	30
892	60
330	28
1176	80
146	34
538	38
19	7
706	52
166	38
1430	70
368	42
318	42
192	32
290	38
160	40
80	24
438	54
306	38
564	48
348	38
184	40
296	40
168	36
286	54
94	22
80	28
262	32
1138	70
282	50
88	24
138	38
664	56
66	38
192	36
180	32
84	32
228	32
38	18
594	58
36	20
302	34
212	36
498	46
398	34
246	34
172	26
406	38
220	40
976	72
196	32
424	52
104	32
392	40
598	46
260	36
442	46
158	30
84	26
532	46
214	34
678	58
884	64
180	34
826	66
138	34
460	52
178	32
114	26
162	38
76	32
290	38
328	38
232	40
402	42
484	48
336	36
172	38
314	48
1046	70
230	42
428	36
70	32
622	62
586	44
162	34
236	28
202	46
618	66
930	50
1374	76
1330	78
114	26
94	30
232	36
246	34
634	64
298	42
22	22
310	30
52	20
608	44
212	24
382	46
292	36
246	26
1072	56
532	36
266	46
306	38
236	34
276	52
538	34
154	34
230	38
148	20
280	36
162	30
1750	76
124	36
218	46
560	48
624	48
704	44
3998	116
520	44
986	54
942	58
1468	82
326	46
166	26
488	40
172	32
2616	120
22	22
344	48
392	40
96	36
438	62
868	68
272	44
524	48
216	36
272	40
164	24
164	36
216	32
672	58
664	60
538	56
38	30
486	46
782	54
174	30
362	54
50	22
224	36
496	44
130	46
22	22
308	36
250	38
268	36
316	50
533	52
172	32
822	58
166	30
404	36
246	38
222	38
324	32
130	18
594	46
120	28
346	34
394	38
222	42
84	28
280	42
472	52
368	52
232	28
222	32
92	28
126	38
166	30
172	36
234	38
206	38
134	34
198	36
834	70
148	20
528	52
570	50
52	20
516	62
504	50
98	18
394	54
480	48
332	32
130	26
836	62
60	20
170	30
212	44
274	38
114	26
366	38
228	32
850	58
1088	60
58	22
426	38
160	28
128	24
676	38
164	36
284	40
540	56
80	40
280	44
668	48
172	32
58	18
516	46
258	42
104	36
402	46
270	26
400	48
398	30
220	32
420	40
424	44
24	24
310	42
372	42
1656	92
568	44
68	24
656	52
564	44
148	28
216	40
116	28
370	40
248	40
236	44
232	38
890	54
46	22
544	60
364	44
552	44
336	44
248	40
338	26
544	50
1310	60
168	28
254	42
296	44
922	64
112	28
364	44
688	60
366	32
536	44
572	42
302	38
19	7
626	46
202	34
126	34
224	36
858	68
1722	86
398	54
1006	62
562	42
358	54
456	52
66	30
816	66
646	62
76	28
198	30
474	42
664	42
208	52
336	32
212	34
1682	70
192	32
552	48
1732	74
858	68
112	36
120	28
378	50
324	48
1132	80
1798	80
292	44
392	48
344	46
646	54
268	48
182	34
268	30
582	80
284	40
92	24
36	24
256	44
226	46
704	52
352	34
202	30
898	66
154	30
286	42
440	40
44	20
122	46
1152	80
582	58
1386	86
240	40
74	30
586	50
344	28
108	32
42	18
284	36
114	26
66	38
560	52
570	62
574	50
110	34
814	58
210	42
650	58
182	30
52	24
144	36
346	50
518	58
78	18
436	36
350	38
432	52
22	22
142	30
100	40
98	26
438	50
1646	72
110	38
140	40
632	64
178	50
628	58
152	28
762	62
170	38
342	46
444	56
286	46
58	18
246	42
1116	74
208	40
88	32
556	44
352	40
206	30
366	32
330	42
120	36
660	68
378	38
438	38
1212	72
902	70
300	36
604	48
402	38
226	46
332	40
222	34
188	36
142	30
94	30
210	26
490	54
1040	80
86	30
560	48
922	62
274	28
162	46
238	54
102	32
272	32
98	30
486	66
130	22
1770	76
1082	70
808	56
274	38
286	42
526	46
182	34
142	30
966	74
294	38
264	40
78	30
684	56
418	42
168	40
138	22
1004	84
228	32
1126	72
282	38
184	40
322	40
260	52
330	44
858	74
296	36
208	36
364	48
346	38
524	60
164	32
284	20
314	50
262	36
470	34
512	56
1474	86
56	16
380	48
288	36
424	36
490	50
112	36
154	30
242	34
414	50
464	42
266	32
450	42
52	24
1360	56
558	70
1056	68
58	26
144	32
372	36
100	40
236	40
146	38
116	28
972	58
256	44
252	36
22	22
234	38
208	44
100	28
184	32
1104	74
1102	70
268	46
1094	68
70	26
62	26
164	26
514	38
402	38
772	64
19	7
182	38
370	38
118	34
724	56
718	54
104	24
254	30
412	52
118	30
480	52
256	36
214	34
488	56
334	38
412	48
414	50
118	18
1010	80
1058	66
398	38
90	22
376	32
320	32
924	52
104	36
124	36
148	48
532	60
380	48
118	34
38	14
816	60
154	42
216	32
248	32
356	36
666	54
504	50
54	30
276	52
186	22
370	46
104	24
596	56
86	30
616	56
626	50
34	26
112	40
234	34
332	32
378	40
19	7
422	34
214	38
594	38
724	52
906	58
286	50
442	42
19	7
1120	76
650	58
168	40
202	26
1018	82
558	50
184	36
74	34
268	44
178	22
344	48
294	30
726	66
394	46
456	56
116	26
1544	78
238	36
362	48
94	28
78	18
48	20
282	38
72	28
1108	64
120	28
464	40
246	26
198	34
1296	76
292	40
564	48
630	30
174	22
400	28
114	26
442	46
480	56
250	34
280	44
580	38
118	34
496	34
552	58
632	60
312	32
292	38
466	54
76	16
156	26
550	50
322	42
110	26
230	30
128	28
230	38
464	64
248	58
98	34
358	46
210	28
2200	104
54	26
166	38
244	30
292	46
968	60
128	24
42	14
238	28
1890	98
352	38
120	28
106	30
326	46
184	40
108	28
884	72
934	62
214	26
324	52
164	20
308	56
150	30
418	46
62	26
90	18
120	30
210	34
182	34
326	46
260	52
36	24
1206	78
474	38
32	32
186	34
334	38
88	28
464	52
80	28
1596	92
656	60
364	44
176	32
90	22
122	42
160	32
56	32
196	32
308	44
1302	60
462	56
548	48
200	24
834	78
190	30
620	56
104	32
112	36
576	44
84	36
204	44
290	30
254	34
894	56
934	64
72	24
664	60
120	30
560	56
80	24
134	26
636	52
574	46
272	28
222	40
106	34
336	40
112	28
24	24
178	46
446	50
508	44
238	34
318	60
80	24
88	26
272	44
134	22
678	58
148	44
1086	62
286	46
516	32
310	38
658	66
34	26
456	36
176	36
474	40
376	48
328	40
288	36
56	14
186	28
208	28
292	26
764	60
248	40
90	22
150	34
158	28
146	22
536	44
36	24
1262	74
378	50
306	38
42	26
354	46
480	48
238	34
2042	94
138	30
110	38
278	42
282	34
272	40
564	56
146	34
227	27
408	32
654	50
132	44
90	24
562	54
130	34
498	56
184	28
860	50
730	66
466	46
316	48
122	38
178	38
162	30
454	46
374	54
610	58
258	38
878	46
118	30
172	32
604	52
526	54
1204	76
884	70
280	36
254	42
172	28
138	38
278	34
914	46
244	32
316	46
126	42
380	48
258	46
592	56
90	24
64	28
728	60
548	52
522	54
352	52
666	44
142	34
1418	62
128	28
90	34
496	40
54	30
88	28
1838	100
282	34
290	34
34	14
482	52
54	14
160	36
518	54
32	24
720	64
44	28
832	60
52	24
316	40
254	38
188	32
300	28
1138	62
178	30
470	42
223	34
318	46
88	32
1124	72
532	48
558	58
100	32
162	38
124	28
380	40
802	50
148	38
324	44
156	40
1240	68
372	50
266	44
130	38
232	46
500	60
124	28
532	56
200	40
670	54
104	22
148	20
328	52
202	38
204	32
512	42
122	38
48	36
210	26
470	54
202	38
686	54
454	42
74	18
86	26
204	28
476	54
428	48
166	26
224	32
202	30
236	36
336	40
148	32
432	28
292	44
182	38
72	24
266	46
840	88
156	20
150	32
50	18
138	34
90	34
598	32
240	40
400	40
324	36
576	44
90	26
310	26
80	28
420	36
144	36
302	42
504	40
1040	64
194	38
346	42
806	62
162	32
64	24
1022	70
34	22
280	50
280	28
212	28
54	22
110	18
200	32
820	48
228	44
146	38
250	30
608	50
46	30
206	42
94	32
168	40
174	28
359	38
356	48
426	42
422	38
166	30
140	36
696	48
472	36
100	24
122	30
206	34
352	36
586	54
68	18
540	56
106	30
42	14
1096	70
916	68
582	62
464	44
496	48
23	9
140	48
86	22
192	36
240	40
68	32
218	26
982	62
258	42
524	48
382	46
458	46
384	36
396	48
186	26
74	34
222	46
194	42
118	26
712	52
430	54
482	54
746	66
78	26
384	52
32	24
148	24
336	52
362	26
298	44
558	50
1632	96
54	30
138	24
158	30
162	42
182	30
692	60
670	68
414	50
1740	86
1322	68
124	24
292	28
878	70
346	38
76	28
152	32
404	44
668	56
260	44
28	24
746	54
302	30
596	60
76	28
408	48
244	44
832	64
768	54
226	30
190	42
852	68
452	54
120	28
104	28
628	50
150	42
152	28
188	40
464	40
226	26
520	52
158	46
562	66
144	32
1336	82
74	26
196	30
278	40
958	60
88	24
302	34
496	52
228	24
246	44
94	22
420	38
98	26
866	60
228	44
486	46
110	26
544	62
430	50
700	56
250	46
582	58
354	38
434	40
382	46
548	52
440	40
638	70
242	38
132	36
1650	80
590	50
230	34
102	30
84	16
634	52
48	16
382	46
664	52
282	46
310	30
184	24
140	44
260	32
152	32
402	34
338	42
230	34
170	30
148	36
310	30
306	42
390	50
80	28
244	32
162	26
420	42
40	24
436	44
432	40
212	36
270	34
326	34
364	52
92	32
116	24
196	28
540	56
46	22
4262	142
238	38
140	24
246	46
424	52
138	18
430	40
288	44
100	28
450	48
148	36
270	34
250	30
1290	76
332	48
572	52
238	36
234	34
198	38
64	24
496	44
100	24
202	46
278	50
204	40
88	28
106	34
186	42
488	40
174	34
432	44
214	30
66	26
224	40
380	48
412	48
192	40
322	38
208	36
82	26
382	50
364	44
472	56
540	52
122	34
378	42
1148	60
546	50
788	54
134	28
164	32
190	30
130	38
2098	88
580	64
734	70
906	60
384	40
442	46
216	40
1764	98
930	64
58	30
102	34
264	32
534	54
356	36
170	42
214	42
188	32
152	28
62	22
82	30
914	70
548	60
170	18
220	36
314	50
208	28
110	30
118	42
84	24
744	68
372	36
160	48
270	42
144	24
1080	76
230	42
172	28
190	38
628	60
382	54
362	46
526	60
162	34
644	44
214	36
216	36
68	24
1236	84
212	28
496	32
482	46
432	44
88	24
148	28
1204	76
322	34
158	42
392	60
446	42
370	46
76	28
544	60
146	46
598	60
528	52
506	66
472	40
418	34
486	42
714	54
268	32
992	68
120	48
234	34
152	28
236	32
726	66
1112	60
42	14
68	28
282	42
468	40
786	62
84	24
154	34
204	40
100	32
210	30
92	32
226	34
598	54
578	42
428	52
166	26
660	52
1378	88
1058	76
808	64
70	22
132	36
1400	76
422	46
172	24
22	22
178	34
418	46
142	30
1194	86
150	22
140	24
752	72
252	36
506	58
74	30
50	18
210	32
456	52
1022	90
384	48
428	44
2536	96
580	48
320	48
230	46
54	30
218	42
292	32
1498	78
170	22
222	38
662	46
804	64
508	44
284	48
128	32
380	40
850	56
66	26
70	30
118	26
184	32
36	24
316	44
130	30
138	22
184	30
136	32
400	42
944	64
184	32
230	30
140	36
204	40
182	38
1472	88
354	48
418	50
136	28
392	64
66	18
116	36
152	36
256	40
188	40
146	30
176	36
408	40
520	46
350	30
232	36
342	42
114	26
370	50
562	62
430	54
386	46
192	36
270	30
114	34
110	38
626	62
366	54
140	24
456	44
200	44
362	50
402	34
1340	74
216	32
1204	78
276	44
130	30
310	36
154	34
718	62
272	32
220	32
884	64
192	24
314	46
58	26
60	28
598	50
226	34
302	38
108	28
370	44
242	30
586	54
350	46
112	32
364	32
562	54
40	24
228	40
454	38
308	36
994	68
92	24
522	46
620	34
528	50
142	30
154	22
1320	80
184	28
324	48
538	44
592	44
646	48
250	38
224	36
276	28
402	54
1236	64
124	34
90	26
1448	96
426	42
180	36
152	40
364	36
116	28
74	26
218	42
132	32
1232	84
284	40
266	38
232	36
52	28
278	58
368	44
378	46
852	64
44	12
256	40
178	22
398	62
450	42
506	46
206	30
210	26
948	76
114	42
220	24
728	64
142	18
518	50
328	36
86	26
162	22
584	58
76	28
66	18
352	40
110	38
104	32
612	56
670	46
122	14
696	66
162	24
518	54
90	26
288	36
134	38
300	52
1090	80
92	28
320	44
960	78
1264	76
418	46
438	54
526	38
178	30
690	46
214	32
602	48
172	28
82	22
70	14
406	34
222	42
434	50
364	60
1360	64
474	58
436	44
368	38
386	34
206	46
78	26
344	48
522	44
48	28
516	60
442	50
692	64
634	48
166	26
322	30
668	56
238	38
1194	74
572	54
186	40
600	56
170	26
204	38
928	64
164	24
116	36
1584	84
194	30
450	50
74	18
392	44
200	28
220	32
942	66
160	40
304	48
2312	110
408	36
312	36
80	28
158	28
822	60
94	30
206	26
556	48
310	46
152	28
484	72
642	52
562	58
280	52
224	36
118	30
432	32
60	20
444	48
226	30
442	40
56	16
254	30
206	38
116	32
82	30
336	32
952	60
68	28
40	20
582	52
938	84
70	18
254	42
72	24
250	38
978	74
354	30
522	46
130	30
320	44
588	64
486	48
342	34
974	90
86	34
1100	88
196	32
1172	68
116	28
232	40
34	18
200	48
624	72
36	28
94	26
342	38
772	56
166	34
78	26
468	40
390	62
278	34
460	48
150	34
204	26
650	46
646	54
544	60
340	52
276	40
532	48
334	50
3500	132
280	40
426	34
118	22
656	50
366	46
1446	66
194	42
258	58
334	42
1134	60
832	62
144	28
644	46
700	60
220	44
406	54
112	30
460	56
228	36
84	40
256	40
168	24
58	26
1368	80
338	46
180	40
218	30
789	68
550	36
106	30
1248	76
218	48
430	54
708	72
168	28
26	26
538	42
256	48
412	44
218	36
178	22
792	56
158	26
168	36
222	42
538	60
782	66
88	32
52	28
268	48
780	70
454	46
98	22
410	54
474	50
350	42
50	26
512	52
40	28
78	26
964	64
114	28
152	30
524	46
168	28
90	18
354	38
394	50
284	40
1458	66
508	54
912	74
340	46
206	38
222	34
192	22
812	68
700	64
290	34
392	36
98	26
654	46
680	60
194	42
322	46
580	60
396	64
548	52
1432	88
976	62
256	44
246	42
132	14
350	38
726	54
174	42
148	24
374	38
438	44
154	34
36	12
218	30
446	38
132	40
236	36
308	56
19	7
534	46
222	30
704	52
152	24
322	50
238	40
2174	80
346	42
372	40
558	62
178	30
368	40
356	44
46	18
98	30
654	54
322	38
80	28
174	34
232	44
518	50
344	52
110	26
244	40
166	34
788	64
300	44
690	48
156	32
354	48
164	32
370	42
1030	66
518	64
214	38
104	28
244	52
312	48
80	24
488	34
234	34
288	28
358	42
852	72
138	38
176	32
176	24
300	48
398	56
378	34
540	52
580	56
94	34
274	42
160	36
158	22
44	32
270	48
798	60
270	30
160	28
1148	72
70	26
390	42
326	42
40	16
642	60
158	42
19	7
176	36
418	50
392	44
60	16
206	38
478	58
386	46
200	32
426	50
306	34
172	32
170	34
132	28
438	38
254	38
168	28
96	24
418	54
78	22
524	36
52	28
258	30
258	38
74	22
324	40
764	64
194	34
332	48
284	44
224	36
208	40
376	36
108	24
298	34
286	42
448	48
464	44
112	28
308	60
216	32
318	46
76	28
254	36
374	38
252	32
176	28
158	42
400	60
404	40
90	42
832	72
316	40
258	34
348	40
30	22
352	48
360	40
576	52
174	34
594	40
218	30
320	48
836	66
294	34
772	48
82	30
92	32
78	22
1216	76
30	14
938	68
36	28
180	28
286	46
454	50
246	46
204	32
706	58
966	72
428	40
388	32
58	30
198	42
218	32
264	40
416	44
240	32
46	22
150	26
72	24
1406	82
244	24
338	46
236	32
216	32
124	32
478	54
172	40
304	60
398	54
288	44
280	36
42	18
98	30
98	30
224	40
662	48
178	30
338	26
184	40
158	34
160	32
714	58
70	22
436	40
154	30
466	46
250	34
514	46
276	40
296	38
302	34
148	36
748	54
510	62
882	48
284	32
632	40
230	38
114	30
68	20
666	50
324	40
50	18
134	30
586	50
144	40
440	38
720	48
230	34
114	18
236	40
316	52
452	56
62	30
588	60
322	46
242	26
128	20
402	50
122	26
190	38
1162	82
312	38
326	34
402	60
352	28
256	44
178	30
230	26
594	58
72	28
256	44
22	10
510	54
210	34
126	34
2462	114
64	32
564	52
162	30
1054	60
362	34
694	54
332	52
340	48
50	22
202	26
336	48
996	56
618	72
448	44
336	32
500	48
264	40
602	54
198	42
138	22
218	30
108	28
196	48
480	48
130	22
218	38
848	60
324	40
596	64
128	40
118	26
32	26
610	48
240	44
224	36
818	66
398	46
126	30
410	44
104	32
110	30
748	56
138	30
634	54
176	16
344	52
398	58
84	28
158	26
282	38
124	28
150	34
216	32
362	38
64	16
362	58
272	32
170	30
82	18
1240	76
764	58
596	44
112	36
38	14
72	28
370	38
260	40
316	32
292	40
224	48
676	48
782	70
196	32
628	62
174	34
130	38
306	44
910	64
1216	72
324	36
146	30
118	46
178	26
50	26
148	28
400	44
196	28
534	46
160	24
132	34
898	54
418	54
1134	70
140	24
438	38
982	70
76	16
286	38
38	30
124	26
218	34
130	34
1266	70
850	46
316	44
646	58
192	48
156	28
350	58
132	36
228	34
152	28
132	36
612	60
1496	70
604	52
56	16
122	34
134	30
408	44
388	40
550	46
776	68
626	50
330	52
72	28
108	28
22	22
176	28
270	42
174	30
602	54
674	70
110	22
760	60
252	28
808	56
254	30
934	70
518	62
132	32
250	46
98	18
314	54
338	46
62	30
130	30
130	22
254	50
196	28
616	52
262	46
268	60
634	58
426	38
210	38
450	54
678	50
366	50
168	44
150	34
76	20
172	40
102	30
688	58
204	36
620	54
220	32
412	64
56	28
652	60
992	70
388	42
812	64
144	36
1468	80
458	42
190	38
94	26
80	32
326	38
278	46
196	44
196	38
196	44
552	56
256	40
316	44
22	22
136	32
242	46
374	42
344	32
74	26
424	40
284	30
580	56
344	36
302	50
176	40
3658	126
726	54
230	38
196	48
440	56
584	48
232	40
478	42
474	48
198	32
420	44
146	30
86	30
172	28
484	44
1098	70
354	42
140	32
708	52
468	44
386	44
276	44
76	24
110	26
496	52
370	50
106	30
388	24
164	18
454	50
172	32
4976	174
128	28
580	60
300	36
114	30
348	50
172	36
72	24
172	40
262	26
500	60
364	44
158	30
170	38
180	28
138	14
276	56
768	68
354	38
430	38
506	50
318	38
800	74
168	24
3730	122
762	50
70	26
692	54
450	44
238	50
428	32
112	40
130	26
662	50
296	24
322	38
696	54
348	40
624	72
296	40
796	60
316	40
460	52
298	34
294	26
108	40
140	28
276	50
58	22
296	40
474	50
334	34
708	64
166	34
186	34
348	28
330	42
92	28
394	46
492	52
546	46
388	32
198	42
296	60
52	20
102	30
472	36
282	38
92	28
740	56
116	30
166	30
324	52
98	26
1140	60
294	38
240	40
218	30
102	32
198	42
130	42
126	26
798	62
512	28
303	40
382	54
336	52
274	42
302	34
138	26
48	16
172	36
46	18
122	34
214	42
140	16
470	54
524	52
300	44
572	50
314	34
166	34
184	40
202	30
416	48
656	48
42	34
48	24
300	52
714	60
72	20
190	36
410	36
98	18
166	30
36	12
600	52
152	28
434	38
176	36
1452	80
498	54
1112	66
508	38
463	46
230	38
110	26
584	62
74	34
296	40
288	30
124	32
576	48
48	24
652	62
164	46
394	42
202	38
400	40
420	36
202	34
166	30
112	28
598	50
900	52
298	46
260	36
690	58
164	32
248	44
114	34
70	30
164	30
172	32
338	38
170	34
86	30
134	38
362	38
1236	64
118	30
146	22
184	32
208	36
206	38
542	50
285	34
222	30
392	48
504	48
70	18
404	48
120	24
150	30
160	36
188	20
254	30
582	58
114	30
80	24
688	40
702	84
672	46
98	30
152	28
120	36
602	66
746	58
334	42
1482	82
112	24
190	46
372	36
308	48
222	34
140	18
386	42
670	54
340	40
154	30
610	54
300	40
396	42
108	32
106	22
54	22
506	66
736	60
594	58
260	36
622	46
536	56
56	24
494	62
462	50
122	26
354	32
922	66
376	52
770	54
104	32
484	42
32	24
214	38
658	70
160	28
250	34
990	60
58	22
320	52
206	30
78	30
160	28
190	38
386	42
340	44
168	28
214	30
554	56
380	44
880	50
102	30
302	42
280	32
536	50
726	60
1040	62
530	54
138	38
144	28
248	34
314	50
418	50
1538	96
170	30
346	42
138	42
236	44
620	52
348	36
790	74
546	44
194	26
636	52
388	44
356	46
282	22
526	50
258	54
112	24
222	34
110	32
334	38
164	28
372	32
406	30
130	22
634	58
160	24
154	34
448	52
316	48
188	24
292	52
30	30
488	42
32	24
222	42
364	36
98	30
290	36
388	48
488	40
316	32
106	26
860	52
238	38
1162	66
88	32
702	66
492	56
146	38
228	40
300	56
350	58
115	23
144	28
856	60
92	24
330	40
458	50
250	38
48	24
258	50
140	28
432	32
158	38
430	50
364	36
618	62
180	32
116	30
42	14
344	44
94	22
122	22
334	42
254	34
354	48
448	58
368	36
664	40
126	30
354	48
116	28
102	26
132	28
784	72
604	52
790	58
78	26
100	32
324	48
384	40
348	48
504	56
624	52
330	52
980	76
170	26
1852	102
164	32
748	68
290	38
526	54
812	68
358	42
72	28
192	28
140	36
640	52
1692	94
764	60
104	36
520	62
56	16
400	32
970	80
448	40
122	30
224	34
246	26
516	60
188	36
520	52
284	32
226	42
666	46
370	34
148	16
104	28
374	54
272	48
86	26
266	42
278	28
132	32
652	56
864	64
720	68
208	48
210	26
228	36
218	34
378	54
346	48
146	30
250	34
156	24
180	24
1250	70
1234	64
358	42
508	44
180	40
258	36
230	40
402	54
184	38
386	38
142	26
264	44
192	24
414	40
446	40
398	46
234	50
378	38
212	32
168	32
40	24
142	30
304	38
214	34
716	56
246	34
400	50
478	54
370	26
772	58
66	34
198	38
490	44
190	42
244	44
284	44
286	38
294	30
110	18
370	46
136	24
130	38
158	34
274	46
354	42
116	32
148	24
26	18
1224	84
494	38
404	44
788	64
300	40
154	36
774	62
296	52
22	22
372	44
174	30
100	28
118	26
470	54
134	30
180	32
148	28
380	46
1558	88
254	26
438	58
1232	66
584	54
680	58
418	54
102	30
70	30
170	34
894	66
700	58
504	52
304	34
118	30
572	52
460	40
577	38
274	40
70	30
778	62
290	38
744	52
66	36
780	44
318	46
934	56
904	72
538	52
240	32
144	36
518	46
714	42
492	56
176	34
372	36
72	24
738	46
106	26
138	38
528	50
426	34
118	26
646	68
64	24
748	58
380	48
178	38
464	54
572	56
754	50
358	30
60	24
714	82
82	26
528	50
1116	64
390	50
194	38
262	48
452	28
160	32
146	30
140	28
406	46
476	48
58	14
66	22
80	28
818	54
346	40
186	30
520	60
628	60
564	44
474	46
872	48
148	24
366	42
184	36
598	62
30	26
314	38
656	56
474	34
388	32
148	28
428	44
682	66
92	24
424	40
198	38
528	48
354	46
128	20
522	46
128	40
410	30
174	38
286	26
116	24
19	7
669	54
566	54
86	18
382	56
470	46
214	34
360	28
182	22
580	56
110	30
322	46
186	38
96	24
300	36
162	34
50	26
30	30
118	30
100	36
352	40
600	56
228	52
536	40
152	36
174	26
60	16
158	30
730	58
760	56
132	40
34	26
96	40
302	50
156	40
920	58
224	36
128	36
314	42
172	36
266	40
60	24
218	34
222	36
160	28
438	50
304	32
186	34
216	40
1040	64
56	32
952	60
598	58
536	60
184	36
384	44
82	22
928	58
246	30
380	48
160	32
668	52
114	26
118	30
1400	82
604	52
664	56
1382	72
370	42
790	66
564	48
256	48
242	50
316	36
172	36
376	32
2120	94
136	32
260	40
484	52
558	50
82	26
380	44
174	34
430	58
138	30
30	22
404	40
94	26
664	48
246	36
226	42
562	50
356	40
76	20
222	34
156	34
484	40
292	52
104	32
278	34
382	50
896	60
272	52
404	24
50	14
690	52
382	50
50	30
426	42
176	32
358	22
880	60
242	38
138	36
1024	64
880	52
314	42
358	38
208	36
148	32
76	24
170	34
516	56
624	40
286	34
942	68
310	50
482	50
118	34
80	18
1258	90
434	42
130	30
246	44
740	46
64	36
464	52
358	46
652	64
38	22
470	54
1190	74
192	40
290	22
186	34
164	36
182	34
674	58
90	20
78	28
466	66
406	54
432	36
116	28
152	40
160	48
88	24
90	30
80	36
126	30
536	52
342	46
156	36
244	42
534	42
530	46
244	36
184	20
466	50
146	34
538	52
114	30
234	58
372	52
760	44
164	28
286	42
90	46
80	30
72	28
96	32
168	36
76	28
234	32
100	28
94	26
182	26
248	36
960	76
280	44
1268	68
688	52
354	26
254	34
56	16
162	22
300	30
130	42
324	60
754	58
602	54
130	30
686	60
94	30
492	50
206	38
326	38
322	34
232	40
188	32
250	30
258	34
238	38
1542	70
172	36
570	58
332	44
202	30
384	44
486	62
100	24
184	36
868	46
362	42
108	36
340	36
372	40
438	42
106	42
530	56
166	26
254	42
562	36
286	32
322	44
152	28
112	32
328	40
44	12
410	34
208	36
540	50
1184	74
118	34
348	48
530	40
252	32
708	40
390	54
182	22
40	24
382	34
366	38
116	28
596	64
196	40
460	36
122	30
216	36
118	30
414	50
148	28
356	48
494	52
72	24
872	64
668	52
140	36
560	48
536	48
228	40
560	46
284	48
136	36
418	46
1040	78
64	32
362	38
160	30
784	68
224	36
672	56
376	44
288	48
220	32
962	66
412	46
508	44
534	46
96	20
122	30
554	54
162	30
300	32
96	32
80	20
298	50
310	38
388	60
452	52
128	28
302	34
662	56
166	42
982	62
24	24
146	30
1402	62
260	44
146	30
490	52
38	14
362	42
242	34
140	32
778	66
732	60
506	52
398	38
312	32
820	72
118	34
344	44
350	46
1330	64
306	38
390	54
522	58
138	30
552	44
958	62
634	64
528	46
1210	72
332	44
52	28
378	46
204	32
612	52
618	46
166	46
134	14
176	30
52	24
296	36
94	26
102	22
256	40
252	32
64	28
982	72
452	54
1098	70
316	36
550	54
108	40
494	46
78	30
172	32
452	46
860	60
796	80
66	26
164	36
328	36
286	54
952	72
140	40
426	50
178	44
234	36
862	54
222	34
256	40
52	28
130	22
428	40
506	46
166	26
328	42
810	70
134	30
144	32
62	22
70	30
470	38
184	48
104	32
854	46
80	24
292	40
122	18
604	60
240	40
78	22
128	32
426	50
448	42
514	66
144	28
148	32
60	24
110	30
218	30
678	44
290	38
582	62
28	28
430	48
646	34
354	36
404	56
226	34
238	38
212	44
60	24
498	54
118	38
80	24
80	24
576	62
414	56
68	24
530	62
226	38
292	40
388	44
312	52
246	38
44	16
1100	66
68	24
346	42
216	40
332	32
284	28
138	34
264	42
116	24
176	32
578	62
402	52
308	42
56	20
1004	84
246	54
460	44
168	40
368	56
640	44
298	42
438	46
54	14
1012	74
552	56
326	42
90	30
652	40
36	24
330	54
842	40
656	42
806	58
296	40
106	26
390	30
354	46
794	40
394	42
504	64
282	42
374	46
276	48
352	50
602	44
270	30
76	20
392	52
534	42
240	48
362	38
178	26
396	44
444	52
326	44
162	30
138	34
410	38
374	46
252	36
120	44
256	36
86	22
68	32
112	32
466	42
118	38
1044	56
278	42
522	54
434	50
842	50
416	36
494	38
384	48
436	46
278	38
428	46
38	14
170	38
230	38
152	36
256	40
102	30
160	44
48	16
72	24
170	42
700	48
58	30
86	26
204	40
34	30
90	38
50	26
784	56
460	44
226	42
486	44
166	34
176	28
406	42
538	52
270	50
310	30
32	16
356	48
386	42
88	28
750	58
240	32
594	46
1550	64
266	40
456	46
448	62
392	42
148	20
418	42
228	40
118	18
706	66
92	24
406	34
72	24
270	50
736	56
690	68
676	56
486	54
356	40
288	36
974	78
672	66
960	78
372	36
408	32
472	38
108	36
180	28
248	40
146	34
1034	74
186	34
1262	70
108	24
1190	82
532	50
166	22
266	54
102	26
328	40
120	36
314	50
736	60
422	46
424	34
326	46
898	62
508	34
1419	84
662	62
174	34
108	36
102	30
322	42
114	32
496	48
80	24
482	44
430	56
240	36
88	28
402	38
1458	78
414	54
1704	68
192	32
230	34
406	50
900	46
334	54
156	32
128	32
116	24
924	72
290	34
274	34
82	26
1584	74
266	38
90	30
376	48
524	48
344	48
322	42
196	28
366	38
194	22
262	28
198	46
152	32
556	54
134	30
568	58
580	48
114	30
248	44
118	28
112	36
308	32
192	32
170	34
592	60
278	38
1008	66
214	38
524	48
554	50
122	34
154	30
622	66
154	34
214	34
206	36
78	30
364	44
224	36
568	50
130	30
364	52
46	30
176	28
54	22
136	32
356	56
688	60
126	30
102	22
24	24
322	44
360	40
138	26
202	26
66	26
396	42
94	22
406	54
676	64
520	52
412	48
428	48
160	32
600	56
818	44
26	26
112	34
304	32
792	60
124	20
252	28
226	34
260	48
186	22
280	44
26	26
768	66
214	38
530	44
292	44
888	56
328	50
474	60
1026	62
186	26
1210	74
80	28
812	80
544	60
312	52
304	48
92	24
268	36
708	56
324	36
198	42
494	34
34	18
568	52
166	30
158	22
246	46
194	34
120	22
1500	70
424	42
884	58
160	36
732	44
100	32
480	48
56	32
108	32
192	24
634	42
162	30
166	34
220	40
174	30
282	34
362	46
90	22
440	60
580	60
114	38
440	52
148	24
238	42
320	28
248	48
216	44
160	28
610	58
670	54
476	48
530	34
1338	96
190	38
310	34
266	38
240	36
408	44
194	30
272	36
50	18
152	48
496	48
394	58
282	40
226	42
394	36
92	28
612	64
282	46
276	48
224	40
134	30
1012	48
342	42
308	36
190	40
568	56
432	48
200	38
278	30
444	52
324	32
666	56
346	40
138	22
230	50
162	30
792	56
502	48
550	60
366	50
548	52
162	26
314	46
268	38
338	48
92	24
202	38
146	26
324	40
1100	72
174	34
304	48
426	50
298	30
240	46
96	36
844	56
504	48
416	42
522	60
798	62
86	26
312	32
484	44
80	24
138	30
374	30
86	38
110	26
324	40
102	22
666	40
592	52
334	38
240	36
210	30
66	22
192	24
566	38
696	56
114	30
146	22
1258	76
134	28
376	44
328	30
166	26
604	52
494	54
104	28
1026	66
314	38
136	28
150	18
971	66
1872	80
202	34
888	60
440	40
264	44
194	36
284	52
120	32
470	46
398	34
338	42
166	34
262	38
642	62
500	48
414	42
392	48
242	42
132	32
572	56
910	70
296	44
684	64
260	48
68	28
132	32
50	26
128	24
162	22
198	38
642	56
626	58
1002	68
568	44
372	48
186	30
944	66
412	48
1132	68
464	44
168	32
252	40
166	30
626	48
1090	78
358	42
586	54
22	22
156	36
232	32
258	34
46	26
228	32
324	52
1286	82
138	30
274	38
84	20
74	26
314	38
902	62
68	28
310	42
80	40
262	42
1486	70
220	36
1786	90
86	26
180	28
70	26
346	56
92	24
172	36
128	32
46	26
428	48
278	38
186	36
218	30
254	44
500	56
308	36
726	66
134	38
290	40
348	32
250	34
206	34
200	38
460	44
228	32
618	60
340	46
1128	70
148	32
510	64
30	14
100	24
370	58
148	24
88	28
242	34
64	24
298	34
452	34
44	16
220	32
172	36
224	36
178	50
226	34
176	40
558	46
110	30
640	52
838	64
76	24
202	38
124	28
432	52
562	58
336	40
512	58
532	56
138	38
362	50
330	42
256	40
100	36
210	30
426	50
840	62
116	32
300	36
798	58
542	70
328	40
134	30
214	34
224	44
430	46
222	36
256	28
582	50
726	64
344	42
132	28
248	40
310	44
246	54
62	14
136	36
168	36
428	48
412	40
142	26
150	32
148	32
506	42
286	40
266	38
100	32
764	60
56	24
964	78
124	24
566	48
168	32
594	58
484	36
50	18
658	58
476	44
74	34
726	50
1356	78
476	46
178	46
376	46
70	26
408	60
448	44
288	44
184	32
236	34
328	52
250	30
176	32
134	30
308	36
404	44
19	7
390	54
74	38
750	66
364	32
490	42
122	30
124	36
486	42
90	34
562	42
46	22
218	34
104	28
66	26
868	64
346	50
430	50
124	24
258	42
346	38
224	40
1274	78
54	26
244	32
528	52
160	24
266	42
1100	84
932	60
108	28
820	56
66	22
524	52
520	44
38	14
560	68
286	30
184	54
352	40
190	34
102	36
68	28
102	22
362	50
252	40
148	36
670	50
354	30
208	36
278	34
392	46
94	26
40	16
160	28
334	38
190	26
280	28
54	22
720	50
416	46
300	28
86	18
252	44
1116	80
174	26
122	22
102	30
770	58
116	24
126	26
178	22
46	22
200	32
404	44
1032	76
1024	64
92	40
438	50
546	54
184	28
178	34
722	58
342	46
770	62
182	30
66	42
214	34
818	54
324	48
52	28
114	22
468	48
1006	78
920	70
976	72
736	74
128	26
300	38
48	16
214	38
1770	80
250	44
898	60
646	46
656	54
136	24
804	48
526	38
310	38
3412	122
182	40
274	38
352	48
54	14
290	34
4026	124
592	46
1026	66
420	44
108	40
1338	82
330	42
1230	78
236	36
254	30
1052	72
310	30
220	28
464	44
404	42
58	26
366	38
538	38
19	7
326	52
118	18
372	48
1116	68
118	26
1806	90
364	40
58	22
254	34
218	30
1430	96
652	60
190	34
285	48
182	30
86	30
438	40
384	50
326	26
94	26
154	42
466	46
86	22
196	28
92	24
784	56
126	38
538	50
338	42
84	36
252	36
92	40
250	42
576	44
1358	82
260	28
140	44
166	38
448	52
150	26
86	30
172	30
132	36
736	60
248	34
174	30
416	48
302	58
36	28
246	32
366	42
424	40
338	34
316	44
272	40
356	42
158	30
158	30
576	52
218	44
634	62
88	24
516	52
66	30
360	40
316	28
304	34
1226	70
182	34
68	28
818	54
1160	60
444	36
82	22
104	24
176	40
274	34
736	56
510	56
192	28
190	30
396	50
216	28
340	36
88	20
146	22
198	30
140	32
210	34
40	28
784	52
750	58
19	7
408	48
128	28
176	32
56	16
964	52
210	34
146	26
104	32
1192	80
294	34
212	32
186	32
682	54
540	64
280	40
74	26
282	46
178	42
504	36
142	18
1062	68
634	58
184	40
218	54
198	34
672	52
450	42
636	36
246	46
108	16
760	56
454	52
316	36
136	28
224	32
656	56
156	40
516	48
136	32
92	24
84	32
118	42
196	36
726	54
302	32
478	58
166	26
52	28
536	56
240	40
324	44
452	36
1302	78
270	42
96	28
524	48
132	32
470	58
274	40
52	28
892	64
112	32
792	64
178	30
42	26
144	38
508	56
36	20
136	44
464	28
42	30
342	28
538	54
98	26
2086	106
130	34
264	50
486	46
216	28
592	48
458	54
474	66
604	52
168	32
196	24
140	28
426	38
572	68
764	56
320	44
1672	76
188	24
252	36
344	44
166	26
540	64
342	34
412	44
76	24
216	44
926	60
206	36
276	34
748	60
192	40
314	40
164	28
172	32
366	56
284	40
96	28
164	32
166	30
286	26
236	28
228	36
110	30
904	70
304	44
162	42
844	64
72	20
294	40
216	42
618	58
198	42
406	46
246	22
216	36
168	26
796	72
182	30
764	48
240	36
154	36
556	42
512	60
116	30
114	30
140	32
214	30
282	38
212	36
302	38
144	32
19	7
488	40
310	46
98	18
138	30
266	42
272	40
38	30
46	26
186	34
96	32
240	52
148	24
70	26
600	52
988	72
366	46
66	22
206	34
276	40
106	26
230	50
184	28
452	60
142	26
96	32
360	44
200	32
298	48
150	34
60	16
212	32
360	48
360	52
286	44
106	24
240	36
272	32
504	44
624	60
688	48
118	26
606	54
516	64
36	24
134	34
194	38
876	68
382	44
1444	88
316	48
960	66
238	38
242	34
202	30
174	38
600	54
162	38
314	36
140	24
1304	80
412	48
106	30
222	34
154	30
502	50
504	56
92	24
650	62
598	42
534	46
368	44
506	56
246	34
356	60
234	30
98	26
336	26
348	44
750	46
846	58
414	42
152	20
374	38
150	34
158	30
150	38
74	20
264	42
584	44
42	14
192	48
216	40
258	30
280	36
304	36
292	36
414	46
356	36
126	46
274	54
442	42
154	30
196	36
446	38
290	38
326	42
290	50
514	42
600	60
1808	80
344	56
224	36
96	32
168	36
318	38
516	48
408	42
248	36
300	40
238	34
180	36
1036	66
460	28
160	32
632	60
692	60
342	34
71	15
878	72
400	44
156	28
194	30
744	64
146	26
70	30
438	50
386	42
286	50
278	42
38	30
536	52
1416	64
526	70
602	62
204	36
272	32
190	34
712	46
314	40
226	42
56	20
270	46
196	44
1040	88
356	46
36	16
378	54
338	50
552	56
66	22
536	48
366	38
222	30
214	30
196	32
132	28
144	36
84	32
166	38
74	22
1094	68
294	38
1162	70
110	18
82	26
430	42
424	52
386	42
370	46
142	26
36	24
278	46
854	74
260	36
1728	88
94	30
544	52
228	40
52	24
26	26
318	38
144	28
508	54
142	26
312	56
228	36
92	20
376	48
184	36
974	60
54	22
615	52
92	28
570	52
156	32
432	48
492	28
206	26
178	38
512	40
218	30
204	40
396	36
222	28
150	26
1302	66
466	44
598	62
206	34
432	48
216	32
502	42
226	30
310	50
456	48
380	40
684	52
298	34
176	32
60	28
72	24
686	50
536	56
216	32
452	48
410	52
1124	78
110	38
266	34
70	26
222	26
498	50
40	24
456	48
832	72
166	34
802	54
162	34
254	38
444	48
118	38
578	54
370	46
184	32
1072	74
66	36
452	48
378	42
302	46
238	34
80	28
152	32
218	30
608	64
304	44
298	52
392	40
678	56
472	52
618	62
90	26
234	38
172	32
278	38
326	46
552	44
348	32
546	58
86	26
46	22
798	74
2458	122
746	62
1066	78
230	34
264	40
348	32
322	34
114	38
834	66
108	26
96	36
304	40
54	34
634	66
574	34
46	28
118	38
278	50
192	40
212	36
214	42
356	52
690	72
156	36
476	36
66	22
210	38
220	36
310	38
296	42
74	34
122	38
270	42
454	60
324	48
106	26
170	30
154	34
386	38
160	32
610	50
78	22
770	58
346	54
244	52
140	28
336	44
402	58
198	26
148	32
386	46
84	24
182	38
100	36
622	64
336	44
944	68
1264	72
180	32
350	46
548	50
392	44
570	68
136	24
104	28
127	38
30	14
408	26
172	34
128	32
512	60
192	40
540	56
258	38
414	46
244	40
214	34
1236	68
98	26
270	34
164	40
256	36
54	30
498	62
712	54
318	36
2000	92
408	38
206	30
1032	76
114	30
166	26
388	40
104	20
408	44
598	50
268	32
226	34
264	28
600	52
730	54
364	60
1102	82
68	28
488	44
19	7
422	38
118	38
180	36
298	46
822	62
120	28
76	32
542	58
196	36
140	32
72	24
378	52
410	62
1008	72
218	34
404	46
236	32
320	44
454	48
170	34
2032	82
170	30
86	26
282	38
176	40
114	34
212	44
538	38
140	24
194	34
456	40
1238	68
166	38
134	30
834	50
188	24
62	34
124	32
178	38
328	34
530	46
520	52
1004	60
948	68
148	36
228	48
184	40
40	16
706	66
616	52
374	54
318	46
258	38
314	42
270	38
66	22
238	46
236	28
256	36
140	32
1082	80
550	50
174	38
260	32
58	26
182	30
206	34
158	26
1350	82
42	26
300	48
100	24
228	40
56	16
240	48
208	20
336	36
236	40
438	46
244	36
452	44
174	28
2026	88
398	42
198	38
124	32
146	26
598	50
136	32
350	36
164	28
2164	104
164	28
86	22
594	44
398	38
166	30
52	20
52	24
262	38
154	34
546	54
512	64
442	62
548	48
276	28
446	62
236	44
146	30
62	24
770	52
982	74
788	60
326	30
266	42
772	60
304	44
384	44
200	36
210	44
354	34
36	16
386	50
372	36
198	38
432	40
466	42
606	42
414	54
444	52
132	32
204	28
148	28
942	58
690	62
574	54
202	36
308	34
338	46
1092	68
634	44
372	48
152	40
356	40
884	72
176	32
118	34
304	48
96	30
436	48
22	22
218	30
472	58
234	38
320	56
66	30
330	46
376	42
274	38
730	62
1898	98
172	32
788	64
64	24
614	66
234	38
272	30
106	34
198	42
744	46
156	32
724	48
62	26
36	28
440	46
114	30
470	42
290	42
110	34
170	30
352	26
552	42
82	30
600	52
758	70
148	24
1186	66
118	22
382	54
438	58
194	38
1136	80
622	58
112	40
236	48
116	24
94	22
164	40
122	34
648	50
38	22
1264	70
136	20
4612	136
1108	64
274	46
198	54
182	34
142	50
2292	68
454	42
152	28
526	56
50	22
1186	60
252	50
170	38
1184	66
70	26
162	34
218	30
330	46
376	44
630	54
208	36
184	32
96	32
148	46
224	28
314	40
500	52
88	28
160	32
306	38
792	56
330	38
268	44
172	40
320	34
344	36
98	38
578	34
442	50
204	40
260	40
94	30
464	52
626	62
130	26
134	38
532	54
62	30
590	58
278	38
232	34
132	24
546	50
242	36
1292	92
122	30
748	56
338	40
268	40
280	44
292	32
526	56
318	30
1508	72
468	60
1388	84
491	52
112	24
118	26
632	74
768	60
164	48
252	28
200	40
822	58
860	60
1546	70
660	50
510	52
310	28
142	30
502	62
342	42
276	38
972	48
32	24
60	28
52	16
384	28
136	28
166	34
416	52
22	14
260	56
942	70
244	28
434	38
192	28
64	28
154	34
392	48
126	38
1042	66
214	32
710	62
82	22
118	30
134	42
530	50
2086	114
76	24
186	44
68	20
264	34
376	40
98	30
220	32
194	54
150	30
616	56
80	24
316	52
42	14
326	42
406	38
334	38
314	56
116	32
144	28
378	36
132	28
698	58
338	34
104	32
32	24
80	28
164	32
954	74
276	40
502	46
1980	86
384	30
444	48
202	30
144	32
400	44
372	44
330	38
222	42
168	26
322	46
700	44
300	40
370	50
204	44
376	40
288	36
54	26
468	60
330	34
424	56
2030	98
52	16
974	70
632	60
510	44
194	34
242	38
128	32
112	28
19	7
254	50
370	46
362	42
126	38
238	42
80	28
78	30
382	48
278	42
766	56
2350	102
466	38
266	46
310	40
464	48
272	40
1076	72
216	32
404	44
190	32
534	50
162	34
200	28
54	14
218	26
396	40
120	20
98	22
622	54
348	48
276	40
380	32
358	34
120	32
246	42
310	40
542	42
88	20
334	34
872	64
44	16
316	34
46	22
258	46
70	14
242	34
594	58
578	54
384	44
816	62
80	28
198	30
202	34
40	16
158	38
86	30
310	42
824	64
552	42
136	32
470	50
1440	72
500	52
126	30
588	52
166	32
220	40
106	18
234	38
478	42
784	60
104	32
172	28
86	26
44	28
272	44
466	42
24	24
550	46
178	42
158	30
1003	74
688	52
234	36
534	54
186	34
416	42
142	30
230	30
376	56
144	32
138	34
230	46
188	36
150	46
158	26
56	16
346	58
754	52
354	38
446	46
34	14
308	36
154	22
164	32
1174	78
732	72
1052	76
128	28
876	68
388	44
380	48
548	42
470	42
728	64
128	28
698	60
328	40
242	38
54	18
318	42
208	40
412	52
228	36
444	60
330	44
346	40
38	22
566	48
80	32
70	18
362	38
2158	86
162	38
314	22
770	52
706	58
332	48
300	40
386	46
142	30
298	42
124	20
312	42
78	30
44	28
160	32
72	32
114	46
130	30
102	36
176	48
236	40
166	30
248	32
100	24
202	26
336	32
390	42
348	44
536	52
224	20
112	16
272	48
108	40
316	40
630	58
270	38
78	22
68	24
1854	106
902	58
1262	66
252	36
132	24
864	72
176	32
168	40
258	34
430	54
276	28
464	42
270	34
436	32
46	22
228	32
556	44
1042	70
114	30
126	26
110	26
716	48
168	30
566	62
326	42
838	74
422	34
420	44
452	44
326	30
86	34
244	38
110	26
398	38
380	40
118	36
144	20
274	38
158	30
544	44
168	32
418	38
352	52
326	38
134	22
120	24
792	54
584	54
220	42
258	42
238	30
116	36
698	42
196	28
184	48
1332	84
318	38
268	26
952	64
402	54
196	32
1604	86
68	28
76	28
862	62
374	38
644	64
754	58
396	40
158	42
114	34
604	52
496	48
306	42
624	66
68	44
806	46
602	54
26	26
270	34
170	26
134	38
132	32
118	38
224	48
42	26
128	28
36	24
342	30
394	30
74	26
222	38
232	48
1290	80
364	40
188	34
180	28
336	40
152	24
260	48
386	40
260	34
166	26
120	28
468	40
294	38
260	40
160	32
168	32
362	38
682	58
34	30
138	26
824	64
530	58
364	32
150	30
216	36
130	30
430	38
936	56
200	36
550	46
316	52
302	34
242	26
290	34
476	44
412	36
376	40
70	34
118	22
40	22
256	28
282	38
224	34
352	44
362	46
110	18
206	46
1500	68
380	36
382	38
184	28
32	24
302	44
138	22
336	32
214	40
364	60
258	34
278	30
220	28
1562	84
880	72
162	30
1120	80
266	26
466	46
504	46
288	36
1456	88
318	40
200	40
138	22
142	38
296	44
818	72
262	42
120	20
1268	76
1218	78
452	44
236	32
538	50
810	62
234	42
152	24
164	28
468	44
224	28
404	48
408	56
210	34
260	32
306	50
360	32
200	44
372	40
390	46
106	26
816	76
592	56
116	24
218	26
100	24
114	34
218	38
500	60
212	34
554	66
208	28
462	50
92	24
2038	96
610	66
74	26
1136	68
82	30
58	18
846	52
426	54
214	42
314	50
348	44
176	36
884	60
1324	68
348	54
852	72
76	28
198	42
780	64
62	18
1390	60
502	52
112	38
388	40
332	46
674	58
1044	66
250	42
130	34
1822	106
310	30
354	38
598	52
108	28
642	56
672	44
66	26
302	42
104	36
486	42
126	26
1414	80
136	36
246	42
558	38
364	52
206	54
906	78
172	36
498	64
204	32
388	48
156	40
80	32
294	30
526	38
252	36
148	36
658	52
380	40
166	30
260	24
204	36
178	38
202	26
1152	56
148	36
186	42
168	32
182	38
240	40
328	48
124	20
656	50
180	40
962	62
84	28
304	40
526	40
1292	72
60	20
386	30
120	36
290	50
138	26
308	36
642	62
114	30
306	30
116	24
400	48
110	26
514	34
112	24
574	46
158	30
122	30
126	30
170	30
76	24
94	26
180	32
126	26
954	66
330	24
332	40
174	38
436	48
624	56
570	54
910	48
316	40
430	52
688	54
1316	84
158	22
414	46
794	54
580	44
152	40
252	40
466	52
148	32
194	38
624	68
298	38
42	26
64	32
120	36
462	46
190	30
176	28
122	38
262	34
102	26
360	40
408	38
88	36
78	22
254	48
118	18
248	32
162	36
154	30
278	38
318	34
408	32
64	30
286	34
5668	138
404	48
932	76
244	40
154	34
552	48
56	20
38	22
100	24
168	32
276	40
242	38
184	48
218	30
304	32
104	28
242	40
456	68
554	50
344	50
330	46
442	42
88	24
84	28
390	46
24	24
128	40
144	20
212	32
674	46
360	48
482	50
334	30
562	70
240	36
502	58
258	26
772	82
828	52
366	42
674	70
918	72
1156	80
82	34
1080	58
2828	132
72	24
60	36
234	50
392	52
382	48
88	28
1982	90
236	48
280	32
80	24
206	42
82	22
148	40
370	54
1504	66
170	32
222	30
194	34
120	36
948	60
144	36
44	20
780	52
432	40
344	36
120	24
50	28
708	64
314	40
60	28
310	54
146	18
112	44
1324	66
344	40
734	58
332	32
158	38
454	54
72	36
412	36
288	44
214	38
582	44
372	52
636	56
42	26
290	38
444	44
88	28
494	48
294	34
1462	88
1052	80
310	38
484	52
370	30
274	38
452	62
190	34
374	38
150	36
544	60
680	56
478	56
242	38
496	52
474	50
1322	72
150	26
420	60
394	46
2096	108
810	64
848	72
90	26
498	50
412	52
318	42
46	22
482	38
502	62
530	58
234	42
772	56
542	42
250	34
360	36
300	60
178	46
282	30
460	36
70	14
208	40
440	44
322	26
76	28
302	30
172	28
264	32
32	12
360	36
156	36
262	58
512	48
692	52
798	66
218	38
48	20
352	60
444	36
44	20
80	24
82	34
364	36
40	24
198	34
252	44
118	30
234	34
330	34
140	24
108	28
72	28
1258	56
790	64
1504	72
118	42
594	54
376	42
858	54
678	54
418	46
1044	56
786	48
310	34
472	40
118	30
216	28
416	58
344	48
610	62
130	36
62	26
120	28
810	56
150	18
230	42
702	50
516	56
299	34
342	38
148	32
474	50
102	30
96	32
484	44
596	52
396	56
314	46
58	26
196	32
170	34
336	44
84	32
162	30
362	46
338	34
386	30
420	52
134	38
92	24
778	60
158	38
746	56
84	28
254	46
456	52
78	22
1564	96
226	34
530	42
66	26
632	48
138	30
34	22
682	58
532	64
256	42
550	50
224	38
224	36
170	22
32	24
234	36
536	48
262	38
416	46
182	38
572	52
190	38
74	30
360	44
486	46
30	14
288	44
78	26
228	36
312	40
390	50
154	34
158	26
466	42
518	44
206	26
678	64
394	46
410	32
144	28
248	32
208	32
506	36
196	32
370	46
94	26
628	52
320	40
372	44
208	28
110	30
19	7
620	60
74	22
176	28
236	32
122	22
878	62
156	36
456	48
164	44
88	28
1164	80
912	68
202	42
156	44
580	60
746	58
1882	76
968	84
1224	74
280	36
514	58
594	58
58	14
136	20
244	52
326	34
98	22
70	22
206	34
566	46
240	30
256	36
186	34
210	38
256	40
574	48
244	30
390	46
180	20
860	64
118	30
234	38
286	38
224	40
228	52
108	16
1146	88
692	60
146	34
174	30
282	46
58	22
178	38
148	16
774	70
700	50
330	46
318	46
515	52
122	38
218	34
56	32
216	52
328	26
336	32
414	50
286	42
630	54
398	46
48	20
52	36
1014	62
208	36
476	30
316	32
226	34
350	38
192	28
522	38
88	32
332	40
170	26
490	38
142	34
116	28
238	34
288	44
476	56
66	30
86	18
276	40
190	30
228	32
208	48
296	36
146	38
380	28
180	32
526	62
94	22
508	52
334	38
86	22
346	46
276	44
648	68
178	30
74	26
774	62
502	58
278	42
96	28
70	34
1766	90
354	50
728	78
102	34
656	64
346	36
386	46
266	36
136	26
364	52
116	36
204	28
194	38
550	34
210	26
408	48
298	42
360	32
574	60
330	42
404	48
1540	76
324	34
728	52
274	30
382	50
384	52
112	32
288	40
282	50
248	48
756	52
72	28
254	38
30	22
240	44
246	38
218	38
144	32
168	32
158	26
1154	70
368	42
106	34
82	42
180	28
254	42
566	54
56	32
926	66
670	62
254	30
368	36
90	26
270	34
746	66
426	50
294	46
180	28
236	36
262	38
392	44
142	22
312	48
954	58
138	42
688	58
326	38
886	62
108	28
138	34
42	14
196	28
118	22
1154	66
458	54
416	40
444	52
66	18
32	24
550	62
452	52
230	42
374	50
258	42
1170	70
274	30
204	40
258	30
156	36
348	48
586	42
484	56
218	30
566	54
194	38
74	26
64	28
788	72
726	46
19	7
264	36
308	48
1316	72
170	34
774	48
522	38
196	32
686	56
452	52
1086	80
714	56
112	32
648	40
816	66
252	44
860	64
180	40
342	46
194	38
174	30
110	26
1136	84
206	26
394	54
188	44
166	34
382	36
472	60
310	38
174	30
104	28
38	30
406	48
258	34
146	30
346	32
550	52
342	38
518	54
924	60
262	34
750	58
522	62
194	30
348	28
534	54
44	16
484	64
410	30
178	34
46	26
222	30
110	34
124	28
124	28
1182	78
870	70
160	32
44	28
1714	90
190	34
762	62
422	42
288	34
374	48
248	44
336	48
414	46
234	46
270	26
128	20
288	42
448	40
442	46
252	40
442	50
242	36
596	48
930	62
322	38
336	48
268	36
672	44
102	26
374	46
268	32
252	52
322	34
786	66
480	52
506	36
152	28
264	32
492	56
270	36
1180	80
676	52
172	28
218	36
104	32
178	30
128	32
516	60
674	62
2224	102
126	26
66	22
646	44
256	32
186	34
62	22
436	36
246	34
212	28
280	32
290	42
1980	104
276	52
350	40
464	52
70	22
118	30
574	62
336	38
222	34
166	22
72	24
198	26
334	52
260	34
574	64
284	44
336	32
222	26
354	46
384	44
886	58
546	54
320	44
744	48
292	52
466	46
1296	72
66	26
710	58
452	48
102	18
152	30
356	52
200	24
404	60
362	42
192	42
228	36
1588	84
136	28
268	48
464	58
216	32
640	52
174	38
1034	70
314	42
106	38
82	34
96	28
142	42
128	40
174	30
120	20
424	48
282	42
496	52
472	48
52	20
132	32
254	54
362	44
84	24
302	38
682	62
274	54
174	38
