module gitlab.com/simon.bos/protoc-gen-go-rsn

go 1.20

require (
	github.com/iancoleman/strcase v0.3.0
	google.golang.org/genproto/googleapis/api v0.0.0-20230822172742-b8732ec3820d
	google.golang.org/protobuf v1.31.0
)

require google.golang.org/genproto v0.0.0-20230822172742-b8732ec3820d // indirect
