"cadastroPermitido","capitalSocial","cnpj","dataCadastro","horaCadastro"
"true","43515286344.15","61.532.644/0001-15","2020-08-05","21:01:40.932"
"cadastroPermitido","capitalSocial","cnpj","dataCadastro","horaCadastro"
"true","43515286344.15","61.532.644/0001-15","2020-08-06","10:06:00.670"
"cadastroPermitido","capitalSocial","cnpj","dataCadastro","horaCadastro"
"false","5000.00","08.733.744/0001-27","2020-08-06","10:08:06.233"
"cadastroPermitido","capitalSocial","cnpj","dataCadastro","horaCadastro"
"false","5000.00","08.733.744/0001-27","2020-08-06","11:11:33.345"
"cadastroPermitido","capitalSocial","cnpj","dataCadastro","horaCadastro"
"false","5000.00","08.733.744/0001-27","2020-08-06","11:12:02.226"
"cadastroPermitido","capitalSocial","cnpj","dataCadastro","horaCadastro"
"false","5000.00","08.733.744/0001-27","2020-08-06","11:12:26.482"
"cadastroPermitido","capitalSocial","cnpj","dataCadastro","horaCadastro"
"false","5000.00","08.733.744/0001-27","2020-08-06","11:39:15.893"
"cadastroPermitido","capitalSocial","cnpj","dataCadastro","horaCadastro"
"true","43515286344.15","61.532.644/0001-15","2020-08-06","12:03:26.590"
"cadastroPermitido","capitalSocial","cnpj","dataCadastro","horaCadastro"
"true","43515286344.15","61.532.644/0001-15","2020-08-06","12:05:20.301"
"cadastroPermitido","capitalSocial","cnpj","dataCadastro","horaCadastro"
"true","43515286344.15","61.532.644/0001-15","2020-08-06","12:06:18.422"
