-------------------------------------------------------------------------------
Test set: br.com.appcamaecafe.services.ProprietarioServiceTest
-------------------------------------------------------------------------------
Tests run: 4, Failures: 0, Errors: 0, Skipped: 0, Time elapsed: 1.084 s - in br.com.appcamaecafe.services.ProprietarioServiceTest
