+-------------------------------------------------------------------------------------------------------------------------------------------------------------------------------------------------------------------------------------------------------------------------------------------------------------------+
; Legal Partition Candidates                                                                                                                                                                                                                                                                                        ;
+--------------------------------------------------------------------------------------------------------------+-------+----------------+--------------+----------------+--------+-----------------+---------------+-----------------+-------+----------------+--------------+------------------+-------------------+
; Hierarchy                                                                                                    ; Input ; Constant Input ; Unused Input ; Floating Input ; Output ; Constant Output ; Unused Output ; Floating Output ; Bidir ; Constant Bidir ; Unused Bidir ; Input only Bidir ; Output only Bidir ;
+--------------------------------------------------------------------------------------------------------------+-------+----------------+--------------+----------------+--------+-----------------+---------------+-----------------+-------+----------------+--------------+------------------+-------------------+
; codec|Audio_Out_Serializer|Audio_Out_Right_Channel_FIFO|Sync_FIFO|auto_generated|dpfifo|wr_ptr               ; 3     ; 0              ; 0            ; 0              ; 7      ; 0               ; 0             ; 0               ; 0     ; 0              ; 0            ; 0                ; 0                 ;
; codec|Audio_Out_Serializer|Audio_Out_Right_Channel_FIFO|Sync_FIFO|auto_generated|dpfifo|usedw_counter        ; 4     ; 0              ; 0            ; 0              ; 7      ; 0               ; 0             ; 0               ; 0     ; 0              ; 0            ; 0                ; 0                 ;
; codec|Audio_Out_Serializer|Audio_Out_Right_Channel_FIFO|Sync_FIFO|auto_generated|dpfifo|rd_ptr_msb           ; 3     ; 0              ; 0            ; 0              ; 6      ; 0               ; 0             ; 0               ; 0     ; 0              ; 0            ; 0                ; 0                 ;
; codec|Audio_Out_Serializer|Audio_Out_Right_Channel_FIFO|Sync_FIFO|auto_generated|dpfifo|three_comparison     ; 14    ; 7              ; 0            ; 7              ; 1      ; 7               ; 7             ; 7               ; 0     ; 0              ; 0            ; 0                ; 0                 ;
; codec|Audio_Out_Serializer|Audio_Out_Right_Channel_FIFO|Sync_FIFO|auto_generated|dpfifo|almost_full_comparer ; 14    ; 7              ; 0            ; 7              ; 1      ; 7               ; 7             ; 7               ; 0     ; 0              ; 0            ; 0                ; 0                 ;
; codec|Audio_Out_Serializer|Audio_Out_Right_Channel_FIFO|Sync_FIFO|auto_generated|dpfifo|FIFOram              ; 40    ; 0              ; 0            ; 0              ; 24     ; 0               ; 0             ; 0               ; 0     ; 0              ; 0            ; 0                ; 0                 ;
; codec|Audio_Out_Serializer|Audio_Out_Right_Channel_FIFO|Sync_FIFO|auto_generated|dpfifo                      ; 28    ; 0              ; 0            ; 0              ; 33     ; 0               ; 0             ; 0               ; 0     ; 0              ; 0            ; 0                ; 0                 ;
; codec|Audio_Out_Serializer|Audio_Out_Right_Channel_FIFO|Sync_FIFO|auto_generated                             ; 28    ; 0              ; 0            ; 0              ; 33     ; 0               ; 0             ; 0               ; 0     ; 0              ; 0            ; 0                ; 0                 ;
; codec|Audio_Out_Serializer|Audio_Out_Right_Channel_FIFO                                                      ; 28    ; 0              ; 0            ; 0              ; 33     ; 0               ; 0             ; 0               ; 0     ; 0              ; 0            ; 0                ; 0                 ;
; codec|Audio_Out_Serializer|Audio_Out_Left_Channel_FIFO|Sync_FIFO|auto_generated|dpfifo|wr_ptr                ; 3     ; 0              ; 0            ; 0              ; 7      ; 0               ; 0             ; 0               ; 0     ; 0              ; 0            ; 0                ; 0                 ;
; codec|Audio_Out_Serializer|Audio_Out_Left_Channel_FIFO|Sync_FIFO|auto_generated|dpfifo|usedw_counter         ; 4     ; 0              ; 0            ; 0              ; 7      ; 0               ; 0             ; 0               ; 0     ; 0              ; 0            ; 0                ; 0                 ;
; codec|Audio_Out_Serializer|Audio_Out_Left_Channel_FIFO|Sync_FIFO|auto_generated|dpfifo|rd_ptr_msb            ; 3     ; 0              ; 0            ; 0              ; 6      ; 0               ; 0             ; 0               ; 0     ; 0              ; 0            ; 0                ; 0                 ;
; codec|Audio_Out_Serializer|Audio_Out_Left_Channel_FIFO|Sync_FIFO|auto_generated|dpfifo|three_comparison      ; 14    ; 7              ; 0            ; 7              ; 1      ; 7               ; 7             ; 7               ; 0     ; 0              ; 0            ; 0                ; 0                 ;
; codec|Audio_Out_Serializer|Audio_Out_Left_Channel_FIFO|Sync_FIFO|auto_generated|dpfifo|almost_full_comparer  ; 14    ; 7              ; 0            ; 7              ; 1      ; 7               ; 7             ; 7               ; 0     ; 0              ; 0            ; 0                ; 0                 ;
; codec|Audio_Out_Serializer|Audio_Out_Left_Channel_FIFO|Sync_FIFO|auto_generated|dpfifo|FIFOram               ; 40    ; 0              ; 0            ; 0              ; 24     ; 0               ; 0             ; 0               ; 0     ; 0              ; 0            ; 0                ; 0                 ;
; codec|Audio_Out_Serializer|Audio_Out_Left_Channel_FIFO|Sync_FIFO|auto_generated|dpfifo                       ; 28    ; 0              ; 0            ; 0              ; 33     ; 0               ; 0             ; 0               ; 0     ; 0              ; 0            ; 0                ; 0                 ;
; codec|Audio_Out_Serializer|Audio_Out_Left_Channel_FIFO|Sync_FIFO|auto_generated                              ; 28    ; 0              ; 0            ; 0              ; 33     ; 0               ; 0             ; 0               ; 0     ; 0              ; 0            ; 0                ; 0                 ;
; codec|Audio_Out_Serializer|Audio_Out_Left_Channel_FIFO                                                       ; 28    ; 0              ; 0            ; 0              ; 33     ; 0               ; 0             ; 0               ; 0     ; 0              ; 0            ; 0                ; 0                 ;
; codec|Audio_Out_Serializer                                                                                   ; 56    ; 0              ; 1            ; 0              ; 17     ; 0               ; 0             ; 0               ; 0     ; 0              ; 0            ; 0                ; 0                 ;
; codec|Audio_In_Deserializer|Audio_In_Right_Channel_FIFO|Sync_FIFO|auto_generated|dpfifo|wr_ptr               ; 3     ; 0              ; 0            ; 0              ; 7      ; 0               ; 0             ; 0               ; 0     ; 0              ; 0            ; 0                ; 0                 ;
; codec|Audio_In_Deserializer|Audio_In_Right_Channel_FIFO|Sync_FIFO|auto_generated|dpfifo|usedw_counter        ; 4     ; 0              ; 0            ; 0              ; 7      ; 0               ; 0             ; 0               ; 0     ; 0              ; 0            ; 0                ; 0                 ;
; codec|Audio_In_Deserializer|Audio_In_Right_Channel_FIFO|Sync_FIFO|auto_generated|dpfifo|rd_ptr_msb           ; 3     ; 0              ; 0            ; 0              ; 6      ; 0               ; 0             ; 0               ; 0     ; 0              ; 0            ; 0                ; 0                 ;
; codec|Audio_In_Deserializer|Audio_In_Right_Channel_FIFO|Sync_FIFO|auto_generated|dpfifo|three_comparison     ; 14    ; 7              ; 0            ; 7              ; 1      ; 7               ; 7             ; 7               ; 0     ; 0              ; 0            ; 0                ; 0                 ;
; codec|Audio_In_Deserializer|Audio_In_Right_Channel_FIFO|Sync_FIFO|auto_generated|dpfifo|almost_full_comparer ; 14    ; 7              ; 0            ; 7              ; 1      ; 7               ; 7             ; 7               ; 0     ; 0              ; 0            ; 0                ; 0                 ;
; codec|Audio_In_Deserializer|Audio_In_Right_Channel_FIFO|Sync_FIFO|auto_generated|dpfifo|FIFOram              ; 40    ; 0              ; 0            ; 0              ; 24     ; 0               ; 0             ; 0               ; 0     ; 0              ; 0            ; 0                ; 0                 ;
; codec|Audio_In_Deserializer|Audio_In_Right_Channel_FIFO|Sync_FIFO|auto_generated|dpfifo                      ; 28    ; 0              ; 0            ; 0              ; 33     ; 0               ; 0             ; 0               ; 0     ; 0              ; 0            ; 0                ; 0                 ;
; codec|Audio_In_Deserializer|Audio_In_Right_Channel_FIFO|Sync_FIFO|auto_generated                             ; 28    ; 0              ; 0            ; 0              ; 33     ; 0               ; 0             ; 0               ; 0     ; 0              ; 0            ; 0                ; 0                 ;
; codec|Audio_In_Deserializer|Audio_In_Right_Channel_FIFO                                                      ; 28    ; 0              ; 0            ; 0              ; 33     ; 0               ; 0             ; 0               ; 0     ; 0              ; 0            ; 0                ; 0                 ;
; codec|Audio_In_Deserializer|Audio_In_Left_Channel_FIFO|Sync_FIFO|auto_generated|dpfifo|wr_ptr                ; 3     ; 0              ; 0            ; 0              ; 7      ; 0               ; 0             ; 0               ; 0     ; 0              ; 0            ; 0                ; 0                 ;
; codec|Audio_In_Deserializer|Audio_In_Left_Channel_FIFO|Sync_FIFO|auto_generated|dpfifo|usedw_counter         ; 4     ; 0              ; 0            ; 0              ; 7      ; 0               ; 0             ; 0               ; 0     ; 0              ; 0            ; 0                ; 0                 ;
; codec|Audio_In_Deserializer|Audio_In_Left_Channel_FIFO|Sync_FIFO|auto_generated|dpfifo|rd_ptr_msb            ; 3     ; 0              ; 0            ; 0              ; 6      ; 0               ; 0             ; 0               ; 0     ; 0              ; 0            ; 0                ; 0                 ;
; codec|Audio_In_Deserializer|Audio_In_Left_Channel_FIFO|Sync_FIFO|auto_generated|dpfifo|three_comparison      ; 14    ; 7              ; 0            ; 7              ; 1      ; 7               ; 7             ; 7               ; 0     ; 0              ; 0            ; 0                ; 0                 ;
; codec|Audio_In_Deserializer|Audio_In_Left_Channel_FIFO|Sync_FIFO|auto_generated|dpfifo|almost_full_comparer  ; 14    ; 7              ; 0            ; 7              ; 1      ; 7               ; 7             ; 7               ; 0     ; 0              ; 0            ; 0                ; 0                 ;
; codec|Audio_In_Deserializer|Audio_In_Left_Channel_FIFO|Sync_FIFO|auto_generated|dpfifo|FIFOram               ; 40    ; 0              ; 0            ; 0              ; 24     ; 0               ; 0             ; 0               ; 0     ; 0              ; 0            ; 0                ; 0                 ;
; codec|Audio_In_Deserializer|Audio_In_Left_Channel_FIFO|Sync_FIFO|auto_generated|dpfifo                       ; 28    ; 0              ; 0            ; 0              ; 33     ; 0               ; 0             ; 0               ; 0     ; 0              ; 0            ; 0                ; 0                 ;
; codec|Audio_In_Deserializer|Audio_In_Left_Channel_FIFO|Sync_FIFO|auto_generated                              ; 28    ; 0              ; 0            ; 0              ; 33     ; 0               ; 0             ; 0               ; 0     ; 0              ; 0            ; 0                ; 0                 ;
; codec|Audio_In_Deserializer|Audio_In_Left_Channel_FIFO                                                       ; 28    ; 0              ; 0            ; 0              ; 33     ; 0               ; 0             ; 0               ; 0     ; 0              ; 0            ; 0                ; 0                 ;
; codec|Audio_In_Deserializer|Audio_Out_Bit_Counter                                                            ; 6     ; 0              ; 1            ; 0              ; 1      ; 0               ; 0             ; 0               ; 0     ; 0              ; 0            ; 0                ; 0                 ;
; codec|Audio_In_Deserializer                                                                                  ; 10    ; 0              ; 0            ; 0              ; 64     ; 0               ; 0             ; 0               ; 0     ; 0              ; 0            ; 0                ; 0                 ;
; codec|DAC_Left_Right_Clock_Edges                                                                             ; 3     ; 0              ; 1            ; 0              ; 2      ; 0               ; 0             ; 0               ; 0     ; 0              ; 0            ; 0                ; 0                 ;
; codec|ADC_Left_Right_Clock_Edges                                                                             ; 3     ; 0              ; 1            ; 0              ; 2      ; 0               ; 0             ; 0               ; 0     ; 0              ; 0            ; 0                ; 0                 ;
; codec|Bit_Clock_Edges                                                                                        ; 3     ; 0              ; 1            ; 0              ; 2      ; 0               ; 0             ; 0               ; 0     ; 0              ; 0            ; 0                ; 0                 ;
; codec                                                                                                        ; 56    ; 0              ; 0            ; 0              ; 51     ; 0               ; 0             ; 0               ; 0     ; 0              ; 0            ; 0                ; 0                 ;
; cfg|I2C_Controller                                                                                           ; 21    ; 2              ; 0            ; 2              ; 12     ; 2               ; 2             ; 2               ; 1     ; 0              ; 0            ; 0                ; 0                 ;
; cfg|Auto_Initialize                                                                                          ; 5     ; 1              ; 0            ; 1              ; 13     ; 1               ; 1             ; 1               ; 0     ; 0              ; 0            ; 0                ; 0                 ;
; cfg|Clock_Generator_400KHz                                                                                   ; 3     ; 0              ; 0            ; 0              ; 3      ; 0               ; 0             ; 0               ; 0     ; 0              ; 0            ; 0                ; 0                 ;
; cfg                                                                                                          ; 2     ; 0              ; 0            ; 0              ; 1      ; 0               ; 0             ; 0               ; 1     ; 0              ; 0            ; 0                ; 0                 ;
; my_clock_gen|DE_Clock_Generator_Audio|auto_generated                                                         ; 3     ; 5              ; 1            ; 5              ; 7      ; 5               ; 5             ; 5               ; 0     ; 0              ; 0            ; 0                ; 0                 ;
; my_clock_gen                                                                                                 ; 2     ; 0              ; 0            ; 0              ; 1      ; 0               ; 0             ; 0               ; 0     ; 0              ; 0            ; 0                ; 0                 ;
; out_ch_selection                                                                                             ; 32    ; 1              ; 0            ; 1              ; 48     ; 1               ; 1             ; 1               ; 0     ; 0              ; 0            ; 0                ; 0                 ;
; ch_selection                                                                                                 ; 105   ; 1              ; 1            ; 1              ; 24     ; 1               ; 1             ; 1               ; 0     ; 0              ; 0            ; 0                ; 0                 ;
; vol_selector                                                                                                 ; 4     ; 3              ; 0            ; 3              ; 24     ; 3               ; 3             ; 3               ; 0     ; 0              ; 0            ; 0                ; 0                 ;
; display_volume|digit                                                                                         ; 4     ; 0              ; 0            ; 0              ; 7      ; 0               ; 0             ; 0               ; 0     ; 0              ; 0            ; 0                ; 0                 ;
; display_volume                                                                                               ; 4     ; 6              ; 0            ; 6              ; 14     ; 6               ; 6             ; 6               ; 0     ; 0              ; 0            ; 0                ; 0                 ;
; click_counter                                                                                                ; 3     ; 1              ; 0            ; 1              ; 4      ; 1               ; 1             ; 1               ; 0     ; 0              ; 0            ; 0                ; 0                 ;
; filter_right|reg_p5_past                                                                                     ; 39    ; 0              ; 0            ; 0              ; 36     ; 0               ; 0             ; 0               ; 0     ; 0              ; 0            ; 0                ; 0                 ;
; filter_right|reg_p4_past                                                                                     ; 39    ; 0              ; 0            ; 0              ; 36     ; 0               ; 0             ; 0               ; 0     ; 0              ; 0            ; 0                ; 0                 ;
; filter_right|reg_p3_past                                                                                     ; 39    ; 0              ; 0            ; 0              ; 36     ; 0               ; 0             ; 0               ; 0     ; 0              ; 0            ; 0                ; 0                 ;
; filter_right|reg_p2_past                                                                                     ; 39    ; 0              ; 0            ; 0              ; 36     ; 0               ; 0             ; 0               ; 0     ; 0              ; 0            ; 0                ; 0                 ;
; filter_right|reg_p1_past                                                                                     ; 39    ; 0              ; 0            ; 0              ; 36     ; 0               ; 0             ; 0               ; 0     ; 0              ; 0            ; 0                ; 0                 ;
; filter_right|reg_q1_past                                                                                     ; 39    ; 0              ; 0            ; 0              ; 36     ; 0               ; 0             ; 0               ; 0     ; 0              ; 0            ; 0                ; 0                 ;
; filter_right|reg19                                                                                           ; 39    ; 0              ; 0            ; 0              ; 36     ; 0               ; 0             ; 0               ; 0     ; 0              ; 0            ; 0                ; 0                 ;
; filter_right|reg18                                                                                           ; 39    ; 0              ; 0            ; 0              ; 36     ; 0               ; 0             ; 0               ; 0     ; 0              ; 0            ; 0                ; 0                 ;
; filter_right|reg17                                                                                           ; 39    ; 0              ; 0            ; 0              ; 36     ; 0               ; 0             ; 0               ; 0     ; 0              ; 0            ; 0                ; 0                 ;
; filter_right|reg16                                                                                           ; 39    ; 0              ; 0            ; 0              ; 36     ; 0               ; 0             ; 0               ; 0     ; 0              ; 0            ; 0                ; 0                 ;
; filter_right|reg15                                                                                           ; 39    ; 0              ; 0            ; 0              ; 36     ; 0               ; 0             ; 0               ; 0     ; 0              ; 0            ; 0                ; 0                 ;
; filter_right|reg14                                                                                           ; 39    ; 0              ; 0            ; 0              ; 36     ; 0               ; 0             ; 0               ; 0     ; 0              ; 0            ; 0                ; 0                 ;
; filter_right|reg13                                                                                           ; 39    ; 0              ; 0            ; 0              ; 36     ; 0               ; 0             ; 0               ; 0     ; 0              ; 0            ; 0                ; 0                 ;
; filter_right|reg12                                                                                           ; 39    ; 0              ; 0            ; 0              ; 36     ; 0               ; 0             ; 0               ; 0     ; 0              ; 0            ; 0                ; 0                 ;
; filter_right|reg11                                                                                           ; 39    ; 0              ; 0            ; 0              ; 36     ; 0               ; 0             ; 0               ; 0     ; 0              ; 0            ; 0                ; 0                 ;
; filter_right|reg10                                                                                           ; 39    ; 0              ; 0            ; 0              ; 36     ; 0               ; 0             ; 0               ; 0     ; 0              ; 0            ; 0                ; 0                 ;
; filter_right|reg9                                                                                            ; 39    ; 0              ; 0            ; 0              ; 36     ; 0               ; 0             ; 0               ; 0     ; 0              ; 0            ; 0                ; 0                 ;
; filter_right|reg8                                                                                            ; 39    ; 0              ; 0            ; 0              ; 36     ; 0               ; 0             ; 0               ; 0     ; 0              ; 0            ; 0                ; 0                 ;
; filter_right|reg7                                                                                            ; 39    ; 0              ; 0            ; 0              ; 36     ; 0               ; 0             ; 0               ; 0     ; 0              ; 0            ; 0                ; 0                 ;
; filter_right|reg6                                                                                            ; 39    ; 0              ; 0            ; 0              ; 36     ; 0               ; 0             ; 0               ; 0     ; 0              ; 0            ; 0                ; 0                 ;
; filter_right|reg5                                                                                            ; 39    ; 0              ; 0            ; 0              ; 36     ; 0               ; 0             ; 0               ; 0     ; 0              ; 0            ; 0                ; 0                 ;
; filter_right|reg4                                                                                            ; 39    ; 0              ; 0            ; 0              ; 36     ; 0               ; 0             ; 0               ; 0     ; 0              ; 0            ; 0                ; 0                 ;
; filter_right|reg3                                                                                            ; 39    ; 0              ; 0            ; 0              ; 36     ; 0               ; 0             ; 0               ; 0     ; 0              ; 0            ; 0                ; 0                 ;
; filter_right|reg2                                                                                            ; 39    ; 0              ; 0            ; 0              ; 36     ; 0               ; 0             ; 0               ; 0     ; 0              ; 0            ; 0                ; 0                 ;
; filter_right|reg1                                                                                            ; 39    ; 0              ; 0            ; 0              ; 36     ; 0               ; 0             ; 0               ; 0     ; 0              ; 0            ; 0                ; 0                 ;
; filter_right|addend2_mux                                                                                     ; 689   ; 252            ; 0            ; 252            ; 36     ; 252             ; 252           ; 252             ; 0     ; 0              ; 0            ; 0                ; 0                 ;
; filter_right|addend1_mux                                                                                     ; 689   ; 0              ; 0            ; 0              ; 36     ; 0               ; 0             ; 0               ; 0     ; 0              ; 0            ; 0                ; 0                 ;
; filter_right|coeff_mux                                                                                       ; 5     ; 0              ; 0            ; 0              ; 36     ; 0               ; 0             ; 0               ; 0     ; 0              ; 0            ; 0                ; 0                 ;
; filter_right                                                                                                 ; 32    ; 0              ; 5            ; 0              ; 24     ; 0               ; 0             ; 0               ; 0     ; 0              ; 0            ; 0                ; 0                 ;
; filter_left|reg_p5_past                                                                                      ; 39    ; 0              ; 0            ; 0              ; 36     ; 0               ; 0             ; 0               ; 0     ; 0              ; 0            ; 0                ; 0                 ;
; filter_left|reg_p4_past                                                                                      ; 39    ; 0              ; 0            ; 0              ; 36     ; 0               ; 0             ; 0               ; 0     ; 0              ; 0            ; 0                ; 0                 ;
; filter_left|reg_p3_past                                                                                      ; 39    ; 0              ; 0            ; 0              ; 36     ; 0               ; 0             ; 0               ; 0     ; 0              ; 0            ; 0                ; 0                 ;
; filter_left|reg_p2_past                                                                                      ; 39    ; 0              ; 0            ; 0              ; 36     ; 0               ; 0             ; 0               ; 0     ; 0              ; 0            ; 0                ; 0                 ;
; filter_left|reg_p1_past                                                                                      ; 39    ; 0              ; 0            ; 0              ; 36     ; 0               ; 0             ; 0               ; 0     ; 0              ; 0            ; 0                ; 0                 ;
; filter_left|reg_q1_past                                                                                      ; 39    ; 0              ; 0            ; 0              ; 36     ; 0               ; 0             ; 0               ; 0     ; 0              ; 0            ; 0                ; 0                 ;
; filter_left|reg19                                                                                            ; 39    ; 0              ; 0            ; 0              ; 36     ; 0               ; 0             ; 0               ; 0     ; 0              ; 0            ; 0                ; 0                 ;
; filter_left|reg18                                                                                            ; 39    ; 0              ; 0            ; 0              ; 36     ; 0               ; 0             ; 0               ; 0     ; 0              ; 0            ; 0                ; 0                 ;
; filter_left|reg17                                                                                            ; 39    ; 0              ; 0            ; 0              ; 36     ; 0               ; 0             ; 0               ; 0     ; 0              ; 0            ; 0                ; 0                 ;
; filter_left|reg16                                                                                            ; 39    ; 0              ; 0            ; 0              ; 36     ; 0               ; 0             ; 0               ; 0     ; 0              ; 0            ; 0                ; 0                 ;
; filter_left|reg15                                                                                            ; 39    ; 0              ; 0            ; 0              ; 36     ; 0               ; 0             ; 0               ; 0     ; 0              ; 0            ; 0                ; 0                 ;
; filter_left|reg14                                                                                            ; 39    ; 0              ; 0            ; 0              ; 36     ; 0               ; 0             ; 0               ; 0     ; 0              ; 0            ; 0                ; 0                 ;
; filter_left|reg13                                                                                            ; 39    ; 0              ; 0            ; 0              ; 36     ; 0               ; 0             ; 0               ; 0     ; 0              ; 0            ; 0                ; 0                 ;
; filter_left|reg12                                                                                            ; 39    ; 0              ; 0            ; 0              ; 36     ; 0               ; 0             ; 0               ; 0     ; 0              ; 0            ; 0                ; 0                 ;
; filter_left|reg11                                                                                            ; 39    ; 0              ; 0            ; 0              ; 36     ; 0               ; 0             ; 0               ; 0     ; 0              ; 0            ; 0                ; 0                 ;
; filter_left|reg10                                                                                            ; 39    ; 0              ; 0            ; 0              ; 36     ; 0               ; 0             ; 0               ; 0     ; 0              ; 0            ; 0                ; 0                 ;
; filter_left|reg9                                                                                             ; 39    ; 0              ; 0            ; 0              ; 36     ; 0               ; 0             ; 0               ; 0     ; 0              ; 0            ; 0                ; 0                 ;
; filter_left|reg8                                                                                             ; 39    ; 0              ; 0            ; 0              ; 36     ; 0               ; 0             ; 0               ; 0     ; 0              ; 0            ; 0                ; 0                 ;
; filter_left|reg7                                                                                             ; 39    ; 0              ; 0            ; 0              ; 36     ; 0               ; 0             ; 0               ; 0     ; 0              ; 0            ; 0                ; 0                 ;
; filter_left|reg6                                                                                             ; 39    ; 0              ; 0            ; 0              ; 36     ; 0               ; 0             ; 0               ; 0     ; 0              ; 0            ; 0                ; 0                 ;
; filter_left|reg5                                                                                             ; 39    ; 0              ; 0            ; 0              ; 36     ; 0               ; 0             ; 0               ; 0     ; 0              ; 0            ; 0                ; 0                 ;
; filter_left|reg4                                                                                             ; 39    ; 0              ; 0            ; 0              ; 36     ; 0               ; 0             ; 0               ; 0     ; 0              ; 0            ; 0                ; 0                 ;
; filter_left|reg3                                                                                             ; 39    ; 0              ; 0            ; 0              ; 36     ; 0               ; 0             ; 0               ; 0     ; 0              ; 0            ; 0                ; 0                 ;
; filter_left|reg2                                                                                             ; 39    ; 0              ; 0            ; 0              ; 36     ; 0               ; 0             ; 0               ; 0     ; 0              ; 0            ; 0                ; 0                 ;
; filter_left|reg1                                                                                             ; 39    ; 0              ; 0            ; 0              ; 36     ; 0               ; 0             ; 0               ; 0     ; 0              ; 0            ; 0                ; 0                 ;
; filter_left|addend2_mux                                                                                      ; 689   ; 252            ; 0            ; 252            ; 36     ; 252             ; 252           ; 252             ; 0     ; 0              ; 0            ; 0                ; 0                 ;
; filter_left|addend1_mux                                                                                      ; 689   ; 0              ; 0            ; 0              ; 36     ; 0               ; 0             ; 0               ; 0     ; 0              ; 0            ; 0                ; 0                 ;
; filter_left|coeff_mux                                                                                        ; 5     ; 0              ; 0            ; 0              ; 36     ; 0               ; 0             ; 0               ; 0     ; 0              ; 0            ; 0                ; 0                 ;
; filter_left                                                                                                  ; 32    ; 0              ; 5            ; 0              ; 24     ; 0               ; 0             ; 0               ; 0     ; 0              ; 0            ; 0                ; 0                 ;
; operations_counter                                                                                           ; 4     ; 2              ; 0            ; 2              ; 6      ; 2               ; 2             ; 2               ; 0     ; 0              ; 0            ; 0                ; 0                 ;
+--------------------------------------------------------------------------------------------------------------+-------+----------------+--------------+----------------+--------+-----------------+---------------+-----------------+-------+----------------+--------------+------------------+-------------------+
